{"text_format":"1","workbook":"xlsx","n_sheets":18,"sheets":["1.Background & Instructions","2.Flow chart of life cycle","3a.User input-Purchasing","3b.User Input-Use&EOL","3c.Alt user input-Purchasing","4.Data comparisons","5a. RESULTS-savings","5b. RESULTS-explanations","6. GRAPHICAL RESULTS-savings","7. Equivalents","8a. Assumptions-Baseline","8b1.Assumptions-EPEATFECdefault","8b2.Assumption-EPEAT tiers","8c.Assumptions-Calculations","8d.EnergyStar CPU-Calcs","8e.EnergyStar monitor-Calcs","8f.EnergyStar notebook-Calcs","9.Revisions"],"not_rendered":{"charts":30,"images":109,"macros":1,"external_links":1,"defined_names":64,"comments":11,"pivot_tables":0},"unopened":[],"bounds":{"document_bytes":16777216,"sheet_cells":100000,"rows_first":2000,"rows_last":500,"rows_between":2000,"halvings":0,"cell_chars":16384,"cell_head_chars":4096},"cells_cut":0,"cells_raw":0,"read":"whole","date_system":"1900"}

{"sheet":"1.Background & Instructions","index":0,"n_rows":43,"n_cols":11,"rows_kept":43,"cut":false,"hidden":false,"merged":[[18,3,18,11],[42,2,42,13],[31,3,31,11],[33,3,33,11],[27,3,27,11],[29,3,29,11],[28,3,28,11],[1,10,1,11],[0,1,0,12],[30,3,30,11],[32,3,32,11],[5,1,5,10],[17,3,17,11],[19,3,19,11],[21,3,21,11],[25,3,25,11],[22,3,22,11],[24,3,24,11],[23,3,23,11],[26,3,26,11],[2,1,2,10],[4,1,4,11],[20,3,20,11]]}
[null,"Electronics Environmental Benefits Calculator -- Version 3.1"]
[null,null,null,null,null,null,null,null,null,null,"2012-07-24"]
[null,"Note, to begin calculations, proceed to Sheet 3a:  \"User Input-Purchasing.\"  "]
[null,"Background"]
[null,"The Electronics Environmental Benefits Calculator is intended to assist institutional purchasers in quantifying the benefits of environmentally sound management of electronic equipment. The calculator estimates the environmental and economic benefits of purchasing environmentally preferable (including EPEAT registered) products, in addition to making improvements in equipment operation and end-of-life management practices. "]
[null,"Best electronic stewardship practices specify product design criteria and management activities based on environmental attributes (e.g., the elimination of toxic chemicals, the use of recycled materials, power consumption) or product management activity (e.g., power management, equipment reuse and recycling). This calculator translates attributes and activities into environmental benefits, including:"]
{"$rows_left_out":38}
{"sheet":"2.Flow chart of life cycle","index":1,"n_rows":3,"n_cols":15,"rows_kept":3,"cut":false,"hidden":false,"merged":[[0,1,0,15],[1,1,1,15]]}
[null,"BACKGROUND INFORMATION"]
[null,"Example schematic showing where the product characteristics and management practices (yellow ovals) fall within the life-cycle of a computer system."]
[null,null,null,null,null,null,null,null,null,null,null,null,null,null," "]

{"sheet":"3a.User input-Purchasing","index":2,"n_rows":41,"n_cols":12,"rows_kept":41,"cut":false,"hidden":false,"merged":[[25,3,25,4],[22,3,22,4],[18,3,18,4],[19,3,19,4],[1,0,1,6],[7,0,7,4],[4,0,4,4],[5,0,5,4],[3,0,3,6],[8,3,8,4],[12,3,12,4],[13,3,13,4],[10,3,10,4],[16,3,16,4],[24,3,24,4]]}
[]
["USER INPUT - GENERAL PURCHASING"]
["INSTRUCTIONS:"]
["Enter information on computer product purchases to calculate the environmental benefits of an EPEAT-registered product compared to a nonregistered product.  If more than one product type is purchased, enter information for up to 3 products (i.e., Product 1, Product 2, etc., as designated below). \n\nTo clear entered data, click the \"RESET\" button.\n\nMore specific purchasing data may optionally be entered in Sheet 3c.  This calculator can also calculate the environmental benefits of equipment use and end-of-life options by entering data in Sheet 3b.   Additional navigation options are provided at the bottom of this Sheet."]
["     Yellow cells indicate mandatory data inputs for each product."]
["     White cells indicate optional data inputs for each product. ",null,null,null,null,null,null,null,null,null,null," "]
{"$rows_left_out":36}
{"sheet":"3b.User Input-Use&EOL","index":3,"n_rows":41,"n_cols":15,"rows_kept":41,"cut":false,"hidden":false,"merged":[[1,0,1,9],[3,0,3,9],[12,3,12,4],[22,0,22,3],[15,5,17,7],[4,0,4,5],[5,0,5,7],[6,3,6,7],[14,5,14,7],[15,0,15,3]]}
[]
["USER INPUT - USE AND END-OF-LIFE MANAGEMENT"]
["INSTRUCTIONS:  "]
["This sheet is OPTIONAL.  Enter information on computers and monitors in use, power management practices, and extending the lifespan to calculate the benefits of enabling power management over the default percentage or extending the life of equipment beyond the default lifespan.  Enter information on the reuse and recycling of computers, monitors, cell phones and mixed loads of electronics to calculate the environmental benefit of reusing and recycling.  For this optional data analysis, enter data into the white fields below.  \n\nTo clear entered data, click the \"RESET\" button.\n\nPurchasing data may be entered in Sheet 3a (general) and Sheet 3c (specific).  Additional navigation options are provided at the bottom of this Sheet."]
[]
["USE AND END-OF-LIFE INFORMATION",null,null,null,null,null,null,null,null,"Note: To completely re-set calculator, be sure Sheet 3a and Sheet 3c are also reset."]
{"$rows_left_out":36}
{"sheet":"3c.Alt user input-Purchasing","index":4,"n_rows":114,"n_cols":12,"rows_kept":114,"cut":false,"hidden":false,"merged":[[0,0,0,7],[2,0,2,7],[25,4,25,5],[4,8,4,9],[6,8,6,9],[10,8,10,9],[4,0,4,5],[5,4,5,5],[39,8,39,9],[43,8,43,9],[72,8,72,9],[45,0,45,5],[51,0,51,5],[60,0,60,5],[65,0,65,5],[78,0,78,5],[84,0,84,5],[93,0,93,5],[98,0,98,5],[10,0,10,5],[12,0,12,5],[18,0,18,5],[27,0,27,5],[32,0,32,5],[43,0,43,5],[76,0,76,5]]}
["USER INPUT - SPECIFIC PURCHASING"]
["INSTRUCTIONS:  "]
["This data sheet is OPTIONAL.  It allows the user to customize EPEAT registration data (i.e., override default values used to calculate benefits from Sheet 3a) for products.  \n\nTo clear entered data, click the \"RESET\" button.\n\nMore general purchasing data must be entered in Sheet 3a to use this Sheet.  This calculator can also calculate the environmental benefits of equipment use and end-of-life options by entering data in Sheet 3b.   Additional navigation options are provided at the bottom of this Sheet."]
[]
["ADDITIONAL PURCHASING INFORMATION",null,null,null,null,null,null,"Note: To completely re-set calculator, be sure Sheet 3a and Sheet 3b are also reset."]
["User Input","Ref","Type","Input data or click answer","Units",null,null,null,"Values used ","Units"]
{"$rows_left_out":109}
{"sheet":"4.Data comparisons","index":5,"n_rows":163,"n_cols":30,"rows_kept":163,"cut":false,"hidden":false,"merged":[[0,0,0,14],[1,0,1,14],[86,18,86,20],[92,18,92,20],[92,21,92,24],[18,21,18,24],[49,18,49,20],[55,18,55,20],[55,21,55,24],[44,18,44,20],[81,18,81,20],[80,11,80,12],[73,16,74,16],[43,13,43,14],[80,13,80,14],[43,9,43,10],[43,11,43,12],[75,13,75,14],[72,13,72,14],[75,11,75,12],[75,9,75,10],[79,2,79,3],[7,18,7,20],[12,18,12,20],[18,18,18,20],[43,2,43,3],[43,5,43,6],[43,7,43,8],[38,5,38,6],[38,7,38,8],[38,9,38,10],[2,0,2,3],[27,16,28,16],[6,2,6,3],[2,5,2,14],[25,5,25,6],[25,7,25,8],[25,9,25,10],[25,11,25,12],[25,13,25,14],[20,5,20,6],[17,2,17,3],[126,7,126,8],[126,9,126,10],[126,11,126,12],[126,13,126,14],[109,5,109,6],[109,7,109,8],[109,9,109,10],[109,11,109,12],[109,13,109,14],[112,5,112,6],[62,13,62,14],[38,11,38,12],[121,5,121,6],[121,7,121,8],[121,9,121,10],[121,11,121,12],[121,13,121,14],[112,7,112,8],[112,9,112,10],[112,11,112,12],[112,13,112,14],[94,13,94,14],[99,5,99,6],[99,7,99,8],[99,9,99,10],[99,11,99,12],[99,13,99,14],[94,5,94,6],[94,7,94,8],[80,5,80,6],[80,7,80,8],[80,9,80,10],[75,5,75,6],[75,7,75,8],[150,5,150,6],[150,7,150,8],[150,9,150,10],[150,11,150,12],[150,13,150,14],[156,5,156,6],[156,7,156,8],[156,9,156,10],[156,11,156,12],[156,13,156,14],[144,5,144,6],[144,7,144,8],[5,16,5,25],[42,16,42,25],[79,16,79,25],[116,16,116,25],[138,9,138,10],[138,11,138,12],[138,13,138,14],[144,9,144,10],[144,11,144,12],[144,13,144,14],[20,7,20,8],[20,9,20,10],[20,11,20,12],[20,13,20,14],[57,13,57,14],[94,9,94,10],[94,11,94,12],[133,7,133,8],[133,13,133,14],[38,13,38,14],[57,5,57,6],[57,7,57,8],[138,7,138,8],[3,5,4,14],[6,5,6,6],[6,7,6,8],[6,9,6,10],[6,11,6,12],[6,13,6,14],[133,5,133,6],[133,9,133,10],[133,11,133,12],[57,9,57,10],[57,11,57,12],[72,5,72,6],[72,7,72,8],[72,9,72,10],[72,11,72,12],[35,7,35,8],[35,9,35,10],[35,11,35,12],[35,13,35,14],[62,5,62,6],[62,7,62,8],[62,9,62,10],[62,11,62,12],[54,2,54,3],[91,2,91,3],[3,0,3,3],[42,2,42,3],[138,5,138,6],[5,2,5,3],[35,5,35,6],[126,5,126,6],[80,2,80,3]]}
["DATA COMPARISONS"]
["These tables display the data used by the calculator to calculate benefits.  Data for products and activities entered by the user are displayed in the orange table on the left.  Data for product and activity baselines are displayed in the blue table on the right.  Information in these tables can not be edited."]
[null,null,null,null,null,"REFERENCE ONLY (LINKED TO DATA IN SHEETS 8A, 8B AND 8C)"]
["DATA FROM USER INPUT",null,null,null,"Selected product:","DATA FROM BASELINES"]
["Ref","Criteria/Attribute","Quantity","Units"]
[null,"Purchasing, Product 1",{"$f":"IF(ISTEXT('3c.Alt user input-Purchasing'!$I$7),'3c.Alt user input-Purchasing'!$I$7,IF(ISTEXT('3a.User input-Purchasing'!$H$11),'3a.User input-Purchasing'!$H$11, \"no input given\"))","v":"Please provide in Sheet 3a"},null,null,"Quantity","Units","Quantity","Units","Quantity","Units","Quantity","Units","Quantity","Units",null,"INTERIM CALCULATIONS"]
{"$rows_left_out":158}
{"sheet":"5a. RESULTS-savings","index":6,"n_rows":321,"n_cols":37,"rows_kept":321,"cut":false,"hidden":false,"merged":[[0,0,0,18],[39,10,39,15],[40,10,40,15],[41,10,41,15],[42,10,42,15],[2,4,2,9],[18,4,18,17],[19,0,19,1],[27,10,27,15],[28,10,28,15],[29,10,29,15],[30,10,30,15],[31,10,31,15],[38,10,38,15],[185,35,185,36],[182,20,182,36],[114,20,114,26],[184,29,184,30],[184,27,184,28],[148,20,148,26],[185,33,185,34],[185,31,185,32],[185,29,185,30],[80,20,80,26],[185,21,185,22],[185,25,185,26],[185,23,185,24],[185,27,185,28]]}
["RESULTS - TABLES"]
[]
[null,null,null,null,"Results represent the following user selections:"]
[null,null,null,null,"Purchasing (Sheets 3a and 3c):",null,null,"ID:"]
[null,null,null,null,{"$f":"IF('4.Data comparisons'!$C$6=\"\",\"\",'3c.Alt user input-Purchasing'!$I$8)","v":1},{"$f":"IF('3c.Alt user input-Purchasing'!$I$12=\"Please provide in Sheet 3a\",\"no input\",IF('3c.Alt user input-Purchasing'!$I$12=\"n/a\",\"non EPEAT\",'3c.Alt user input-Purchasing'!$I$12))","v":"no input"},{"$f":"IF('4.Data comparisons'!$C$6=\"Please provide in Sheet 3a\",\"\",'4.Data comparisons'!$C$6)","v":""},{"$f":"IF(ISBLANK('3a.User input-Purchasing'!$D$10),\"no user ID given\",'3a.User input-Purchasing'!$D$10)","v":"no user ID given"}]
[null,null,null,null,{"$f":"IF('4.Data comparisons'!$C$43=\"\",\"\",'3c.Alt user input-Purchasing'!$I$41)","v":1},{"$f":"IF('3c.Alt user input-Purchasing'!$I$45=\"Please provide in Sheet 3a\",\"no input\",IF('3c.Alt user input-Purchasing'!$I$45=\"n/a\",\"non EPEAT\",'3c.Alt user input-Purchasing'!$I$45))","v":"no input"},{"$f":"IF('4.Data comparisons'!$C$43=\"Please provide in Sheet 3a\",\"\",'4.Data comparisons'!$C$43)","v":""},{"$f":"IF(ISBLANK('3a.User input-Purchasing'!$D$16),\"no user ID given\",'3a.User input-Purchasing'!$D$16)","v":"no user ID given"}]
{"$rows_left_out":316}
{"sheet":"5b. RESULTS-explanations","index":7,"n_rows":61,"n_cols":3,"rows_kept":61,"cut":false,"hidden":false,"merged":[[0,0,0,2],[36,0,36,1],[56,11,56,18],[24,11,24,19],[3,11,3,12],[5,11,5,13],[1,0,1,1]]}
["EXPLANATIONS OF SAVINGS CALCULATIONS IN SHEET 5a"]
["Criteria/Attributes/Actions",null,"Metrics"]
["Reference","Description"]
["PURCHASING   ",null,"Benefits calculated for purchasing are based on benefits that might occur as a result of purchasing decisions and thus may have savings in upstream material acquisition, manufacturing, use or end-of-life of the product.  Due to limitations on available data, not all life-cycle phases are accounted for in all benefit categories.\n"]
[null,"Reduced Toxicity","All reduced toxicity calculations compare the user-input purchase data for a unit to a conventional unit.  Hazardous waste savings are included in lifetime savings but not in first year savings; all other reductions in toxicity are included in both lifetime savings and first year savings.\n"]
["E 4.1.1.1","RoHS compliance - Pb, Hg, Cd, Cr6+, PBB, PBDE","Toxic material savings:  Savings are the reduction in the amount of toxic material (e.g., lead) in purchased product compared to conventional unit.\n"]
{"$rows_left_out":56}
{"sheet":"6. GRAPHICAL RESULTS-savings","index":8,"n_rows":333,"n_cols":21,"rows_kept":333,"cut":false,"hidden":false,"merged":[[2,8,2,13],[0,0,0,21]]}
["RESULTS - GRAPHS"]
[]
[null,"Note, benefits shown by life-cycle phase are based on decisions",null,null,null,null,null,null,"Results represent the following user selections:"]
[null,"made in a particular phase.  Thus, they may not be equivalent to  benefits",null,null,null,null,null,null,"Purchasing (Sheets 3a and 3c):",null,null,"ID:"]
[null,"from each life-cycle stage.  For example, purchasing benefits include",null,null,null,null,null,null,{"$f":"IF('4.Data comparisons'!$C$6=\"\",\"\",'3c.Alt user input-Purchasing'!$I$8)","v":1},{"$f":"IF('3c.Alt user input-Purchasing'!$I$12=\"Please provide in Sheet 3a\",\"no input\",IF('3c.Alt user input-Purchasing'!$I$12=\"n/a\",\"non EPEAT\",'3c.Alt user input-Purchasing'!$I$12))","v":"no input"},{"$f":"IF('4.Data comparisons'!$C$6=\"Please provide in Sheet 3a\",\"\",'4.Data comparisons'!$C$6)","v":""},{"$f":"IF(ISBLANK('3a.User input-Purchasing'!$D$10),\"no user ID given\",'3a.User input-Purchasing'!$D$10)","v":"no user ID given"}]
[null,"energy savings from the future use of the purchased product, and use ",null,null,null,null,null,null,{"$f":"IF('4.Data comparisons'!$C$43=\"\",\"\",'3c.Alt user input-Purchasing'!$I$41)","v":1},{"$f":"IF('3c.Alt user input-Purchasing'!$I$45=\"Please provide in Sheet 3a\",\"no input\",IF('3c.Alt user input-Purchasing'!$I$45=\"n/a\",\"non EPEAT\",'3c.Alt user input-Purchasing'!$I$45))","v":"no input"},{"$f":"IF('4.Data comparisons'!$C$43=\"Please provide in Sheet 3a\",\"\",'4.Data comparisons'!$C$43)","v":""},{"$f":"IF(ISBLANK('3a.User input-Purchasing'!$D$16),\"no user ID given\",'3a.User input-Purchasing'!$D$16)","v":"no user ID given"}]
{"$rows_left_out":328}
{"sheet":"7. Equivalents","index":9,"n_rows":48,"n_cols":10,"rows_kept":48,"cut":false,"hidden":false,"merged":[[39,4,39,7],[37,8,37,10],[38,4,38,7],[38,8,39,10],[38,1,39,2],[36,1,36,2],[0,0,0,10],[1,0,1,10],[37,1,37,2],[36,3,36,7],[37,4,37,7],[36,8,36,10],[2,3,2,8],[40,4,40,7],[40,8,40,10],[47,1,47,2],[47,4,47,7],[47,8,47,10],[43,8,43,10],[43,4,43,7],[41,1,41,2],[41,4,41,7],[41,8,41,10],[45,1,45,2],[45,4,45,7],[45,8,45,10],[43,1,43,2],[40,1,40,2],[42,8,42,10],[42,4,42,7],[42,1,42,2],[46,1,46,2],[46,4,46,7],[46,8,46,10],[44,1,44,2],[44,4,44,7],[44,8,44,10]]}
["RESULTS - EQUIVALENCIES"]
[]
[null,null,null,"Results represent the following user selections:"]
[null,null,null,"Purchasing (Sheets 3a and 3c):",null,null,"ID:"]
[null,null,null,{"$f":"IF('4.Data comparisons'!$C$6=\"\",\"\",'3c.Alt user input-Purchasing'!$I$8)","v":1},{"$f":"IF('3c.Alt user input-Purchasing'!$I$12=\"Please provide in Sheet 3a\",\"no input\",IF('3c.Alt user input-Purchasing'!$I$12=\"n/a\",\"non EPEAT\",'3c.Alt user input-Purchasing'!$I$12))","v":"no input"},{"$f":"IF('4.Data comparisons'!$C$6=\"Please provide in Sheet 3a\",\"\",'4.Data comparisons'!$C$6)","v":""},{"$f":"IF(ISBLANK('3a.User input-Purchasing'!$D$10),\"no user ID given\",'3a.User input-Purchasing'!$D$10)","v":"no user ID given"}]
[null,null,null,{"$f":"IF('4.Data comparisons'!$C$43=\"\",\"\",'3c.Alt user input-Purchasing'!$I$41)","v":1},{"$f":"IF('3c.Alt user input-Purchasing'!$I$45=\"Please provide in Sheet 3a\",\"no input\",IF('3c.Alt user input-Purchasing'!$I$45=\"n/a\",\"non EPEAT\",'3c.Alt user input-Purchasing'!$I$45))","v":"no input"},{"$f":"IF('4.Data comparisons'!$C$43=\"Please provide in Sheet 3a\",\"\",'4.Data comparisons'!$C$43)","v":""},{"$f":"IF(ISBLANK('3a.User input-Purchasing'!$D$16),\"no user ID given\",'3a.User input-Purchasing'!$D$16)","v":"no user ID given"}]
{"$rows_left_out":43}
{"sheet":"8a. Assumptions-Baseline","index":10,"n_rows":264,"n_cols":7,"rows_kept":264,"cut":false,"hidden":false,"merged":[[270,0,270,6],[271,0,271,6],[269,0,269,6],[268,0,268,6],[264,0,264,6],[265,0,265,6],[266,0,266,6],[267,0,267,6],[138,1,138,6],[0,0,0,6],[1,0,1,6],[59,1,59,6],[78,1,78,6],[4,1,4,6],[5,1,5,6],[6,1,6,6],[15,1,15,6],[34,1,34,6],[36,1,36,6],[22,1,22,6],[66,1,66,6],[137,1,137,6],[48,1,48,6],[94,1,94,6],[104,1,104,6],[123,1,123,6],[125,1,125,6],[111,1,111,6],[49,1,49,6],[50,1,50,6],[92,1,92,6],[93,1,93,6],[80,1,80,6],[212,1,212,6],[213,1,213,6],[139,1,139,6],[149,1,149,6],[168,1,168,6],[170,1,170,6],[183,1,183,6],[184,1,184,6],[156,1,156,6]]}
["BASELINE PRODUCT ASSUMPTIONS\n"]
["The data below are for a non-EPEAT baseline product (i.e., a standard product available on the market that does not meet criteria established under EPEAT).  These data also include all components typically shipped as part of or with the computer unit.  For example, all product data includes cables; and a computer processing unit includes a keyboard. For mobile phones, assumptions do not include the charger."]
[]
[null,"Ref","Criteria/Attribute","Value","Units","Reference","Notes"]
[null,"Desktop Computer (CPU)"]
[null,"Baseline Assumptions for Purchasing"]
{"$rows_left_out":259}
{"sheet":"8b1.Assumptions-EPEATFECdefault","index":11,"n_rows":49,"n_cols":7,"rows_kept":49,"cut":false,"hidden":false,"merged":[[0,0,0,5],[1,0,1,5],[44,0,44,5],[39,0,39,5],[34,0,34,5],[6,0,6,5],[4,0,4,5],[5,0,5,5],[17,0,17,5]]}
["EPEAT PURCHASING, USE, AND END-OF-LIFE DEFAULT ASSUMPTIONS"]
["The data below are assumptions for all computer products that are EPEAT registered and managed using best use and end-of-life practices.  See Sheet 8b2 for applicability of specific criteria to products registered as EPEAT Bronze, Silver or Gold."]
[]
["Ref","Criteria/Attribute","Value","Units","Reference","Notes"," "]
["All Computer Product Types"]
["EPEAT Registered Computer Products"]
{"$rows_left_out":44}
{"sheet":"8b2.Assumption-EPEAT tiers","index":12,"n_rows":32,"n_cols":26,"rows_kept":32,"cut":false,"hidden":false,"merged":[[0,0,0,14],[1,0,1,14],[5,19,5,20],[11,19,11,20],[3,2,3,5],[3,6,3,9],[3,10,3,13],[28,10,28,13],[28,2,28,5],[28,6,28,9],[19,19,19,20],[15,19,15,20]]}
["EPEAT REGISTRATION TIER ASSUPTIONS (UPDATED 3/30/12)"]
["This table may be updated in the future, based on distribution of registrations in EPEAT."]
[]
[null,"CRITERIA","Bronze",null,null,null,"Silver",null,null,null,"Gold",null,null,null,"NOTES"]
[null,null,"CPU","CRT","LCD","NTBK","CPU","CRT","LCD","NTBK","CPU","CRT","LCD","NTBK"]
["Reduced Toxicity"]
{"$rows_left_out":27}
{"sheet":"8c.Assumptions-Calculations","index":13,"n_rows":360,"n_cols":14,"rows_kept":360,"cut":false,"hidden":false,"merged":[[28,3,28,4],[21,5,21,6],[23,5,23,6],[25,3,25,4],[5,3,5,4],[5,5,5,6],[185,3,185,4],[159,5,159,6],[160,5,160,6],[161,5,161,6],[162,5,162,6],[163,5,163,6],[182,5,182,6],[69,5,69,6],[78,3,78,4],[79,3,79,4],[75,3,75,4],[71,3,71,4],[72,3,72,4],[73,3,73,4],[73,5,73,6],[182,3,182,4],[74,5,74,6],[75,5,75,6],[0,0,0,6],[87,5,87,6],[88,5,88,6],[13,5,13,6],[14,5,14,6],[15,5,15,6],[16,5,16,6],[21,3,21,4],[22,3,22,4],[23,3,23,4],[22,5,22,6],[14,3,14,4],[15,3,15,4],[16,3,16,4],[17,3,17,4],[13,3,13,4],[17,5,17,6],[25,5,25,6],[31,3,31,4],[81,5,81,6],[82,5,82,6],[83,5,83,6],[69,3,69,4],[70,3,70,4],[324,2,324,4],[223,2,223,4],[234,2,234,4],[282,2,282,4],[296,2,296,4],[263,0,263,4],[310,2,310,4],[6,5,6,6],[7,5,7,6],[8,5,8,6],[9,5,9,6],[12,3,12,4],[6,3,6,4],[7,3,7,4],[8,3,8,4],[9,3,9,4],[12,5,12,6],[254,2,254,4],[30,3,30,4],[74,3,74,4],[185,5,185,6],[29,3,29,4],[27,3,27,4],[26,3,26,4],[183,3,183,4],[184,3,184,4],[184,5,184,6],[183,5,183,6],[154,5,154,6],[155,5,155,6],[156,5,156,6],[157,5,157,6],[158,5,158,6],[166,5,166,6],[167,5,167,6],[168,5,168,6],[169,5,169,6],[170,5,170,6],[171,5,171,6],[168,3,168,4],[174,3,174,4],[175,3,175,4],[176,3,176,4],[178,0,178,6],[158,3,158,4],[159,3,159,4],[160,3,160,4],[161,3,161,4],[188,5,188,6],[76,3,76,4],[77,3,77,4],[70,5,70,6],[81,3,81,4],[82,3,82,4],[83,3,83,4],[80,3,80,4],[244,2,244,4],[71,5,71,6],[72,5,72,6],[78,5,78,6],[80,5,80,6],[76,5,76,6],[77,5,77,6],[79,5,79,6],[169,3,169,4],[170,3,170,4],[152,3,152,4],[152,5,152,6],[153,5,153,6],[186,3,186,4],[186,5,186,6],[153,3,153,4],[114,9,114,13],[91,3,91,4],[84,5,84,6],[85,5,85,6],[86,5,86,6],[89,5,89,6],[91,5,91,6],[84,3,84,4],[85,3,85,4],[86,3,86,4],[89,3,89,4],[87,3,87,4],[88,3,88,4],[162,3,162,4],[163,3,163,4],[154,3,154,4],[155,3,155,4],[156,3,156,4],[157,3,157,4],[172,3,172,4],[164,3,164,4],[166,3,166,4],[167,3,167,4],[171,3,171,4],[211,0,211,2],[10,0,10,6],[194,3,194,4],[195,3,195,4],[195,5,195,6],[194,5,194,6],[193,5,193,6],[192,5,192,6],[188,3,188,4],[189,3,189,4],[190,3,190,4],[191,3,191,4],[192,3,192,4],[193,3,193,4],[179,3,179,4],[180,3,180,4],[165,3,165,4],[165,5,165,6],[29,5,29,6],[164,5,164,6],[181,3,181,4],[181,5,181,6],[180,5,180,6],[179,5,179,6],[203,2,203,3],[204,2,204,3],[205,2,205,3],[206,2,206,3],[30,5,30,6],[31,5,31,6],[26,5,26,6],[27,5,27,6],[28,5,28,6],[90,3,90,4],[90,5,90,6],[201,2,201,3],[202,2,202,3],[191,5,191,6],[190,5,190,6],[189,5,189,6],[172,5,172,6],[173,5,173,6],[174,5,174,6],[175,5,175,6],[176,5,176,6],[177,5,177,6],[177,3,177,4],[173,3,173,4]]}
["MISCELLANEOUS DATA AND ASSUMPTIONS"]
["Supporting data for calculations."]
[]
["PRODUCT INFORMATION"]
["Table 1.  Product cost"]
["Product Type","Value","Units","Reference",null,"Notes"]
{"$rows_left_out":355}
{"sheet":"8d.EnergyStar CPU-Calcs","index":14,"n_rows":76,"n_cols":6,"rows_kept":76,"cut":false,"hidden":false,"merged":[[12,4,12,5],[13,4,13,5],[20,4,20,5],[14,4,14,5],[15,4,15,5],[16,4,16,5],[17,4,17,5],[18,4,18,5],[19,4,19,5],[7,4,7,5],[8,4,8,5],[9,4,9,5],[10,4,10,5],[11,4,11,5],[0,0,0,5],[1,0,1,5],[4,4,4,5],[5,4,5,5],[6,4,6,5]]}
["ENERGY STAR ASSUMPTIONS FOR DESKTOP COMPUTERS (CPUS)"]
["These tables are based on data and calculations from the Savings Calculator for ENERGY STAR Qualified Office Equipment.  Data in yellow shaded cells change based on user input on Sheet 3b (for Use calculations) or Sheet 3c (for Purchasing calculations)."]
[]
["Assumptions for Use Calculations"]
[null,"ES 4.* Product","ES 5.* Product","Units","Reference"]
["Usage"]
{"$rows_left_out":71}
{"sheet":"8e.EnergyStar monitor-Calcs","index":15,"n_rows":90,"n_cols":6,"rows_kept":90,"cut":false,"hidden":false,"merged":[[10,4,10,5],[4,4,4,5],[5,4,5,5],[6,4,6,5],[7,4,7,5],[9,4,9,5],[24,4,24,5],[25,4,25,5],[11,4,11,5],[12,4,12,5],[13,4,13,5],[15,4,15,5],[16,4,16,5],[17,4,17,5],[61,4,61,5],[80,4,80,5],[0,0,0,5],[1,0,1,5],[42,4,42,5],[26,4,26,5],[27,4,27,5],[28,4,28,5],[29,4,29,5],[30,4,30,5],[18,4,18,5],[31,4,31,5],[19,4,19,5],[20,4,20,5],[21,4,21,5],[22,4,22,5]]}
["ENERGY STAR ASSUMPTIONS FOR COMPUTER MONITORS (LCDS AND CRTS)"]
["These tables are based on data and calculations from the Savings Calculator for ENERGY STAR Qualified Office Equipment.  Data in yellow shaded cells change based on user input on Sheet 3b (for Use calculations) or Sheet 3c (for Purchasing calculations)."]
[]
["Assumptions for Use Calculations"]
[null,"ES 4.* Product","ES 5.* Product","Units","Reference"]
["Usage"]
{"$rows_left_out":85}
{"sheet":"8f.EnergyStar notebook-Calcs","index":16,"n_rows":148,"n_cols":6,"rows_kept":148,"cut":false,"hidden":false,"merged":[[24,4,24,5],[4,4,4,5],[5,4,5,5],[7,4,7,5],[8,4,8,5],[9,4,9,5],[10,4,10,5],[11,4,11,5],[12,4,12,5],[20,4,20,5],[22,4,22,5],[23,4,23,5],[26,4,26,5],[27,4,27,5],[28,4,28,5],[29,4,29,5],[31,4,31,5],[38,4,38,5],[0,0,0,5],[1,0,1,5],[14,4,14,5],[15,4,15,5],[16,4,16,5],[17,4,17,5],[18,4,18,5],[19,4,19,5],[32,4,32,5],[33,4,33,5],[34,4,34,5],[35,4,35,5],[36,4,36,5],[37,4,37,5],[25,4,25,5]]}
["ENERGY STAR ASSUMPTIONS FOR NOTEBOOK COMPUTERS"]
["These tables are based on data and calculations from the Savings Calculator for ENERGY STAR Qualified Office Equipment.  Data in yellow shaded cells change based on user input on Sheet 3b (for Use calculations) or Sheet 3c (for Purchasing calculations)."]
[" "]
["Assumptions for Use Calculations"]
[null,"ES 4.* Product","ES 5.* Product","Units","Reference"]
["Usage"]
{"$rows_left_out":143}
{"sheet":"9.Revisions","index":17,"n_rows":29,"n_cols":2,"rows_kept":29,"cut":false,"hidden":false,"merged":[[0,0,0,1],[7,0,7,1],[1,0,1,1]]}
["REVISIONS TO THE CALCULATOR "]
["Below are the major changes to the calculator (Table 1) between version 3.0 and 3.1."]
["Table 1."]
["Sheet","Major Changes"]
["5a","Deleted comments that were no longer relevent.  Updated packaging reuse calculations to utilize the new, location-appropriate, assumptions."]
["8a","All assumptions reviewed and updated if a more complete, accurate or recent data source was available. Removed rows for data not being used in calculations."]
{"$rows_left_out":23}