{"text_format":"1","workbook":"xlsx","n_sheets":4,"sheets":["Multiple Scenarios","Summary Sheet","Acute Dataset","Chronic Dataset"],"not_rendered":{"charts":0,"images":0,"macros":1,"external_links":0,"defined_names":0,"comments":0,"pivot_tables":0},"unopened":[],"bounds":{"document_bytes":16777216,"sheet_cells":100000,"rows_first":2000,"rows_last":500,"rows_between":2000,"halvings":0,"cell_chars":16384,"cell_head_chars":4096},"cells_cut":0,"cells_raw":0,"read":"whole","date_system":"1900"}

{"sheet":"Multiple Scenarios","index":0,"n_rows":29,"n_cols":35,"rows_kept":29,"cut":false,"hidden":false,"merged":[[8,24,8,25],[8,27,8,28],[8,30,8,31],[8,33,8,34],[8,11,8,12],[8,14,8,15],[8,17,8,18],[8,20,8,21],[7,10,7,12],[7,13,7,15],[7,19,7,21],[6,1,6,4],[6,10,6,21],[7,16,7,18],[6,23,6,34],[7,23,7,25],[7,26,7,28],[7,29,7,31],[7,32,7,34]]}
[null,null,null,null,"All concentrations reported are µg/L total Aluminum"]
[]
[null,null,null,null,"<-----Click Button after entering data"]
[]
[]
[]
[null,"ENTER DATA HERE",null,null,null,null,null,null,null,{"$error":"#NUM!"},"ACUTE",null,null,null,null,null,null,null,null,null,null,null,null,"CHRONIC"]
[null,null,null,null,null,null,null,null,null,null,"Rank 1",null,null,"Rank 2",null,null,"Rank 3",null,null,"Rank 4",null,null,null,"Rank 1",null,null,"Rank 2",null,null,"Rank 3",null,null,"Rank 4"]
[null,"SiteName","DOC\n(mg/L)","Hardness\n(mg/L as CaCO3)","pH",null,"FAV","CMC","CCC",null,"Genus","GMAV",null,"Genus","GMAV",null,"Genus","GMAV",null,"Genus","GMAV",null,null,"Genus","GMCV",null,"Genus","GMCV",null,"Genus","GMCV",null,"Genus","GMCV"]
[null,"Site 1",5,25,9,7542.8737034161522,3522.9324666008047,1800,770,null,"Daphnia","",3345.2147220380402,"Ceriodaphnia","",7357.5727820932862,"Stenocypris","",10257.610073449332,"Crangonyx","",12222.952374640385,null,"Lampsilis","",1046.2828029642264,"Ceriodaphnia","",1186.52965289433,"Hyalella","",1720.0419862916433,"Brachionus","",2564.8294019530799]
[null,"Site 2",5,50,9,7542.8737034161522,3120.4991509062966,1600,680,null,"Daphnia","",2963.0825452043296,"Ceriodaphnia","",6517.0989898098123,"Stenocypris","",9085.857826678608,"Crangonyx","",10826.694200991533,null,"Lampsilis","",926.76332266108125,"Ceriodaphnia","",1050.9894269855961,"Hyalella","",1523.5573229494485,"Brachionus","",2271.8425762887732]
[null,"Site 3",5,75,9,7542.8737034161522,2906.7527928199229,1500,640,null,"Daphnia","",2760.1188294275712,"Ceriodaphnia","",6070.6940696372176,"Stenocypris","",8463.4993748337074,"Crangonyx","",10085.092827729632,null,"Lampsilis","",863.28236162024302,"Ceriodaphnia","",978.99928965772324,"Hyalella","",1419.1974710900452,"Brachionus","",2116.2270630828762]
[null,"Site 4",5,100,9,7542.8737034161522,2764.0367912591637,1400,600,null,"Daphnia","",2624.602274961142,"Ceriodaphnia","",5772.6346039483306,"Stenocypris","",8047.9577460538558,"Crangonyx","",9589.934062492177,null,"Lampsilis","",820.89684910856522,"Ceriodaphnia","",930.93229734384113,"Hyalella","",1349.5175901591649,"Brachionus","",2012.3243625904208]
[null,"Site 5",5,150,9,7542.8737034161522,2574.7072099400802,1300,560,null,"Daphnia","",2444.8236079697745,"Ceriodaphnia","",5377.2236252919756,"Stenocypris","",7496.6928441708405,"Crangonyx","",8933.0476539351275,null,"Lampsilis","",764.66747573719113,"Ceriodaphnia","",867.16577200309621,"Hyalella","",1257.079023083777,"Brachionus","",1874.4851955241993]
[null,"Site 6",5,150,9,7542.8737034161522,2574.7072099400802,1300,560,null,"Daphnia","",2444.8236079697745,"Ceriodaphnia","",5377.2236252919756,"Stenocypris","",7496.6928441708405,"Crangonyx","",8933.0476539351275,null,"Lampsilis","",764.66747573719113,"Ceriodaphnia","",867.16577200309621,"Hyalella","",1257.079023083777,"Brachionus","",1874.4851955241993]
{"$rows_left_out":15}
{"sheet":"Summary Sheet","index":1,"n_rows":42,"n_cols":20,"rows_kept":42,"cut":false,"hidden":false,"merged":[[2,1,2,2]]}
[]
[]
[null,"Normalization Chemistry"]
[null,"pH:",8.5,{"$f":"IF(AND(6<=C4,C4<=8.1),\"\",\"Outside model inputs\")","v":"Outside model inputs"},null,null,"FAV",{"$f":"E41","v":5855.5485487011192}]
[null,"Hardness:",150,{"$f":"IF(AND(9.8<=C5,C5<=127),\"\",\"Outside model inputs\")","v":"Outside model inputs"},null,null,"CMC",{"$f":"ROUND(E42,2-(1+INT(LOG10(ABS(E42)))))","v":2900}]
[null,"DOC:",5,{"$f":"IF(AND(0.08<=C6,C6<=5),\"\",\"Outside model inputs\")","v":""},null,null,"CCC",{"$f":"ROUND(O41,2-(1+INT(LOG10(ABS(O41)))))","v":1500}]
[]
[]
[null,"Acute Ranked GMAV",null,null,null,null,null,null,null,null,null,"Chronic Ranked GMCV"]
[null,"Rank",null,"GMAV","Genus",null,null,null,null,null,null,"Rank",null,"GMCV","Genus"]
[null,18,{"$f":"IF(VLOOKUP(D11,'Acute Dataset'!N$5:P$116,2,)=\">\",\">\",\"\")","v":">"},{"$f":"SMALL('Acute Dataset'!N$5:N$116,'Summary Sheet'!B11)","v":235380.66923026214},{"$f":"VLOOKUP(D11,'Acute Dataset'!N$5:P$116,3,FALSE)","v":"Hybognathus"},{"$f":"VLOOKUP(D11,'Acute Dataset'!N$5:Q$116,4,FALSE)","v":"Fish"},null,null,null,null,null,12,{"$f":"IF(VLOOKUP(N11,'Chronic Dataset'!M$5:O$43,2,FALSE) =\">\",\">\",\"\")","v":">"},{"$f":"SMALL('Chronic Dataset'!$M$5:$M$43,L11)","v":58200.530838483137},{"$f":"VLOOKUP(N11,'Chronic Dataset'!M$5:O$43,3,FALSE)","v":"Rana"},{"$f":"VLOOKUP(N11,'Chronic Dataset'!M$5:P$43,4,FALSE)","v":"Amphib - Other Data"}]
[null,17,{"$f":"IF(VLOOKUP(D12,'Acute Dataset'!N$5:P$116,2,)=\">\",\">\",\"\")","v":">"},{"$f":"SMALL('Acute Dataset'!N$5:N$116,'Summary Sheet'!B12)","v":143495.82856916595},{"$f":"VLOOKUP(D12,'Acute Dataset'!N$5:P$116,3,FALSE)","v":"Lepomis"},{"$f":"VLOOKUP(D12,'Acute Dataset'!N$5:Q$116,4,FALSE)","v":"Fish"},null,null,null,null,null,11,{"$f":"IF(VLOOKUP(N12,'Chronic Dataset'!M$5:O$43,2,FALSE) =\">\",\">\",\"\")","v":""},{"$f":"SMALL('Chronic Dataset'!$M$5:$M$43,L12)","v":28533.87769289091},{"$f":"VLOOKUP(N12,'Chronic Dataset'!M$5:O$43,3,FALSE)","v":"Aeolosoma"},{"$f":"VLOOKUP(N12,'Chronic Dataset'!M$5:P$43,4,FALSE)","v":"Invert"}]
[null,16,{"$f":"IF(VLOOKUP(D13,'Acute Dataset'!N$5:P$116,2,)=\">\",\">\",\"\")","v":""},{"$f":"SMALL('Acute Dataset'!N$5:N$116,'Summary Sheet'!B13)","v":137937.90385509626},{"$f":"VLOOKUP(D13,'Acute Dataset'!N$5:P$116,3,FALSE)","v":"Salvelinus"},{"$f":"VLOOKUP(D13,'Acute Dataset'!N$5:Q$116,4,FALSE)","v":"Fish"},null,null,null,null,null,10,{"$f":"IF(VLOOKUP(N13,'Chronic Dataset'!M$5:O$43,2,FALSE) =\">\",\">\",\"\")","v":""},{"$f":"SMALL('Chronic Dataset'!$M$5:$M$43,L13)","v":14857.051147419355},{"$f":"VLOOKUP(N13,'Chronic Dataset'!M$5:O$43,3,FALSE)","v":"Pimephales"},{"$f":"VLOOKUP(N13,'Chronic Dataset'!M$5:P$43,4,FALSE)","v":"Fish"}]
[null,15,{"$f":"IF(VLOOKUP(D14,'Acute Dataset'!N$5:P$116,2,)=\">\",\">\",\"\")","v":">"},{"$f":"SMALL('Acute Dataset'!N$5:N$116,'Summary Sheet'!B14)","v":119537.29481335128},{"$f":"VLOOKUP(D14,'Acute Dataset'!N$5:P$116,3,FALSE)","v":"Hyla"},{"$f":"VLOOKUP(D14,'Acute Dataset'!N$5:Q$116,4,FALSE)","v":"Amphibian"},null,null,null,null,null,9,{"$f":"IF(VLOOKUP(N14,'Chronic Dataset'!M$5:O$43,2,FALSE) =\">\",\">\",\"\")","v":""},{"$f":"SMALL('Chronic Dataset'!$M$5:$M$43,L14)","v":9859.9919613479033},{"$f":"VLOOKUP(N14,'Chronic Dataset'!M$5:O$43,3,FALSE)","v":"Chironomus"},{"$f":"VLOOKUP(N14,'Chronic Dataset'!M$5:P$43,4,FALSE)","v":"Invert"}]
[null,14,{"$f":"IF(VLOOKUP(D15,'Acute Dataset'!N$5:P$116,2,)=\">\",\">\",\"\")","v":">"},{"$f":"SMALL('Acute Dataset'!N$5:N$116,'Summary Sheet'!B15)","v":103997.55471374164},{"$f":"VLOOKUP(D15,'Acute Dataset'!N$5:P$116,3,FALSE)","v":"Paratanytarsus"},{"$f":"VLOOKUP(D15,'Acute Dataset'!N$5:Q$116,4,FALSE)","v":"Invert"},null,null,null,null,null,8,{"$f":"IF(VLOOKUP(N15,'Chronic Dataset'!M$5:O$43,2,FALSE) =\">\",\">\",\"\")","v":""},{"$f":"SMALL('Chronic Dataset'!$M$5:$M$43,L15)","v":8138.5358729295795},{"$f":"VLOOKUP(N15,'Chronic Dataset'!M$5:O$43,3,FALSE)","v":"Lymnaea"},{"$f":"VLOOKUP(N15,'Chronic Dataset'!M$5:P$43,4,FALSE)","v":"Mollusk"}]
{"$rows_left_out":28}
{"sheet":"Acute Dataset","index":2,"n_rows":122,"n_cols":19,"rows_kept":122,"cut":false,"hidden":false,"merged":[]}
[null,"Appendix A. Acceptable Acute Toxicity Data of Aluminum to Freshwater Aquatic Animals"]
[]
[null,"Species","Methoda","Hardness (mg/L as CaCO3)","pH","DOC\n(mg/L)",null,"LC50 or EC50 Conc. (µg/L)","Reference",null,"Normalized Conc. - LC50\n(µg/L)",null,"Species Mean Acute Value\n(µg/L)","Genus Mean Acute Value\n(µg/L)",null,"Genus",null,"DOC Note","Dilution water"]
[]
[null,"Snail, Physa sp. ","S, M, T",47.4,6.59,1.1000000000000001,">",23400,"Call 1984; Call et al. 1984",">",{"$f":"EXP(LN(H5)-0.525*(LN(F5)-LN('Summary Sheet'!$C$6))-11.282*(E5-'Summary Sheet'!$C$4)-2.201*(LN(D5)-LN('Summary Sheet'!$C$5))+0.663*(E5^2-'Summary Sheet'!$C$4^2)+0.264*((E5*LN(D5)-'Summary Sheet'!$C$4*LN('Summary Sheet'!$C$5))))","v":80813.590252833223},null,"-",null,null,"Physa",null,"Value is from 2007 FW Cu AWQC Appendix C recommendation","Raw Lake Superior water"]
[null,"Snail, Physa sp. ","S, M, T",47.4,7.55,1.1000000000000001,null,30600,"Call 1984; Call et al. 1984",null,{"$f":"EXP(LN(H6)-0.525*(LN(F6)-LN('Summary Sheet'!$C$6))-11.282*(E6-'Summary Sheet'!$C$4)-2.201*(LN(D6)-LN('Summary Sheet'!$C$5))+0.663*(E6^2-'Summary Sheet'!$C$4^2)+0.264*((E6*LN(D6)-'Summary Sheet'!$C$4*LN('Summary Sheet'!$C$5))))","v":45035.251592470471},null,"-",null,null,"Physa",null,"Value is from 2007 FW Cu AWQC Appendix C recommendation","Raw Lake Superior water"]
[null,"Snail, Physa sp. ","S, M, T",47.4,8.17,1.1000000000000001,">",24700,"Call 1984; Call et al. 1984",">",{"$f":"EXP(LN(H7)-0.525*(LN(F7)-LN('Summary Sheet'!$C$6))-11.282*(E7-'Summary Sheet'!$C$4)-2.201*(LN(D7)-LN('Summary Sheet'!$C$5))+0.663*(E7^2-'Summary Sheet'!$C$4^2)+0.264*((E7*LN(D7)-'Summary Sheet'!$C$4*LN('Summary Sheet'!$C$5))))","v":40119.049560209212},null,"-",null,null,"Physa",null,"Value is from 2007 FW Cu AWQC Appendix C recommendation","Raw Lake Superior water"]
[null,"Snail, Physa sp. ","S, M, T",47.4,7.46,1.1000000000000001,null,55500,"Call 1984; Call et al. 1984",null,{"$f":"EXP(LN(H8)-0.525*(LN(F8)-LN('Summary Sheet'!$C$6))-11.282*(E8-'Summary Sheet'!$C$4)-2.201*(LN(D8)-LN('Summary Sheet'!$C$5))+0.663*(E8^2-'Summary Sheet'!$C$4^2)+0.264*((E8*LN(D8)-'Summary Sheet'!$C$4*LN('Summary Sheet'!$C$5))))","v":84005.393024822886},null,{"$f":"GEOMEAN(K5:K8)","v":59179.828139452191},{"$f":"M8","v":59179.828139452191},null,"Physa","Mollusk","Value is from 2007 FW Cu AWQC Appendix C recommendation","Raw Lake Superior water"]
[]
[null,"Fatmucket, Lampsilis siliquoidea","F, M, T",106,6.12,0.48,">",6302,"Wang et al. 2016; Wang et al. 2017",">",{"$f":"EXP(LN(H10)-0.525*(LN(F10)-LN('Summary Sheet'!$C$6))-11.282*(E10-'Summary Sheet'!$C$4)-2.201*(LN(D10)-LN('Summary Sheet'!$C$5))+0.663*(E10^2-'Summary Sheet'!$C$4^2)+0.264*((E10*LN(D10)-'Summary Sheet'!$C$4*LN('Summary Sheet'!$C$5))))","v":49787.874779829668},">",{"$f":"GEOMEAN(K10:K10)","v":49787.874779829668},{"$f":"M10","v":49787.874779829668},">","Lampsilis","Mollusk","Author reported"]
[]
[null,"Cladoceran, Ceriodaphnia dubia","S, M, A",50,7.42,1.1000000000000001,null,1900,"McCauley et al. 1986",null,{"$f":"EXP(LN(H12)-0.525*(LN(F12)-LN('Summary Sheet'!$C$6))-11.282*(E12-'Summary Sheet'!$C$4)-2.201*(LN(D12)-LN('Summary Sheet'!$C$5))+0.663*(E12^2-'Summary Sheet'!$C$4^2)+0.264*((E12*LN(D12)-'Summary Sheet'!$C$4*LN('Summary Sheet'!$C$5))))","v":2884.4603192674122},null,"-",null,null,"Ceriodaphnia",null,"Value is from 2007 FW Cu AWQC Appendix C recommendation","Lake Superior water"]
[null,"Cladoceran, Ceriodaphnia dubia","S, M, A",50.5,7.86,1.1000000000000001,null,1500,"McCauley et al. 1986",null,{"$f":"EXP(LN(H13)-0.525*(LN(F13)-LN('Summary Sheet'!$C$6))-11.282*(E13-'Summary Sheet'!$C$4)-2.201*(LN(D13)-LN('Summary Sheet'!$C$5))+0.663*(E13^2-'Summary Sheet'!$C$4^2)+0.264*((E13*LN(D13)-'Summary Sheet'!$C$4*LN('Summary Sheet'!$C$5))))","v":2158.7252569290463},null,"-",null,null,"Ceriodaphnia",null,"Value is from 2007 FW Cu AWQC Appendix C recommendation","UW-S Lake Superior lab water"]
[null,"Cladoceran, Ceriodaphnia dubia","S, M, A",50,8.1300000000000008,1.1000000000000001,null,2560,"McCauley et al. 1986",null,{"$f":"EXP(LN(H14)-0.525*(LN(F14)-LN('Summary Sheet'!$C$6))-11.282*(E14-'Summary Sheet'!$C$4)-2.201*(LN(D14)-LN('Summary Sheet'!$C$5))+0.663*(E14^2-'Summary Sheet'!$C$4^2)+0.264*((E14*LN(D14)-'Summary Sheet'!$C$4*LN('Summary Sheet'!$C$5))))","v":4056.79106304368},null,"-",null,null,"Ceriodaphnia",null,"Value is from 2007 FW Cu AWQC Appendix C recommendation","Lake Superior water"]
[null,"Cladoceran, Ceriodaphnia dubia","R, M, T",26,7.5,0.5,null,720,"ENSR 1992d",null,{"$f":"EXP(LN(H15)-0.525*(LN(F15)-LN('Summary Sheet'!$C$6))-11.282*(E15-'Summary Sheet'!$C$4)-2.201*(LN(D15)-LN('Summary Sheet'!$C$5))+0.663*(E15^2-'Summary Sheet'!$C$4^2)+0.264*((E15*LN(D15)-'Summary Sheet'!$C$4*LN('Summary Sheet'!$C$5))))","v":1856.8034876731608},null,"-",null,null,"Ceriodaphnia",null,"Value is from 2007 FW Cu AWQC Appendix C recommendation","Lab Recon water"]
{"$rows_left_out":108}
{"sheet":"Chronic Dataset","index":3,"n_rows":43,"n_cols":18,"rows_kept":43,"cut":false,"hidden":false,"merged":[]}
[null,"Appendix C. Acceptable Chronic Toxicity Data of Aluminum to Freshwater Aquatic Animals"]
[null,null,null,null,null,null,null,null,null,"MLR equation"]
[null,"Species","Hardness (mg/L as CaCO3)","pH","DOC\n(mg/L)","EC20 Endpoint",null,"EC20\n(µg/L)",null,"Normalized Conc.- EC20\n(µg/L)",null,"SMCV-EC20\n(µg/L)","GMCV-EC20\n(µg/L)",null,"Genus",null,"DOC Notes","Dilution water"]
[]
[null,"Oligochaete, Aeolosoma sp.",48,6,0.25,"Reproduction (population size)",null,1235,null,{"$f":"EXP(LN(H5)-0.525*(LN(E5)-LN('Summary Sheet'!$C$6))-11.282*(D5-'Summary Sheet'!$C$4)-2.201*(LN(C5)-LN('Summary Sheet'!$C$5))+0.663*(D5^2-'Summary Sheet'!$C$4^2)+0.264*(D5*LN(C5)-'Summary Sheet'!$C$4*LN('Summary Sheet'!$C$5)))","v":28533.87769289091},null,{"$f":"J5","v":28533.87769289091},{"$f":"L5","v":28533.87769289091},null,"Aeolosoma","Invert","Author reported; half the detection limit"]
[]
[null,"Rotifer, Brachionus calyciflorus",100,6.2,0.25,"Reproduction (population size)",null,431,null,{"$f":"EXP(LN(H7)-0.525*(LN(E7)-LN('Summary Sheet'!$C$6))-11.282*(D7-'Summary Sheet'!$C$4)-2.201*(LN(C7)-LN('Summary Sheet'!$C$5))+0.663*(D7^2-'Summary Sheet'!$C$4^2)+0.264*(D7*LN(C7)-'Summary Sheet'!$C$4*LN('Summary Sheet'!$C$5)))","v":4263.0630091989906},null,{"$f":"J7","v":4263.0630091989906},{"$f":"L7","v":4263.0630091989906},null,"Brachionus","Invert","Author reported; half the detection limit"]
[]
[null,"Great pond snail, Lymnaea stagnalis",117,6.1,0.25,"Biomass",null,745.7,null,{"$f":"EXP(LN(H9)-0.525*(LN(E9)-LN('Summary Sheet'!$C$6))-11.282*(D9-'Summary Sheet'!$C$4)-2.201*(LN(C9)-LN('Summary Sheet'!$C$5))+0.663*(D9^2-'Summary Sheet'!$C$4^2)+0.264*(D9*LN(C9)-'Summary Sheet'!$C$4*LN('Summary Sheet'!$C$5)))","v":8138.5358729295795},null,{"$f":"J9","v":8138.5358729295795},{"$f":"L9","v":8138.5358729295795},null,"Lymnaea","Mollusk","Author reported; half the detection limit"]
[]
[null,"Fatmucket, Lampsilis siliquoidea",105.5,6.04,{"$f":"AVERAGE(0.34,0.45)","v":0.39500000000000002},"Biomass",null,169,null,{"$f":"EXP(LN(H11)-0.525*(LN(E11)-LN('Summary Sheet'!$C$6))-11.282*(D11-'Summary Sheet'!$C$4)-2.201*(LN(C11)-LN('Summary Sheet'!$C$5))+0.663*(D11^2-'Summary Sheet'!$C$4^2)+0.264*(D11*LN(C11)-'Summary Sheet'!$C$4*LN('Summary Sheet'!$C$5)))","v":1739.0511474491395},null,{"$f":"J11","v":1739.0511474491395},{"$f":"L11","v":1739.0511474491395},null,"Lampsilis","Mollusk","Author reported"]
[]
[null,"Cladoceran, Ceriodaphnia dubia",50,7.15,1.1000000000000001,"Reproduction - young/starting adult",null,1779.6,null,{"$f":"EXP(LN(H13)-0.525*(LN(E13)-LN('Summary Sheet'!$C$6))-11.282*(D13-'Summary Sheet'!$C$4)-2.201*(LN(C13)-LN('Summary Sheet'!$C$5))+0.663*(D13^2-'Summary Sheet'!$C$4^2)+0.264*(D13*LN(C13)-'Summary Sheet'!$C$4*LN('Summary Sheet'!$C$5)))","v":3167.6432338504519},null,null,null,null,"Ceriodaphnia",null,"Value is from 2007 FW Cu AWQC Appendix C recommendation","Lake Superior water"]
[null,"Cladoceran, Ceriodaphnia dubia",26,7.3,0.5,"Reproduction - young/female",null,1557,null,{"$f":"EXP(LN(H14)-0.525*(LN(E14)-LN('Summary Sheet'!$C$6))-11.282*(D14-'Summary Sheet'!$C$4)-2.201*(LN(C14)-LN('Summary Sheet'!$C$5))+0.663*(D14^2-'Summary Sheet'!$C$4^2)+0.264*(D14*LN(C14)-'Summary Sheet'!$C$4*LN('Summary Sheet'!$C$5)))","v":4535.856440102898},null,null,null,null,"Ceriodaphnia",null,"Value is from 2007 FW Cu AWQC Appendix C recommendation","Lab Recon"]
[null,"Cladoceran, Ceriodaphnia dubia",46,7.5,0.5,"Reproduction - young/female",null,808.73,null,{"$f":"EXP(LN(H15)-0.525*(LN(E15)-LN('Summary Sheet'!$C$6))-11.282*(D15-'Summary Sheet'!$C$4)-2.201*(LN(C15)-LN('Summary Sheet'!$C$5))+0.663*(D15^2-'Summary Sheet'!$C$4^2)+0.264*(D15*LN(C15)-'Summary Sheet'!$C$4*LN('Summary Sheet'!$C$5)))","v":1838.5550138886465},null,null,null,null,"Ceriodaphnia",null,"Value is from 2007 FW Cu AWQC Appendix C recommendation","Lab Recon"]
{"$rows_left_out":28}