{"text_format":"1","workbook":"xlsx","n_sheets":4,"sheets":["Multiple Scenarios","Summary Sheet","Acute Dataset","Chronic Dataset"],"not_rendered":{"charts":0,"images":0,"macros":1,"external_links":0,"defined_names":0,"comments":0,"pivot_tables":0},"unopened":[],"bounds":{"document_bytes":16777216,"sheet_cells":100000,"rows_first":2000,"rows_last":500,"rows_between":2000,"halvings":0,"cell_chars":16384,"cell_head_chars":4096},"cells_cut":0,"cells_raw":0,"read":"whole","date_system":"1900"}

{"sheet":"Multiple Scenarios","index":0,"n_rows":29,"n_cols":35,"rows_kept":29,"cut":false,"hidden":false,"merged":[[8,24,8,25],[8,27,8,28],[8,30,8,31],[8,33,8,34],[8,11,8,12],[8,14,8,15],[8,17,8,18],[8,20,8,21],[7,10,7,12],[7,13,7,15],[7,19,7,21],[6,1,6,4],[6,10,6,21],[7,16,7,18],[6,23,6,34],[7,23,7,25],[7,26,7,28],[7,29,7,31],[7,32,7,34]]}
[null,null,null,null,"All concentrations reported are µg/L total Aluminum"]
[]
[null,null,null,null,"<-----Click Button after entering data"]
[]
[]
[]
[null,"ENTER DATA HERE",null,null,null,null,null,null,null,{"$error":"#NUM!"},"ACUTE",null,null,null,null,null,null,null,null,null,null,null,null,"CHRONIC"]
[null,null,null,null,null,null,null,null,null,null,"Rank 1",null,null,"Rank 2",null,null,"Rank 3",null,null,"Rank 4",null,null,null,"Rank 1",null,null,"Rank 2",null,null,"Rank 3",null,null,"Rank 4"]
[null,"SiteName","DOC\n(mg/L)","Hardness\n(mg/L as CaCO3)","pH",null,"FAV","CMC","CCC",null,"Genus","GMAV",null,"Genus","GMAV",null,"Genus","GMAV",null,"Genus","GMAV",null,null,"Genus","GMCV",null,"Genus","GMCV",null,"Genus","GMCV",null,"Genus","GMCV"]
[null,"Site 1",5,25,9,7542.8737034161522,3522.9324666008047,1800,770,null,"Daphnia","",3345.2147220380402,"Ceriodaphnia","",7357.5727820932862,"Stenocypris","",10257.610073449332,"Crangonyx","",12222.952374640385,null,"Lampsilis","",1046.2828029642264,"Ceriodaphnia","",1186.52965289433,"Hyalella","",1720.0419862916433,"Brachionus","",2564.8294019530799]
[null,"Site 2",5,50,9,7542.8737034161522,3120.4991509062966,1600,680,null,"Daphnia","",2963.0825452043296,"Ceriodaphnia","",6517.0989898098123,"Stenocypris","",9085.857826678608,"Crangonyx","",10826.694200991533,null,"Lampsilis","",926.76332266108125,"Ceriodaphnia","",1050.9894269855961,"Hyalella","",1523.5573229494485,"Brachionus","",2271.8425762887732]
[null,"Site 3",5,75,9,7542.8737034161522,2906.7527928199229,1500,640,null,"Daphnia","",2760.1188294275712,"Ceriodaphnia","",6070.6940696372176,"Stenocypris","",8463.4993748337074,"Crangonyx","",10085.092827729632,null,"Lampsilis","",863.28236162024302,"Ceriodaphnia","",978.99928965772324,"Hyalella","",1419.1974710900452,"Brachionus","",2116.2270630828762]
[null,"Site 4",5,100,9,7542.8737034161522,2764.0367912591637,1400,600,null,"Daphnia","",2624.602274961142,"Ceriodaphnia","",5772.6346039483306,"Stenocypris","",8047.9577460538558,"Crangonyx","",9589.934062492177,null,"Lampsilis","",820.89684910856522,"Ceriodaphnia","",930.93229734384113,"Hyalella","",1349.5175901591649,"Brachionus","",2012.3243625904208]
[null,"Site 5",5,150,9,7542.8737034161522,2574.7072099400802,1300,560,null,"Daphnia","",2444.8236079697745,"Ceriodaphnia","",5377.2236252919756,"Stenocypris","",7496.6928441708405,"Crangonyx","",8933.0476539351275,null,"Lampsilis","",764.66747573719113,"Ceriodaphnia","",867.16577200309621,"Hyalella","",1257.079023083777,"Brachionus","",1874.4851955241993]
[null,"Site 6",5,150,9,7542.8737034161522,2574.7072099400802,1300,560,null,"Daphnia","",2444.8236079697745,"Ceriodaphnia","",5377.2236252919756,"Stenocypris","",7496.6928441708405,"Crangonyx","",8933.0476539351275,null,"Lampsilis","",764.66747573719113,"Ceriodaphnia","",867.16577200309621,"Hyalella","",1257.079023083777,"Brachionus","",1874.4851955241993]
[null,"Site 7",5,150,9,7542.8737034161522,2574.7072099400802,1300,560,null,"Daphnia","",2444.8236079697745,"Ceriodaphnia","",5377.2236252919756,"Stenocypris","",7496.6928441708405,"Crangonyx","",8933.0476539351275,null,"Lampsilis","",764.66747573719113,"Ceriodaphnia","",867.16577200309621,"Hyalella","",1257.079023083777,"Brachionus","",1874.4851955241993]
[null,"Site 8",5,150,9,7542.8737034161522,2574.7072099400802,1300,560,null,"Daphnia","",2444.8236079697745,"Ceriodaphnia","",5377.2236252919756,"Stenocypris","",7496.6928441708405,"Crangonyx","",8933.0476539351275,null,"Lampsilis","",764.66747573719113,"Ceriodaphnia","",867.16577200309621,"Hyalella","",1257.079023083777,"Brachionus","",1874.4851955241993]
[null,"Site 9",5,150,9,7542.8737034161522,2574.7072099400802,1300,560,null,"Daphnia","",2444.8236079697745,"Ceriodaphnia","",5377.2236252919756,"Stenocypris","",7496.6928441708405,"Crangonyx","",8933.0476539351275,null,"Lampsilis","",764.66747573719113,"Ceriodaphnia","",867.16577200309621,"Hyalella","",1257.079023083777,"Brachionus","",1874.4851955241993]
[null,"Site 10",5,150,9,7542.8737034161522,2574.7072099400802,1300,560,null,"Daphnia","",2444.8236079697745,"Ceriodaphnia","",5377.2236252919756,"Stenocypris","",7496.6928441708405,"Crangonyx","",8933.0476539351275,null,"Lampsilis","",764.66747573719113,"Ceriodaphnia","",867.16577200309621,"Hyalella","",1257.079023083777,"Brachionus","",1874.4851955241993]
[null,"Site 11",5,25,8.5,7542.8737034161522,6324.5275664384071,3200,1400,null,"Daphnia","",6005.4806402797849,"Ceriodaphnia","",13208.647149379653,"Stenocypris","",18414.925148394708,"Crangonyx","",21943.196461913187,null,"Lampsilis","",1878.3341697214576,"Ceriodaphnia","",2130.1116525140569,"Hyalella","",3087.8971030145412,"Brachionus","",4604.4976478118197]
[null,"Site 12",5,50,8.5,7542.8737034161522,6138.8044609925555,3100,1300,null,"Daphnia","",5829.1265169892458,"Ceriodaphnia","",12820.768222211143,"Stenocypris","",17874.161107257998,"Crangonyx","",21298.822862858149,null,"Lampsilis","",1823.1758908776048,"Ceriodaphnia","",2067.559794387912,"Hyalella","",2997.2193672874346,"Brachionus","",4469.284132938953]
[null,"Site 13",5,75,8.5,7542.8737034161522,6032.7020429132162,3000,1300,null,"Daphnia","",5728.3765382806296,"Ceriodaphnia","",12599.175480716987,"Stenocypris","",17565.226081445442,"Crangonyx","",20930.696361623792,null,"Lampsilis","",1791.6643202070018,"Ceriodaphnia","",2031.8243193289536,"Hyalella","",2945.4157588807261,"Brachionus","",4392.0375197587491]
[null,"Site 14",5,100,8.5,7542.8737034161522,5958.5352130145784,3000,1300,null,"Daphnia","",5657.9511260374666,"Ceriodaphnia","",12444.279565404175,"Stenocypris","",17349.27688891883,"Crangonyx","",20673.371636205829,null,"Lampsilis","",1769.6373641386058,"Ceriodaphnia","",2006.8448047425452,"Hyalella","",2909.2044313500587,"Salmo","",4126.4239149970472]
[null,"Site 15",5,150,8.5,7542.8737034161522,5855.5485487011192,2900,1500,null,"Daphnia","",5560.1597238743243,"Ceriodaphnia","",12229.194012259193,"Stenocypris","",17049.413903946021,"Crangonyx","",20316.055364872027,null,"Lampsilis","",1739.0511474491395,"Ceriodaphnia","",1972.1587208567291,"Hyalella","",2858.9220633720624,"Salmo","",3037.0283776868923]
[null,"Site 16",5,150,8.5,7542.8737034161522,5855.5485487011192,2900,1500,null,"Daphnia","",5560.1597238743243,"Ceriodaphnia","",12229.194012259193,"Stenocypris","",17049.413903946021,"Crangonyx","",20316.055364872027,null,"Lampsilis","",1739.0511474491395,"Ceriodaphnia","",1972.1587208567291,"Hyalella","",2858.9220633720624,"Salmo","",3037.0283776868923]
[null,"Site 17",5,150,8.5,7542.8737034161522,5855.5485487011192,2900,1500,null,"Daphnia","",5560.1597238743243,"Ceriodaphnia","",12229.194012259193,"Stenocypris","",17049.413903946021,"Crangonyx","",20316.055364872027,null,"Lampsilis","",1739.0511474491395,"Ceriodaphnia","",1972.1587208567291,"Hyalella","",2858.9220633720624,"Salmo","",3037.0283776868923]
[null,"Site 18",5,150,8.5,7542.8737034161522,5855.5485487011192,2900,1500,null,"Daphnia","",5560.1597238743243,"Ceriodaphnia","",12229.194012259193,"Stenocypris","",17049.413903946021,"Crangonyx","",20316.055364872027,null,"Lampsilis","",1739.0511474491395,"Ceriodaphnia","",1972.1587208567291,"Hyalella","",2858.9220633720624,"Salmo","",3037.0283776868923]
[null,"Site 19",5,150,8.5,7542.8737034161522,5855.5485487011192,2900,1500,null,"Daphnia","",5560.1597238743243,"Ceriodaphnia","",12229.194012259193,"Stenocypris","",17049.413903946021,"Crangonyx","",20316.055364872027,null,"Lampsilis","",1739.0511474491395,"Ceriodaphnia","",1972.1587208567291,"Hyalella","",2858.9220633720624,"Salmo","",3037.0283776868923]
[null,"Site 20",5,150,8.5,7542.8737034161522,5855.5485487011192,2900,1500,null,"Daphnia","",5560.1597238743243,"Ceriodaphnia","",12229.194012259193,"Stenocypris","",17049.413903946021,"Crangonyx","",20316.055364872027,null,"Lampsilis","",1739.0511474491395,"Ceriodaphnia","",1972.1587208567291,"Hyalella","",2858.9220633720624,"Salmo","",3037.0283776868923]

{"sheet":"Summary Sheet","index":1,"n_rows":42,"n_cols":20,"rows_kept":42,"cut":false,"hidden":false,"merged":[[2,1,2,2]]}
[]
[]
[null,"Normalization Chemistry"]
[null,"pH:",8.5,{"$f":"IF(AND(6<=C4,C4<=8.1),\"\",\"Outside model inputs\")","v":"Outside model inputs"},null,null,"FAV",{"$f":"E41","v":5855.5485487011192}]
[null,"Hardness:",150,{"$f":"IF(AND(9.8<=C5,C5<=127),\"\",\"Outside model inputs\")","v":"Outside model inputs"},null,null,"CMC",{"$f":"ROUND(E42,2-(1+INT(LOG10(ABS(E42)))))","v":2900}]
[null,"DOC:",5,{"$f":"IF(AND(0.08<=C6,C6<=5),\"\",\"Outside model inputs\")","v":""},null,null,"CCC",{"$f":"ROUND(O41,2-(1+INT(LOG10(ABS(O41)))))","v":1500}]
[]
[]
[null,"Acute Ranked GMAV",null,null,null,null,null,null,null,null,null,"Chronic Ranked GMCV"]
[null,"Rank",null,"GMAV","Genus",null,null,null,null,null,null,"Rank",null,"GMCV","Genus"]
[null,18,{"$f":"IF(VLOOKUP(D11,'Acute Dataset'!N$5:P$116,2,)=\">\",\">\",\"\")","v":">"},{"$f":"SMALL('Acute Dataset'!N$5:N$116,'Summary Sheet'!B11)","v":235380.66923026214},{"$f":"VLOOKUP(D11,'Acute Dataset'!N$5:P$116,3,FALSE)","v":"Hybognathus"},{"$f":"VLOOKUP(D11,'Acute Dataset'!N$5:Q$116,4,FALSE)","v":"Fish"},null,null,null,null,null,12,{"$f":"IF(VLOOKUP(N11,'Chronic Dataset'!M$5:O$43,2,FALSE) =\">\",\">\",\"\")","v":">"},{"$f":"SMALL('Chronic Dataset'!$M$5:$M$43,L11)","v":58200.530838483137},{"$f":"VLOOKUP(N11,'Chronic Dataset'!M$5:O$43,3,FALSE)","v":"Rana"},{"$f":"VLOOKUP(N11,'Chronic Dataset'!M$5:P$43,4,FALSE)","v":"Amphib - Other Data"}]
[null,17,{"$f":"IF(VLOOKUP(D12,'Acute Dataset'!N$5:P$116,2,)=\">\",\">\",\"\")","v":">"},{"$f":"SMALL('Acute Dataset'!N$5:N$116,'Summary Sheet'!B12)","v":143495.82856916595},{"$f":"VLOOKUP(D12,'Acute Dataset'!N$5:P$116,3,FALSE)","v":"Lepomis"},{"$f":"VLOOKUP(D12,'Acute Dataset'!N$5:Q$116,4,FALSE)","v":"Fish"},null,null,null,null,null,11,{"$f":"IF(VLOOKUP(N12,'Chronic Dataset'!M$5:O$43,2,FALSE) =\">\",\">\",\"\")","v":""},{"$f":"SMALL('Chronic Dataset'!$M$5:$M$43,L12)","v":28533.87769289091},{"$f":"VLOOKUP(N12,'Chronic Dataset'!M$5:O$43,3,FALSE)","v":"Aeolosoma"},{"$f":"VLOOKUP(N12,'Chronic Dataset'!M$5:P$43,4,FALSE)","v":"Invert"}]
[null,16,{"$f":"IF(VLOOKUP(D13,'Acute Dataset'!N$5:P$116,2,)=\">\",\">\",\"\")","v":""},{"$f":"SMALL('Acute Dataset'!N$5:N$116,'Summary Sheet'!B13)","v":137937.90385509626},{"$f":"VLOOKUP(D13,'Acute Dataset'!N$5:P$116,3,FALSE)","v":"Salvelinus"},{"$f":"VLOOKUP(D13,'Acute Dataset'!N$5:Q$116,4,FALSE)","v":"Fish"},null,null,null,null,null,10,{"$f":"IF(VLOOKUP(N13,'Chronic Dataset'!M$5:O$43,2,FALSE) =\">\",\">\",\"\")","v":""},{"$f":"SMALL('Chronic Dataset'!$M$5:$M$43,L13)","v":14857.051147419355},{"$f":"VLOOKUP(N13,'Chronic Dataset'!M$5:O$43,3,FALSE)","v":"Pimephales"},{"$f":"VLOOKUP(N13,'Chronic Dataset'!M$5:P$43,4,FALSE)","v":"Fish"}]
[null,15,{"$f":"IF(VLOOKUP(D14,'Acute Dataset'!N$5:P$116,2,)=\">\",\">\",\"\")","v":">"},{"$f":"SMALL('Acute Dataset'!N$5:N$116,'Summary Sheet'!B14)","v":119537.29481335128},{"$f":"VLOOKUP(D14,'Acute Dataset'!N$5:P$116,3,FALSE)","v":"Hyla"},{"$f":"VLOOKUP(D14,'Acute Dataset'!N$5:Q$116,4,FALSE)","v":"Amphibian"},null,null,null,null,null,9,{"$f":"IF(VLOOKUP(N14,'Chronic Dataset'!M$5:O$43,2,FALSE) =\">\",\">\",\"\")","v":""},{"$f":"SMALL('Chronic Dataset'!$M$5:$M$43,L14)","v":9859.9919613479033},{"$f":"VLOOKUP(N14,'Chronic Dataset'!M$5:O$43,3,FALSE)","v":"Chironomus"},{"$f":"VLOOKUP(N14,'Chronic Dataset'!M$5:P$43,4,FALSE)","v":"Invert"}]
[null,14,{"$f":"IF(VLOOKUP(D15,'Acute Dataset'!N$5:P$116,2,)=\">\",\">\",\"\")","v":">"},{"$f":"SMALL('Acute Dataset'!N$5:N$116,'Summary Sheet'!B15)","v":103997.55471374164},{"$f":"VLOOKUP(D15,'Acute Dataset'!N$5:P$116,3,FALSE)","v":"Paratanytarsus"},{"$f":"VLOOKUP(D15,'Acute Dataset'!N$5:Q$116,4,FALSE)","v":"Invert"},null,null,null,null,null,8,{"$f":"IF(VLOOKUP(N15,'Chronic Dataset'!M$5:O$43,2,FALSE) =\">\",\">\",\"\")","v":""},{"$f":"SMALL('Chronic Dataset'!$M$5:$M$43,L15)","v":8138.5358729295795},{"$f":"VLOOKUP(N15,'Chronic Dataset'!M$5:O$43,3,FALSE)","v":"Lymnaea"},{"$f":"VLOOKUP(N15,'Chronic Dataset'!M$5:P$43,4,FALSE)","v":"Mollusk"}]
[null,13,{"$f":"IF(VLOOKUP(D16,'Acute Dataset'!N$5:P$116,2,)=\">\",\">\",\"\")","v":""},{"$f":"SMALL('Acute Dataset'!N$5:N$116,'Summary Sheet'!B16)","v":60722.747517311742},{"$f":"VLOOKUP(D16,'Acute Dataset'!N$5:P$116,3,FALSE)","v":"Pimephales"},{"$f":"VLOOKUP(D16,'Acute Dataset'!N$5:Q$116,4,FALSE)","v":"Fish"},null,null,null,null,null,7,{"$f":"IF(VLOOKUP(N16,'Chronic Dataset'!M$5:O$43,2,FALSE) =\">\",\">\",\"\")","v":""},{"$f":"SMALL('Chronic Dataset'!$M$5:$M$43,L16)","v":6580.7775356757729},{"$f":"VLOOKUP(N16,'Chronic Dataset'!M$5:O$43,3,FALSE)","v":"Danio"},{"$f":"VLOOKUP(N16,'Chronic Dataset'!M$5:P$43,4,FALSE)","v":"Fish"}]
[null,12,{"$f":"IF(VLOOKUP(D17,'Acute Dataset'!N$5:P$116,2,)=\">\",\">\",\"\")","v":""},{"$f":"SMALL('Acute Dataset'!N$5:N$116,'Summary Sheet'!B17)","v":59179.828139452191},{"$f":"VLOOKUP(D17,'Acute Dataset'!N$5:P$116,3,FALSE)","v":"Physa"},{"$f":"VLOOKUP(D17,'Acute Dataset'!N$5:Q$116,4,FALSE)","v":"Mollusk"},null,null,null,null,null,6,{"$f":"IF(VLOOKUP(N17,'Chronic Dataset'!M$5:O$43,2,FALSE) =\">\",\">\",\"\")","v":""},{"$f":"SMALL('Chronic Dataset'!$M$5:$M$43,L17)","v":4263.0630091989906},{"$f":"VLOOKUP(N17,'Chronic Dataset'!M$5:O$43,3,FALSE)","v":"Brachionus"},{"$f":"VLOOKUP(N17,'Chronic Dataset'!M$5:P$43,4,FALSE)","v":"Invert"}]
[null,11,{"$f":"IF(VLOOKUP(D18,'Acute Dataset'!N$5:P$116,2,)=\">\",\">\",\"\")","v":">"},{"$f":"SMALL('Acute Dataset'!N$5:N$116,'Summary Sheet'!B18)","v":49787.874779829668},{"$f":"VLOOKUP(D18,'Acute Dataset'!N$5:P$116,3,FALSE)","v":"Lampsilis"},{"$f":"VLOOKUP(D18,'Acute Dataset'!N$5:Q$116,4,FALSE)","v":"Mollusk"},null,null,null,null,null,5,{"$f":"IF(VLOOKUP(N18,'Chronic Dataset'!M$5:O$43,2,FALSE) =\">\",\">\",\"\")","v":""},{"$f":"SMALL('Chronic Dataset'!$M$5:$M$43,L18)","v":3531.9411481872753},{"$f":"VLOOKUP(N18,'Chronic Dataset'!M$5:O$43,3,FALSE)","v":"Salvelinus"},{"$f":"VLOOKUP(N18,'Chronic Dataset'!M$5:P$43,4,FALSE)","v":"Fish"}]
[null,10,{"$f":"IF(VLOOKUP(D19,'Acute Dataset'!N$5:P$116,2,)=\">\",\">\",\"\")","v":">"},{"$f":"SMALL('Acute Dataset'!N$5:N$116,'Summary Sheet'!B19)","v":46730.442719459272},{"$f":"VLOOKUP(D19,'Acute Dataset'!N$5:P$116,3,FALSE)","v":"Hyalella"},{"$f":"VLOOKUP(D19,'Acute Dataset'!N$5:Q$116,4,FALSE)","v":"Invert"},null,null,null,null,null,4,{"$f":"IF(VLOOKUP(N19,'Chronic Dataset'!M$5:O$43,2,FALSE) =\">\",\">\",\"\")","v":""},{"$f":"SMALL('Chronic Dataset'!$M$5:$M$43,L19)","v":3037.0283776868923},{"$f":"VLOOKUP(N19,'Chronic Dataset'!M$5:O$43,3,FALSE)","v":"Salmo"},{"$f":"VLOOKUP(N19,'Chronic Dataset'!M$5:P$43,4,FALSE)","v":"Fish"}]
[null,9,{"$f":"IF(VLOOKUP(D20,'Acute Dataset'!N$5:P$116,2,)=\">\",\">\",\"\")","v":""},{"$f":"SMALL('Acute Dataset'!N$5:N$116,'Summary Sheet'!B20)","v":42703.466503608222},{"$f":"VLOOKUP(D20,'Acute Dataset'!N$5:P$116,3,FALSE)","v":"Salmo"},{"$f":"VLOOKUP(D20,'Acute Dataset'!N$5:Q$116,4,FALSE)","v":"Fish"},null,null,null,null,null,3,{"$f":"IF(VLOOKUP(N20,'Chronic Dataset'!M$5:O$43,2,FALSE) =\">\",\">\",\"\")","v":""},{"$f":"SMALL('Chronic Dataset'!$M$5:$M$43,L20)","v":2858.9220633720624},{"$f":"VLOOKUP(N20,'Chronic Dataset'!M$5:O$43,3,FALSE)","v":"Hyalella"},{"$f":"VLOOKUP(N20,'Chronic Dataset'!M$5:P$43,4,FALSE)","v":"Invert"}]
[null,8,{"$f":"IF(VLOOKUP(D21,'Acute Dataset'!N$5:P$116,2,)=\">\",\">\",\"\")","v":""},{"$f":"SMALL('Acute Dataset'!N$5:N$116,'Summary Sheet'!B21)","v":42323.295717913614},{"$f":"VLOOKUP(D21,'Acute Dataset'!N$5:P$116,3,FALSE)","v":"Chironomus"},{"$f":"VLOOKUP(D21,'Acute Dataset'!N$5:Q$116,4,FALSE)","v":"Invert"},null,null,null,null,null,2,{"$f":"IF(VLOOKUP(N21,'Chronic Dataset'!M$5:O$43,2,FALSE) =\">\",\">\",\"\")","v":""},{"$f":"SMALL('Chronic Dataset'!$M$5:$M$43,L21)","v":1972.1587208567291},{"$f":"VLOOKUP(N21,'Chronic Dataset'!M$5:O$43,3,FALSE)","v":"Ceriodaphnia"},{"$f":"VLOOKUP(N21,'Chronic Dataset'!M$5:P$43,4,FALSE)","v":"Invert"},null,null," "]
[null,7,{"$f":"IF(VLOOKUP(D22,'Acute Dataset'!N$5:P$116,2,)=\">\",\">\",\"\")","v":">"},{"$f":"SMALL('Acute Dataset'!N$5:N$116,'Summary Sheet'!B22)","v":34207.601483982071},{"$f":"VLOOKUP(D22,'Acute Dataset'!N$5:P$116,3,FALSE)","v":"Acroneuria"},{"$f":"VLOOKUP(D22,'Acute Dataset'!N$5:Q$116,4,FALSE)","v":"Invert"},null,null,null,null,null,1,{"$f":"IF(VLOOKUP(N22,'Chronic Dataset'!M$5:O$43,2,FALSE) =\">\",\">\",\"\")","v":""},{"$f":"SMALL('Chronic Dataset'!$M$5:$M$43,L22)","v":1739.0511474491395},{"$f":"VLOOKUP(N22,'Chronic Dataset'!M$5:O$43,3,FALSE)","v":"Lampsilis"},{"$f":"VLOOKUP(N22,'Chronic Dataset'!M$5:P$43,4,FALSE)","v":"Mollusk"}]
[null,6,{"$f":"IF(VLOOKUP(D23,'Acute Dataset'!N$5:P$116,2,)=\">\",\">\",\"\")","v":""},{"$f":"SMALL('Acute Dataset'!N$5:N$116,'Summary Sheet'!B23)","v":23464.219042132667},{"$f":"VLOOKUP(D23,'Acute Dataset'!N$5:P$116,3,FALSE)","v":"Micropterus"},{"$f":"VLOOKUP(D23,'Acute Dataset'!N$5:Q$116,4,FALSE)","v":"Fish"}]
[null,5,{"$f":"IF(VLOOKUP(D24,'Acute Dataset'!N$5:P$116,2,)=\">\",\">\",\"\")","v":""},{"$f":"SMALL('Acute Dataset'!N$5:N$116,'Summary Sheet'!B24)","v":21861.312148831548},{"$f":"VLOOKUP(D24,'Acute Dataset'!N$5:P$116,3,FALSE)","v":"Oncorhynchus"},{"$f":"VLOOKUP(D24,'Acute Dataset'!N$5:Q$116,4,FALSE)","v":"Fish"}]
[null,4,{"$f":"IF(VLOOKUP(D25,'Acute Dataset'!N$5:P$116,2,)=\">\",\">\",\"\")","v":""},{"$f":"SMALL('Acute Dataset'!N$5:N$116,'Summary Sheet'!B25)","v":20316.055364872027},{"$f":"VLOOKUP(D25,'Acute Dataset'!N$5:P$116,3,FALSE)","v":"Crangonyx"},{"$f":"VLOOKUP(D25,'Acute Dataset'!N$5:Q$116,4,FALSE)","v":"Invert"}]
[null,3,{"$f":"IF(VLOOKUP(D26,'Acute Dataset'!N$5:P$116,2,)=\">\",\">\",\"\")","v":""},{"$f":"SMALL('Acute Dataset'!N$5:N$116,'Summary Sheet'!B26)","v":17049.413903946021},{"$f":"VLOOKUP(D26,'Acute Dataset'!N$5:P$116,3,FALSE)","v":"Stenocypris"},{"$f":"VLOOKUP(D26,'Acute Dataset'!N$5:Q$116,4,FALSE)","v":"Invert"}]
[null,2,{"$f":"IF(VLOOKUP(D27,'Acute Dataset'!N$5:P$116,2,)=\">\",\">\",\"\")","v":""},{"$f":"SMALL('Acute Dataset'!N$5:N$116,'Summary Sheet'!B27)","v":12229.194012259193},{"$f":"VLOOKUP(D27,'Acute Dataset'!N$5:P$116,3,FALSE)","v":"Ceriodaphnia"},{"$f":"VLOOKUP(D27,'Acute Dataset'!N$5:Q$116,4,FALSE)","v":"Invert"}]
[null,1,{"$f":"IF(VLOOKUP(D28,'Acute Dataset'!N$5:P$116,2,)=\">\",\">\",\"\")","v":""},{"$f":"SMALL('Acute Dataset'!N$5:N$116,'Summary Sheet'!B28)","v":5560.1597238743243},{"$f":"VLOOKUP(D28,'Acute Dataset'!N$5:P$116,3,FALSE)","v":"Daphnia"},{"$f":"VLOOKUP(D28,'Acute Dataset'!N$5:Q$116,4,FALSE)","v":"Invert"}]
[]
[]
[null,null,"N","Rank","Genus","GMAV","ln(GMAV)","ln(GMAV)2","P=R/(N+1)","sqrt(P)",null,null,"N","Rank","Genus","GMCV","ln(GMCV)","ln(GMCV)2","P=R/(N+1)","sqrt(P)"]
[null,null,18,4,{"$f":"E25","v":"Crangonyx"},{"$f":"D25","v":20316.055364872027},{"$f":"LN(F32)","v":9.9191667571030901},{"$f":"G32^2","v":98.389869155219031},{"$f":"D32 / (C32+1)","v":0.21052631578947367},{"$f":"SQRT(I32)","v":0.45883146774112354},null,null,12,4,{"$f":"O19","v":"Salmo"},{"$f":"N19","v":3037.0283776868923},{"$f":"LN(P32)","v":8.0186348089885584},{"$f":"Q32^2","v":64.298504199922974},{"$f":"N32 / (M32+1)","v":0.30769230769230771},{"$f":"SQRT(S32)","v":0.55470019622522915}]
[null,null,null,3,{"$f":"E26","v":"Stenocypris"},{"$f":"D26","v":17049.413903946021},{"$f":"LN(F33)","v":9.7438711069856936},{"$f":"G33^2","v":94.94302414955061},{"$f":"D33 / (C32+1)","v":0.15789473684210525},{"$f":"SQRT(I33)","v":0.39735970711951313},null,null,null,3,{"$f":"O20","v":"Hyalella"},{"$f":"N20","v":2858.9220633720624},{"$f":"LN(P33)","v":7.9581999318500358},{"$f":"Q33^2","v":63.332946155297918},{"$f":"N33 / (M32+1)","v":0.23076923076923078},{"$f":"SQRT(S33)","v":0.48038446141526142}]
[null,null,null,2,{"$f":"E27","v":"Ceriodaphnia"},{"$f":"D27","v":12229.194012259193},{"$f":"LN(F34)","v":9.4115813239959945},{"$f":"G34^2","v":88.5778630181902},{"$f":"D34 / (C32+1)","v":0.10526315789473684},{"$f":"SQRT(I34)","v":0.32444284226152509},null,null,null,2,{"$f":"O21","v":"Ceriodaphnia"},{"$f":"N21","v":1972.1587208567291},{"$f":"LN(P34)","v":7.5868840191735183},{"$f":"Q34^2","v":57.560809120390516},{"$f":"N34 / (M32+1)","v":0.15384615384615385},{"$f":"SQRT(S34)","v":0.39223227027636809}]
[null,null,null,1,{"$f":"E28","v":"Daphnia"},{"$f":"D28","v":5560.1597238743243},{"$f":"LN(F35)","v":8.6233821141475318},{"$f":"G35^2","v":74.362719086599554},{"$f":"D35 / (C32+1)","v":5.2631578947368418E-2},{"$f":"SQRT(I35)","v":0.22941573387056177},null,null,null,1,{"$f":"O22","v":"Lampsilis"},{"$f":"N22","v":1739.0511474491395},{"$f":"LN(P35)","v":7.4610949259109134},{"$f":"Q35^2","v":55.667937493453579},{"$f":"N35 / (M32+1)","v":7.6923076923076927E-2},{"$f":"SQRT(S35)","v":0.27735009811261457}]
[null,null,null,"Sum:",null,null,{"$f":"SUM(G32:G35)","v":37.698001302232313},{"$f":"SUM(H32:H35)","v":356.27347540955941},{"$f":"SUM(I32:I35)","v":0.52631578947368418},{"$f":"SUM(J32:J35)","v":1.4100497509927237},null,null,null,"Sum:",null,null,{"$f":"SUM(Q32:Q35)","v":31.024813685923025},{"$f":"SUM(R32:R35)","v":240.86019696906499},{"$f":"SUM(S32:S35)","v":0.76923076923076938},{"$f":"SUM(T32:T35)","v":1.7046670260294734}]
[]
[null,null,null,"S2 =",{"$f":"(H36 - ((G36^2)/4)) / (I36 - ((J36^2)/4))","v":33.793393321214523},null,null,null,null,null,null,null,null,"S2 =",{"$f":"(R36 - ((Q36^2)/4)) / (S36 - ((T36^2)/4))","v":5.2722076014633217}]
[null,null,null,"L =",{"$f":" (G36 - (SQRT(E38) * J36)) / 4","v":7.3752720183002181},null,null,null,null,null,null,null,null,"L =",{"$f":" (Q36 - (SQRT(O38) * T36)) / 4","v":6.7776696457080297}]
[null,null,null,"A =",{"$f":" (SQRT(E38) * SQRT(0.05)) + E39","v":8.6751449605760111},null,null,null,null,null,null,null,null,"A =",{"$f":" (SQRT(O38) * SQRT(0.05)) + O39","v":7.2910996604843046}]
[null,null,null,"FAV =",{"$f":" EXP(E40)","v":5855.5485487011192},null,null,null,null,null,null,null,null,"FCV =",{"$f":" EXP(O40)","v":1467.1832138345687}]
[null,null,null,"CMC =",{"$f":"E41/2","v":2927.7742743505596}]

{"sheet":"Acute Dataset","index":2,"n_rows":122,"n_cols":19,"rows_kept":122,"cut":false,"hidden":false,"merged":[]}
[null,"Appendix A. Acceptable Acute Toxicity Data of Aluminum to Freshwater Aquatic Animals"]
[]
[null,"Species","Methoda","Hardness (mg/L as CaCO3)","pH","DOC\n(mg/L)",null,"LC50 or EC50 Conc. (µg/L)","Reference",null,"Normalized Conc. - LC50\n(µg/L)",null,"Species Mean Acute Value\n(µg/L)","Genus Mean Acute Value\n(µg/L)",null,"Genus",null,"DOC Note","Dilution water"]
[]
[null,"Snail, Physa sp. ","S, M, T",47.4,6.59,1.1000000000000001,">",23400,"Call 1984; Call et al. 1984",">",{"$f":"EXP(LN(H5)-0.525*(LN(F5)-LN('Summary Sheet'!$C$6))-11.282*(E5-'Summary Sheet'!$C$4)-2.201*(LN(D5)-LN('Summary Sheet'!$C$5))+0.663*(E5^2-'Summary Sheet'!$C$4^2)+0.264*((E5*LN(D5)-'Summary Sheet'!$C$4*LN('Summary Sheet'!$C$5))))","v":80813.590252833223},null,"-",null,null,"Physa",null,"Value is from 2007 FW Cu AWQC Appendix C recommendation","Raw Lake Superior water"]
[null,"Snail, Physa sp. ","S, M, T",47.4,7.55,1.1000000000000001,null,30600,"Call 1984; Call et al. 1984",null,{"$f":"EXP(LN(H6)-0.525*(LN(F6)-LN('Summary Sheet'!$C$6))-11.282*(E6-'Summary Sheet'!$C$4)-2.201*(LN(D6)-LN('Summary Sheet'!$C$5))+0.663*(E6^2-'Summary Sheet'!$C$4^2)+0.264*((E6*LN(D6)-'Summary Sheet'!$C$4*LN('Summary Sheet'!$C$5))))","v":45035.251592470471},null,"-",null,null,"Physa",null,"Value is from 2007 FW Cu AWQC Appendix C recommendation","Raw Lake Superior water"]
[null,"Snail, Physa sp. ","S, M, T",47.4,8.17,1.1000000000000001,">",24700,"Call 1984; Call et al. 1984",">",{"$f":"EXP(LN(H7)-0.525*(LN(F7)-LN('Summary Sheet'!$C$6))-11.282*(E7-'Summary Sheet'!$C$4)-2.201*(LN(D7)-LN('Summary Sheet'!$C$5))+0.663*(E7^2-'Summary Sheet'!$C$4^2)+0.264*((E7*LN(D7)-'Summary Sheet'!$C$4*LN('Summary Sheet'!$C$5))))","v":40119.049560209212},null,"-",null,null,"Physa",null,"Value is from 2007 FW Cu AWQC Appendix C recommendation","Raw Lake Superior water"]
[null,"Snail, Physa sp. ","S, M, T",47.4,7.46,1.1000000000000001,null,55500,"Call 1984; Call et al. 1984",null,{"$f":"EXP(LN(H8)-0.525*(LN(F8)-LN('Summary Sheet'!$C$6))-11.282*(E8-'Summary Sheet'!$C$4)-2.201*(LN(D8)-LN('Summary Sheet'!$C$5))+0.663*(E8^2-'Summary Sheet'!$C$4^2)+0.264*((E8*LN(D8)-'Summary Sheet'!$C$4*LN('Summary Sheet'!$C$5))))","v":84005.393024822886},null,{"$f":"GEOMEAN(K5:K8)","v":59179.828139452191},{"$f":"M8","v":59179.828139452191},null,"Physa","Mollusk","Value is from 2007 FW Cu AWQC Appendix C recommendation","Raw Lake Superior water"]
[]
[null,"Fatmucket, Lampsilis siliquoidea","F, M, T",106,6.12,0.48,">",6302,"Wang et al. 2016; Wang et al. 2017",">",{"$f":"EXP(LN(H10)-0.525*(LN(F10)-LN('Summary Sheet'!$C$6))-11.282*(E10-'Summary Sheet'!$C$4)-2.201*(LN(D10)-LN('Summary Sheet'!$C$5))+0.663*(E10^2-'Summary Sheet'!$C$4^2)+0.264*((E10*LN(D10)-'Summary Sheet'!$C$4*LN('Summary Sheet'!$C$5))))","v":49787.874779829668},">",{"$f":"GEOMEAN(K10:K10)","v":49787.874779829668},{"$f":"M10","v":49787.874779829668},">","Lampsilis","Mollusk","Author reported"]
[]
[null,"Cladoceran, Ceriodaphnia dubia","S, M, A",50,7.42,1.1000000000000001,null,1900,"McCauley et al. 1986",null,{"$f":"EXP(LN(H12)-0.525*(LN(F12)-LN('Summary Sheet'!$C$6))-11.282*(E12-'Summary Sheet'!$C$4)-2.201*(LN(D12)-LN('Summary Sheet'!$C$5))+0.663*(E12^2-'Summary Sheet'!$C$4^2)+0.264*((E12*LN(D12)-'Summary Sheet'!$C$4*LN('Summary Sheet'!$C$5))))","v":2884.4603192674122},null,"-",null,null,"Ceriodaphnia",null,"Value is from 2007 FW Cu AWQC Appendix C recommendation","Lake Superior water"]
[null,"Cladoceran, Ceriodaphnia dubia","S, M, A",50.5,7.86,1.1000000000000001,null,1500,"McCauley et al. 1986",null,{"$f":"EXP(LN(H13)-0.525*(LN(F13)-LN('Summary Sheet'!$C$6))-11.282*(E13-'Summary Sheet'!$C$4)-2.201*(LN(D13)-LN('Summary Sheet'!$C$5))+0.663*(E13^2-'Summary Sheet'!$C$4^2)+0.264*((E13*LN(D13)-'Summary Sheet'!$C$4*LN('Summary Sheet'!$C$5))))","v":2158.7252569290463},null,"-",null,null,"Ceriodaphnia",null,"Value is from 2007 FW Cu AWQC Appendix C recommendation","UW-S Lake Superior lab water"]
[null,"Cladoceran, Ceriodaphnia dubia","S, M, A",50,8.1300000000000008,1.1000000000000001,null,2560,"McCauley et al. 1986",null,{"$f":"EXP(LN(H14)-0.525*(LN(F14)-LN('Summary Sheet'!$C$6))-11.282*(E14-'Summary Sheet'!$C$4)-2.201*(LN(D14)-LN('Summary Sheet'!$C$5))+0.663*(E14^2-'Summary Sheet'!$C$4^2)+0.264*((E14*LN(D14)-'Summary Sheet'!$C$4*LN('Summary Sheet'!$C$5))))","v":4056.79106304368},null,"-",null,null,"Ceriodaphnia",null,"Value is from 2007 FW Cu AWQC Appendix C recommendation","Lake Superior water"]
[null,"Cladoceran, Ceriodaphnia dubia","R, M, T",26,7.5,0.5,null,720,"ENSR 1992d",null,{"$f":"EXP(LN(H15)-0.525*(LN(F15)-LN('Summary Sheet'!$C$6))-11.282*(E15-'Summary Sheet'!$C$4)-2.201*(LN(D15)-LN('Summary Sheet'!$C$5))+0.663*(E15^2-'Summary Sheet'!$C$4^2)+0.264*((E15*LN(D15)-'Summary Sheet'!$C$4*LN('Summary Sheet'!$C$5))))","v":1856.8034876731608},null,"-",null,null,"Ceriodaphnia",null,"Value is from 2007 FW Cu AWQC Appendix C recommendation","Lab Recon water"]
[null,"Cladoceran, Ceriodaphnia dubia","R, M, T",46,7.6,0.5,null,1880,"ENSR 1992d",null,{"$f":"EXP(LN(H16)-0.525*(LN(F16)-LN('Summary Sheet'!$C$6))-11.282*(E16-'Summary Sheet'!$C$4)-2.201*(LN(D16)-LN('Summary Sheet'!$C$5))+0.663*(E16^2-'Summary Sheet'!$C$4^2)+0.264*((E16*LN(D16)-'Summary Sheet'!$C$4*LN('Summary Sheet'!$C$5))))","v":4164.299262893066},null,"-",null,null,"Ceriodaphnia",null,"Value is from 2007 FW Cu AWQC Appendix C recommendation","Lab Recon water"]
[null,"Cladoceran, Ceriodaphnia dubia","R, M, T",96,7.8,0.5,null,2450,"ENSR 1992d",null,{"$f":"EXP(LN(H17)-0.525*(LN(F17)-LN('Summary Sheet'!$C$6))-11.282*(E17-'Summary Sheet'!$C$4)-2.201*(LN(D17)-LN('Summary Sheet'!$C$5))+0.663*(E17^2-'Summary Sheet'!$C$4^2)+0.264*((E17*LN(D17)-'Summary Sheet'!$C$4*LN('Summary Sheet'!$C$5))))","v":4829.9364352889788},null,"-",null,null,"Ceriodaphnia",null,"Value is from 2007 FW Cu AWQC Appendix C recommendation","Lab Recon water"]
[null,"Cladoceran, Ceriodaphnia dubia","S, U, NR",90,7.15,0.5,null,3727,"Fort and Stover 1995",null,{"$f":"EXP(LN(H18)-0.525*(LN(F18)-LN('Summary Sheet'!$C$6))-11.282*(E18-'Summary Sheet'!$C$4)-2.201*(LN(D18)-LN('Summary Sheet'!$C$5))+0.663*(E18^2-'Summary Sheet'!$C$4^2)+0.264*((E18*LN(D18)-'Summary Sheet'!$C$4*LN('Summary Sheet'!$C$5))))","v":8347.2373346496042},null,"-",null,null,"Ceriodaphnia",null,"Value is from 2007 FW Cu AWQC Appendix C recommendation","Mod Hard Recon"]
[null,"Cladoceran, Ceriodaphnia dubia","S, U, NR",90,7.15,0.5,null,5673,"Fort and Stover 1995",null,{"$f":"EXP(LN(H19)-0.525*(LN(F19)-LN('Summary Sheet'!$C$6))-11.282*(E19-'Summary Sheet'!$C$4)-2.201*(LN(D19)-LN('Summary Sheet'!$C$5))+0.663*(E19^2-'Summary Sheet'!$C$4^2)+0.264*((E19*LN(D19)-'Summary Sheet'!$C$4*LN('Summary Sheet'!$C$5))))","v":12705.628494624994},null,"-",null,null,"Ceriodaphnia",null,"Value is from 2007 FW Cu AWQC Appendix C recommendation","Mod Hard Recon"]
[null,"Cladoceran, Ceriodaphnia dubia","S, U, NR",89,7.6,0.5,null,2880,"Soucek et al. 2001",null,{"$f":"EXP(LN(H20)-0.525*(LN(F20)-LN('Summary Sheet'!$C$6))-11.282*(E20-'Summary Sheet'!$C$4)-2.201*(LN(D20)-LN('Summary Sheet'!$C$5))+0.663*(E20^2-'Summary Sheet'!$C$4^2)+0.264*((E20*LN(D20)-'Summary Sheet'!$C$4*LN('Summary Sheet'!$C$5))))","v":5610.4532683816824},null,"-",null,null,"Ceriodaphnia",null,"Value is from 2007 FW Cu AWQC Appendix C recommendation","Mod Hard Recon"]
[null,"Cladoceran, Ceriodaphnia dubia","S, U, T",10.6,6.01,0.5,null,71.12,"European Al Association 2009",null,{"$f":"EXP(LN(H21)-0.525*(LN(F21)-LN('Summary Sheet'!$C$6))-11.282*(E21-'Summary Sheet'!$C$4)-2.201*(LN(D21)-LN('Summary Sheet'!$C$5))+0.663*(E21^2-'Summary Sheet'!$C$4^2)+0.264*((E21*LN(D21)-'Summary Sheet'!$C$4*LN('Summary Sheet'!$C$5))))","v":2822.5908499207517},null,"-",null,null,"Ceriodaphnia",null,"Value is from 2007 FW Cu AWQC Appendix C recommendation","Recon"]
[null,"Cladoceran, Ceriodaphnia dubia","S, U, T",10.6,6.05,2,null,686.5,"European Al Association 2009",null,{"$f":"EXP(LN(H22)-0.525*(LN(F22)-LN('Summary Sheet'!$C$6))-11.282*(E22-'Summary Sheet'!$C$4)-2.201*(LN(D22)-LN('Summary Sheet'!$C$5))+0.663*(E22^2-'Summary Sheet'!$C$4^2)+0.264*((E22*LN(D22)-'Summary Sheet'!$C$4*LN('Summary Sheet'!$C$5))))","v":11829.188950562166},null,"-",null,null,"Ceriodaphnia",null,"Author reported"]
[null,"Cladoceran, Ceriodaphnia dubia","S, U, T",10.6,6.09,4,null,1558.1,"European Al Association 2009",null,{"$f":"EXP(LN(H23)-0.525*(LN(F23)-LN('Summary Sheet'!$C$6))-11.282*(E23-'Summary Sheet'!$C$4)-2.201*(LN(D23)-LN('Summary Sheet'!$C$5))+0.663*(E23^2-'Summary Sheet'!$C$4^2)+0.264*((E23*LN(D23)-'Summary Sheet'!$C$4*LN('Summary Sheet'!$C$5))))","v":16808.546031355789},null,"-",null,null,"Ceriodaphnia",null,"Author reported"]
[null,"Cladoceran, Ceriodaphnia dubia","S, U, T",10.6,6.01,0.5,null,68.099999999999994,"European Al Association 2009",null,{"$f":"EXP(LN(H24)-0.525*(LN(F24)-LN('Summary Sheet'!$C$6))-11.282*(E24-'Summary Sheet'!$C$4)-2.201*(LN(D24)-LN('Summary Sheet'!$C$5))+0.663*(E24^2-'Summary Sheet'!$C$4^2)+0.264*((E24*LN(D24)-'Summary Sheet'!$C$4*LN('Summary Sheet'!$C$5))))","v":2702.7339268785636},null,"-",null,null,"Ceriodaphnia",null,"Value is from 2007 FW Cu AWQC Appendix C recommendation","Recon"]
[null,"Cladoceran, Ceriodaphnia dubia","S, U, T",10.6,6.03,0.5,null,163,"European Al Association 2009",null,{"$f":"EXP(LN(H25)-0.525*(LN(F25)-LN('Summary Sheet'!$C$6))-11.282*(E25-'Summary Sheet'!$C$4)-2.201*(LN(D25)-LN('Summary Sheet'!$C$5))+0.663*(E25^2-'Summary Sheet'!$C$4^2)+0.264*((E25*LN(D25)-'Summary Sheet'!$C$4*LN('Summary Sheet'!$C$5))))","v":6131.9482583399249},null,"-",null,null,"Ceriodaphnia",null,"Value is from 2007 FW Cu AWQC Appendix C recommendation","Recon"]
[null,"Cladoceran, Ceriodaphnia dubia","S, U, T",10.6,5.97,0.5,null,178.5,"European Al Association 2009",null,{"$f":"EXP(LN(H26)-0.525*(LN(F26)-LN('Summary Sheet'!$C$6))-11.282*(E26-'Summary Sheet'!$C$4)-2.201*(LN(D26)-LN('Summary Sheet'!$C$5))+0.663*(E26^2-'Summary Sheet'!$C$4^2)+0.264*((E26*LN(D26)-'Summary Sheet'!$C$4*LN('Summary Sheet'!$C$5))))","v":7897.2531464921958},null,"-",null,null,"Ceriodaphnia",null,"Value is from 2007 FW Cu AWQC Appendix C recommendation","Recon"]
[null,"Cladoceran, Ceriodaphnia dubia","S, U, T",10.6,5.92,0.5,null,141,"European Al Association 2009",null,{"$f":"EXP(LN(H27)-0.525*(LN(F27)-LN('Summary Sheet'!$C$6))-11.282*(E27-'Summary Sheet'!$C$4)-2.201*(LN(D27)-LN('Summary Sheet'!$C$5))+0.663*(E27^2-'Summary Sheet'!$C$4^2)+0.264*((E27*LN(D27)-'Summary Sheet'!$C$4*LN('Summary Sheet'!$C$5))))","v":7166.873542027728},null,"-",null,null,"Ceriodaphnia",null,"Value is from 2007 FW Cu AWQC Appendix C recommendation","Recon"]
[null,"Cladoceran, Ceriodaphnia dubia","S, U, T",10.6,6.99,0.5,">",1300,"European Al Association 2009",">",{"$f":"EXP(LN(H28)-0.525*(LN(F28)-LN('Summary Sheet'!$C$6))-11.282*(E28-'Summary Sheet'!$C$4)-2.201*(LN(D28)-LN('Summary Sheet'!$C$5))+0.663*(E28^2-'Summary Sheet'!$C$4^2)+0.264*((E28*LN(D28)-'Summary Sheet'!$C$4*LN('Summary Sheet'!$C$5))))","v":6989.9003753147817},null,"-",null,null,"Ceriodaphnia",null,"Value is from 2007 FW Cu AWQC Appendix C recommendation","Recon"]
[null,"Cladoceran, Ceriodaphnia dubia","S, U, T",10.6,7.85,0.5,">",5000,"European Al Association 2009",">",{"$f":"EXP(LN(H29)-0.525*(LN(F29)-LN('Summary Sheet'!$C$6))-11.282*(E29-'Summary Sheet'!$C$4)-2.201*(LN(D29)-LN('Summary Sheet'!$C$5))+0.663*(E29^2-'Summary Sheet'!$C$4^2)+0.264*((E29*LN(D29)-'Summary Sheet'!$C$4*LN('Summary Sheet'!$C$5))))","v":13283.191567687543},null,"-",null,null,"Ceriodaphnia",null,"Value is from 2007 FW Cu AWQC Appendix C recommendation","Recon"]
[null,"Cladoceran, Ceriodaphnia dubia","S, U, T",10.6,6.8,2,">",10000,"European Al Association 2009",">",{"$f":"EXP(LN(H30)-0.525*(LN(F30)-LN('Summary Sheet'!$C$6))-11.282*(E30-'Summary Sheet'!$C$4)-2.201*(LN(D30)-LN('Summary Sheet'!$C$5))+0.663*(E30^2-'Summary Sheet'!$C$4^2)+0.264*((E30*LN(D30)-'Summary Sheet'!$C$4*LN('Summary Sheet'!$C$5))))","v":34636.770740713087},null,"-",null,null,"Ceriodaphnia",null,"Author reported"]
[null,"Cladoceran, Ceriodaphnia dubia","S, U, T",10.6,7.82,2,">",15000,"European Al Association 2009",">",{"$f":"EXP(LN(H31)-0.525*(LN(F31)-LN('Summary Sheet'!$C$6))-11.282*(E31-'Summary Sheet'!$C$4)-2.201*(LN(D31)-LN('Summary Sheet'!$C$5))+0.663*(E31^2-'Summary Sheet'!$C$4^2)+0.264*((E31*LN(D31)-'Summary Sheet'!$C$4*LN('Summary Sheet'!$C$5))))","v":19402.325489096667},null,"-",null,null,"Ceriodaphnia",null,"Author reported"]
[null,"Cladoceran, Ceriodaphnia dubia","S, U, T",10.6,6.77,4,">",10000,"European Al Association 2009",">",{"$f":"EXP(LN(H32)-0.525*(LN(F32)-LN('Summary Sheet'!$C$6))-11.282*(E32-'Summary Sheet'!$C$4)-2.201*(LN(D32)-LN('Summary Sheet'!$C$5))+0.663*(E32^2-'Summary Sheet'!$C$4^2)+0.264*((E32*LN(D32)-'Summary Sheet'!$C$4*LN('Summary Sheet'!$C$5))))","v":25301.617397506616},null,"-",null,null,"Ceriodaphnia",null,"Author reported"]
[null,"Cladoceran, Ceriodaphnia dubia","S, U, T",10.6,7.66,4,">",15000,"European Al Association 2009",">",{"$f":"EXP(LN(H33)-0.525*(LN(F33)-LN('Summary Sheet'!$C$6))-11.282*(E33-'Summary Sheet'!$C$4)-2.201*(LN(D33)-LN('Summary Sheet'!$C$5))+0.663*(E33^2-'Summary Sheet'!$C$4^2)+0.264*((E33*LN(D33)-'Summary Sheet'!$C$4*LN('Summary Sheet'!$C$5))))","v":14364.642232996222},null,"-",null,null,"Ceriodaphnia",null,"Author reported"]
[null,"Cladoceran, Ceriodaphnia dubia","S, U, T",10.6,7.9,0.5,">",2000,"European Al Association 2009",">",{"$f":"EXP(LN(H34)-0.525*(LN(F34)-LN('Summary Sheet'!$C$6))-11.282*(E34-'Summary Sheet'!$C$4)-2.201*(LN(D34)-LN('Summary Sheet'!$C$5))+0.663*(E34^2-'Summary Sheet'!$C$4^2)+0.264*((E34*LN(D34)-'Summary Sheet'!$C$4*LN('Summary Sheet'!$C$5))))","v":5256.074655830992},null,"-",null,null,"Ceriodaphnia",null,"Value is from 2007 FW Cu AWQC Appendix C recommendation","Recon"]
[null,"Cladoceran, Ceriodaphnia dubia","S, U, T",10.6,7.89,0.5,">",2000,"European Al Association 2009",">",{"$f":"EXP(LN(H35)-0.525*(LN(F35)-LN('Summary Sheet'!$C$6))-11.282*(E35-'Summary Sheet'!$C$4)-2.201*(LN(D35)-LN('Summary Sheet'!$C$5))+0.663*(E35^2-'Summary Sheet'!$C$4^2)+0.264*((E35*LN(D35)-'Summary Sheet'!$C$4*LN('Summary Sheet'!$C$5))))","v":5266.0688237499808},null,"-",null,null,"Ceriodaphnia",null,"Value is from 2007 FW Cu AWQC Appendix C recommendation","Recon"]
[null,"Cladoceran, Ceriodaphnia dubia","S, U, T",60,6.04,0.5,null,110.8,"European Al Association 2009",null,{"$f":"EXP(LN(H36)-0.525*(LN(F36)-LN('Summary Sheet'!$C$6))-11.282*(E36-'Summary Sheet'!$C$4)-2.201*(LN(D36)-LN('Summary Sheet'!$C$5))+0.663*(E36^2-'Summary Sheet'!$C$4^2)+0.264*((E36*LN(D36)-'Summary Sheet'!$C$4*LN('Summary Sheet'!$C$5))))","v":1418.5962625712389},null,"-",null,null,"Ceriodaphnia",null,"Value is from 2007 FW Cu AWQC Appendix C recommendation","Recon"]
[null,"Cladoceran, Ceriodaphnia dubia","S, U, T",60,5.98,2,null,1137.0999999999999,"European Al Association 2009",null,{"$f":"EXP(LN(H37)-0.525*(LN(F37)-LN('Summary Sheet'!$C$6))-11.282*(E37-'Summary Sheet'!$C$4)-2.201*(LN(D37)-LN('Summary Sheet'!$C$5))+0.663*(E37^2-'Summary Sheet'!$C$4^2)+0.264*((E37*LN(D37)-'Summary Sheet'!$C$4*LN('Summary Sheet'!$C$5))))","v":8038.8251272112775},null,"-",null,null,"Ceriodaphnia",null,"Author reported"]
[null,"Cladoceran, Ceriodaphnia dubia","S, U, T",60,5.73,4,null,8046.7,"European Al Association 2009",null,{"$f":"EXP(LN(H38)-0.525*(LN(F38)-LN('Summary Sheet'!$C$6))-11.282*(E38-'Summary Sheet'!$C$4)-2.201*(LN(D38)-LN('Summary Sheet'!$C$5))+0.663*(E38^2-'Summary Sheet'!$C$4^2)+0.264*((E38*LN(D38)-'Summary Sheet'!$C$4*LN('Summary Sheet'!$C$5))))","v":72711.702476621125},null,"-",null,null,"Ceriodaphnia",null,"Author reported"]
[null,"Cladoceran, Ceriodaphnia dubia","S, U, T",60,6.71,0.5,">",10000,"European Al Association 2009",">",{"$f":"EXP(LN(H39)-0.525*(LN(F39)-LN('Summary Sheet'!$C$6))-11.282*(E39-'Summary Sheet'!$C$4)-2.201*(LN(D39)-LN('Summary Sheet'!$C$5))+0.663*(E39^2-'Summary Sheet'!$C$4^2)+0.264*((E39*LN(D39)-'Summary Sheet'!$C$4*LN('Summary Sheet'!$C$5))))","v":39695.054137847481},null,"-",null,null,"Ceriodaphnia",null,"Value is from 2007 FW Cu AWQC Appendix C recommendation","Recon"]
[null,"Cladoceran, Ceriodaphnia dubia","S, U, T",60,7.83,0.5,">",5000,"European Al Association 2009",">",{"$f":"EXP(LN(H40)-0.525*(LN(F40)-LN('Summary Sheet'!$C$6))-11.282*(E40-'Summary Sheet'!$C$4)-2.201*(LN(D40)-LN('Summary Sheet'!$C$5))+0.663*(E40^2-'Summary Sheet'!$C$4^2)+0.264*((E40*LN(D40)-'Summary Sheet'!$C$4*LN('Summary Sheet'!$C$5))))","v":10587.537677182503},null,"-",null,null,"Ceriodaphnia",null,"Value is from 2007 FW Cu AWQC Appendix C recommendation","Recon"]
[null,"Cladoceran, Ceriodaphnia dubia","S, U, T",60,6.79,2,">",10000,"European Al Association 2009",">",{"$f":"EXP(LN(H41)-0.525*(LN(F41)-LN('Summary Sheet'!$C$6))-11.282*(E41-'Summary Sheet'!$C$4)-2.201*(LN(D41)-LN('Summary Sheet'!$C$5))+0.663*(E41^2-'Summary Sheet'!$C$4^2)+0.264*((E41*LN(D41)-'Summary Sheet'!$C$4*LN('Summary Sheet'!$C$5))))","v":17346.220023706937},null,"-",null,null,"Ceriodaphnia",null,"Author reported"]
[null,"Cladoceran, Ceriodaphnia dubia","S, U, T",60,7.67,2,">",15000,"European Al Association 2009",">",{"$f":"EXP(LN(H42)-0.525*(LN(F42)-LN('Summary Sheet'!$C$6))-11.282*(E42-'Summary Sheet'!$C$4)-2.201*(LN(D42)-LN('Summary Sheet'!$C$5))+0.663*(E42^2-'Summary Sheet'!$C$4^2)+0.264*((E42*LN(D42)-'Summary Sheet'!$C$4*LN('Summary Sheet'!$C$5))))","v":15156.360114401185},null,"-",null,null,"Ceriodaphnia",null,"Author reported"]
[null,"Cladoceran, Ceriodaphnia dubia","S, U, T",60,6.68,4,">",15000,"European Al Association 2009",">",{"$f":"EXP(LN(H43)-0.525*(LN(F43)-LN('Summary Sheet'!$C$6))-11.282*(E43-'Summary Sheet'!$C$4)-2.201*(LN(D43)-LN('Summary Sheet'!$C$5))+0.663*(E43^2-'Summary Sheet'!$C$4^2)+0.264*((E43*LN(D43)-'Summary Sheet'!$C$4*LN('Summary Sheet'!$C$5))))","v":20794.542839848025},null,"-",null,null,"Ceriodaphnia",null,"Author reported"]
[null,"Cladoceran, Ceriodaphnia dubia","S, U, T",60,7.62,4,">",15000,"European Al Association 2009",">",{"$f":"EXP(LN(H44)-0.525*(LN(F44)-LN('Summary Sheet'!$C$6))-11.282*(E44-'Summary Sheet'!$C$4)-2.201*(LN(D44)-LN('Summary Sheet'!$C$5))+0.663*(E44^2-'Summary Sheet'!$C$4^2)+0.264*((E44*LN(D44)-'Summary Sheet'!$C$4*LN('Summary Sheet'!$C$5))))","v":10566.7167861869},null,"-",null,null,"Ceriodaphnia",null,"Author reported"]
[null,"Cladoceran, Ceriodaphnia dubia","S, U, T",120,6.06,2,null,3386.8,"European Al Association 2009",null,{"$f":"EXP(LN(H45)-0.525*(LN(F45)-LN('Summary Sheet'!$C$6))-11.282*(E45-'Summary Sheet'!$C$4)-2.201*(LN(D45)-LN('Summary Sheet'!$C$5))+0.663*(E45^2-'Summary Sheet'!$C$4^2)+0.264*((E45*LN(D45)-'Summary Sheet'!$C$4*LN('Summary Sheet'!$C$5))))","v":13217.069039275691},null,"-",null,null,"Ceriodaphnia",null,"Author reported"]
[null,"Cladoceran, Ceriodaphnia dubia","S, U, T",120,5.6,4,null,10484.200000000001,"European Al Association 2009",null,{"$f":"EXP(LN(H46)-0.525*(LN(F46)-LN('Summary Sheet'!$C$6))-11.282*(E46-'Summary Sheet'!$C$4)-2.201*(LN(D46)-LN('Summary Sheet'!$C$5))+0.663*(E46^2-'Summary Sheet'!$C$4^2)+0.264*((E46*LN(D46)-'Summary Sheet'!$C$4*LN('Summary Sheet'!$C$5))))","v":81438.723244571287},null,"-",null,null,"Ceriodaphnia",null,"Author reported"]
[null,"Cladoceran, Ceriodaphnia dubia","S, U, T",120,6.93,0.5,">",5000,"European Al Association 2009",">",{"$f":"EXP(LN(H47)-0.525*(LN(F47)-LN('Summary Sheet'!$C$6))-11.282*(E47-'Summary Sheet'!$C$4)-2.201*(LN(D47)-LN('Summary Sheet'!$C$5))+0.663*(E47^2-'Summary Sheet'!$C$4^2)+0.264*((E47*LN(D47)-'Summary Sheet'!$C$4*LN('Summary Sheet'!$C$5))))","v":11892.156153275484},null,"-",null,null,"Ceriodaphnia",null,"Value is from 2007 FW Cu AWQC Appendix C recommendation","Recon"]
[null,"Cladoceran, Ceriodaphnia dubia","S, U, T",120,7.88,0.5,">",5000,"European Al Association 2009",">",{"$f":"EXP(LN(H48)-0.525*(LN(F48)-LN('Summary Sheet'!$C$6))-11.282*(E48-'Summary Sheet'!$C$4)-2.201*(LN(D48)-LN('Summary Sheet'!$C$5))+0.663*(E48^2-'Summary Sheet'!$C$4^2)+0.264*((E48*LN(D48)-'Summary Sheet'!$C$4*LN('Summary Sheet'!$C$5))))","v":9842.9992366145871},null,"-",null,null,"Ceriodaphnia",null,"Value is from 2007 FW Cu AWQC Appendix C recommendation","Recon"]
[null,"Cladoceran, Ceriodaphnia dubia","S, U, T",120,6.76,2,">",15000,"European Al Association 2009",">",{"$f":"EXP(LN(H49)-0.525*(LN(F49)-LN('Summary Sheet'!$C$6))-11.282*(E49-'Summary Sheet'!$C$4)-2.201*(LN(D49)-LN('Summary Sheet'!$C$5))+0.663*(E49^2-'Summary Sheet'!$C$4^2)+0.264*((E49*LN(D49)-'Summary Sheet'!$C$4*LN('Summary Sheet'!$C$5))))","v":20221.861176366794},null,"-",null,null,"Ceriodaphnia",null,"Author reported"]
[null,"Cladoceran, Ceriodaphnia dubia","S, U, T",120,7.71,2,">",15000,"European Al Association 2009",">",{"$f":"EXP(LN(H50)-0.525*(LN(F50)-LN('Summary Sheet'!$C$6))-11.282*(E50-'Summary Sheet'!$C$4)-2.201*(LN(D50)-LN('Summary Sheet'!$C$5))+0.663*(E50^2-'Summary Sheet'!$C$4^2)+0.264*((E50*LN(D50)-'Summary Sheet'!$C$4*LN('Summary Sheet'!$C$5))))","v":13510.898887799358},null,"-",null,null,"Ceriodaphnia",null,"Author reported"]
[null,"Cladoceran, Ceriodaphnia dubia","S, U, T",120,6.6,4,">",15000,"European Al Association 2009",">",{"$f":"EXP(LN(H51)-0.525*(LN(F51)-LN('Summary Sheet'!$C$6))-11.282*(E51-'Summary Sheet'!$C$4)-2.201*(LN(D51)-LN('Summary Sheet'!$C$5))+0.663*(E51^2-'Summary Sheet'!$C$4^2)+0.264*((E51*LN(D51)-'Summary Sheet'!$C$4*LN('Summary Sheet'!$C$5))))","v":16920.561423003681},null,"-",null,null,"Ceriodaphnia",null,"Author reported"]
[null,"Cladoceran, Ceriodaphnia dubia","S, U, T",120,7.6,4,">",15000,"European Al Association 2009",">",{"$f":"EXP(LN(H52)-0.525*(LN(F52)-LN('Summary Sheet'!$C$6))-11.282*(E52-'Summary Sheet'!$C$4)-2.201*(LN(D52)-LN('Summary Sheet'!$C$5))+0.663*(E52^2-'Summary Sheet'!$C$4^2)+0.264*((E52*LN(D52)-'Summary Sheet'!$C$4*LN('Summary Sheet'!$C$5))))","v":9253.7359340837193},null,"-",null,null,"Ceriodaphnia",null,"Author reported"]
[null,"Cladoceran, Ceriodaphnia dubia","S, M, T",10.6,6.03,0.5,null,119.71,"European Al Association 2010",null,{"$f":"EXP(LN(H53)-0.525*(LN(F53)-LN('Summary Sheet'!$C$6))-11.282*(E53-'Summary Sheet'!$C$4)-2.201*(LN(D53)-LN('Summary Sheet'!$C$5))+0.663*(E53^2-'Summary Sheet'!$C$4^2)+0.264*((E53*LN(D53)-'Summary Sheet'!$C$4*LN('Summary Sheet'!$C$5))))","v":4503.408135005333},null,"-",null,null,"Ceriodaphnia",null,"Value is from 2007 FW Cu AWQC Appendix C recommendation","Recon"]
[null,"Cladoceran, Ceriodaphnia dubia","S, M, T",10.6,6.03,0.5,null,274.77999999999997,"European Al Association 2010",null,{"$f":"EXP(LN(H54)-0.525*(LN(F54)-LN('Summary Sheet'!$C$6))-11.282*(E54-'Summary Sheet'!$C$4)-2.201*(LN(D54)-LN('Summary Sheet'!$C$5))+0.663*(E54^2-'Summary Sheet'!$C$4^2)+0.264*((E54*LN(D54)-'Summary Sheet'!$C$4*LN('Summary Sheet'!$C$5))))","v":10337.035229611285},null,"-",null,null,"Ceriodaphnia",null,"Value is from 2007 FW Cu AWQC Appendix C recommendation","Recon"]
[null,"Cladoceran, Ceriodaphnia dubia","S, M, T",10.6,6.03,0.5,null,119.98,"European Al Association 2010",null,{"$f":"EXP(LN(H55)-0.525*(LN(F55)-LN('Summary Sheet'!$C$6))-11.282*(E55-'Summary Sheet'!$C$4)-2.201*(LN(D55)-LN('Summary Sheet'!$C$5))+0.663*(E55^2-'Summary Sheet'!$C$4^2)+0.264*((E55*LN(D55)-'Summary Sheet'!$C$4*LN('Summary Sheet'!$C$5))))","v":4513.5653499118043},null,"-",null,null,"Ceriodaphnia",null,"Value is from 2007 FW Cu AWQC Appendix C recommendation","Recon"]
[null,"Cladoceran, Ceriodaphnia dubia","S, M, T",10.6,6.07,0.5,null,92.495000000000005,"European Al Association 2010",null,{"$f":"EXP(LN(H56)-0.525*(LN(F56)-LN('Summary Sheet'!$C$6))-11.282*(E56-'Summary Sheet'!$C$4)-2.201*(LN(D56)-LN('Summary Sheet'!$C$5))+0.663*(E56^2-'Summary Sheet'!$C$4^2)+0.264*((E56*LN(D56)-'Summary Sheet'!$C$4*LN('Summary Sheet'!$C$5))))","v":3131.3353076743674},null,"-",null,null,"Ceriodaphnia",null,"Value is from 2007 FW Cu AWQC Appendix C recommendation","Recon"]
[null,"Cladoceran, Ceriodaphnia dubia","S, M, T",10.6,6.09,0.5,null,313.37,"European Al Association 2010",null,{"$f":"EXP(LN(H57)-0.525*(LN(F57)-LN('Summary Sheet'!$C$6))-11.282*(E57-'Summary Sheet'!$C$4)-2.201*(LN(D57)-LN('Summary Sheet'!$C$5))+0.663*(E57^2-'Summary Sheet'!$C$4^2)+0.264*((E57*LN(D57)-'Summary Sheet'!$C$4*LN('Summary Sheet'!$C$5))))","v":10071.971333662072},null,"-",null,null,"Ceriodaphnia",null,"Value is from 2007 FW Cu AWQC Appendix C recommendation","Recon"]
[null,"Cladoceran, Ceriodaphnia dubia","S, M, T",10.6,6.1,0.5,null,332.35,"European Al Association 2010",null,{"$f":"EXP(LN(H58)-0.525*(LN(F58)-LN('Summary Sheet'!$C$6))-11.282*(E58-'Summary Sheet'!$C$4)-2.201*(LN(D58)-LN('Summary Sheet'!$C$5))+0.663*(E58^2-'Summary Sheet'!$C$4^2)+0.264*((E58*LN(D58)-'Summary Sheet'!$C$4*LN('Summary Sheet'!$C$5))))","v":10410.270163763231},null,"-",null,null,"Ceriodaphnia",null,"Value is from 2007 FW Cu AWQC Appendix C recommendation","Recon"]
[null,"Cladoceran, Ceriodaphnia dubia","S, M, T",10.6,7.08,0.5,">",886.4,"European Al Association 2010",">",{"$f":"EXP(LN(H59)-0.525*(LN(F59)-LN('Summary Sheet'!$C$6))-11.282*(E59-'Summary Sheet'!$C$4)-2.201*(LN(D59)-LN('Summary Sheet'!$C$5))+0.663*(E59^2-'Summary Sheet'!$C$4^2)+0.264*((E59*LN(D59)-'Summary Sheet'!$C$4*LN('Summary Sheet'!$C$5))))","v":4228.2401542081188},null,"-",null,null,"Ceriodaphnia",null,"Value is from 2007 FW Cu AWQC Appendix C recommendation","Recon"]
[null,"Cladoceran, Ceriodaphnia dubia","S, M, T",10.6,7.79,0.5,">",4278.3,"European Al Association 2010",">",{"$f":"EXP(LN(H60)-0.525*(LN(F60)-LN('Summary Sheet'!$C$6))-11.282*(E60-'Summary Sheet'!$C$4)-2.201*(LN(D60)-LN('Summary Sheet'!$C$5))+0.663*(E60^2-'Summary Sheet'!$C$4^2)+0.264*((E60*LN(D60)-'Summary Sheet'!$C$4*LN('Summary Sheet'!$C$5))))","v":11564.986619297413},null,"-",null,null,"Ceriodaphnia",null,"Value is from 2007 FW Cu AWQC Appendix C recommendation","Recon"]
[null,"Cladoceran, Ceriodaphnia dubia","S, M, T",10.6,7.53,0.5,null,132.04,"European Al Association 2010",null,{"$f":"EXP(LN(H61)-0.525*(LN(F61)-LN('Summary Sheet'!$C$6))-11.282*(E61-'Summary Sheet'!$C$4)-2.201*(LN(D61)-LN('Summary Sheet'!$C$5))+0.663*(E61^2-'Summary Sheet'!$C$4^2)+0.264*((E61*LN(D61)-'Summary Sheet'!$C$4*LN('Summary Sheet'!$C$5))))","v":406.64505028214177},null,"-",null,null,"Ceriodaphnia",null,"Value is from 2007 FW Cu AWQC Appendix C recommendation","Recon"]
[null,"Cladoceran, Ceriodaphnia dubia","S, M, T",60,6.01,0.5,null,463.26,"European Al Association 2010",null,{"$f":"EXP(LN(H62)-0.525*(LN(F62)-LN('Summary Sheet'!$C$6))-11.282*(E62-'Summary Sheet'!$C$4)-2.201*(LN(D62)-LN('Summary Sheet'!$C$5))+0.663*(E62^2-'Summary Sheet'!$C$4^2)+0.264*((E62*LN(D62)-'Summary Sheet'!$C$4*LN('Summary Sheet'!$C$5))))","v":6338.1555505427577},null,"-",null,null,"Ceriodaphnia",null,"Value is from 2007 FW Cu AWQC Appendix C recommendation","Recon"]
[null,"Cladoceran, Ceriodaphnia dubia","S, M, T",60,5.99,0.5,">",859,"European Al Association 2010",">",{"$f":"EXP(LN(H63)-0.525*(LN(F63)-LN('Summary Sheet'!$C$6))-11.282*(E63-'Summary Sheet'!$C$4)-2.201*(LN(D63)-LN('Summary Sheet'!$C$5))+0.663*(E63^2-'Summary Sheet'!$C$4^2)+0.264*((E63*LN(D63)-'Summary Sheet'!$C$4*LN('Summary Sheet'!$C$5))))","v":12292.26416251945},null,{"$f":"GEOMEAN(K12:K63)","v":8501.0873742494587},null,null,"Ceriodaphnia",null,"Value is from 2007 FW Cu AWQC Appendix C recommendation","Recon"]
[]
[null,"Cladoceran, Ceriodaphnia reticulata","F, M, T",45.1,6,1.1000000000000001,null,304,"Shephard 1983",null,{"$f":"EXP(LN(H65)-0.525*(LN(F65)-LN('Summary Sheet'!$C$6))-11.282*(E65-'Summary Sheet'!$C$4)-2.201*(LN(D65)-LN('Summary Sheet'!$C$5))+0.663*(E65^2-'Summary Sheet'!$C$4^2)+0.264*((E65*LN(D65)-'Summary Sheet'!$C$4*LN('Summary Sheet'!$C$5))))","v":3353.1554179303066},null,"-",null,null,"Ceriodaphnia",null,"Value is from 2007 FW Cu AWQC Appendix C recommendation","Lake Superior water"]
[null,"Cladoceran, Ceriodaphnia reticulata","F, M, T",4,5.5,1.1000000000000001,null,362,"Shephard 1983",null,{"$f":"EXP(LN(H66)-0.525*(LN(F66)-LN('Summary Sheet'!$C$6))-11.282*(E66-'Summary Sheet'!$C$4)-2.201*(LN(D66)-LN('Summary Sheet'!$C$5))+0.663*(E66^2-'Summary Sheet'!$C$4^2)+0.264*((E66*LN(D66)-'Summary Sheet'!$C$4*LN('Summary Sheet'!$C$5))))","v":92297.236287758002},null,{"$f":"GEOMEAN(K65:K66)","v":17592.241981006555},{"$f":"GEOMEAN(M12:M66)","v":12229.194012259193},null,"Ceriodaphnia","Invert","Value is from 2007 FW Cu AWQC Appendix C recommendation","Lake Superior/DI Mix"]
[]
[null,"Cladoceran, Daphnia magna","S, U, NR",45.3,7.74,1.1000000000000001,null,3900,"Biesinger and Christensen 1972",null,{"$f":"EXP(LN(H68)-0.525*(LN(F68)-LN('Summary Sheet'!$C$6))-11.282*(E68-'Summary Sheet'!$C$4)-2.201*(LN(D68)-LN('Summary Sheet'!$C$5))+0.663*(E68^2-'Summary Sheet'!$C$4^2)+0.264*((E68*LN(D68)-'Summary Sheet'!$C$4*LN('Summary Sheet'!$C$5))))","v":5644.1260913482884},null,"-",null,null,"Daphnia",null,"Value is from 2007 FW Cu AWQC Appendix C recommendation","Lake Superior water"]
[null,"Cladoceran, Daphnia magna","S, M, T",220,7.6,1.6,null,38200,"Kimball 1978",null,{"$f":"EXP(LN(H69)-0.525*(LN(F69)-LN('Summary Sheet'!$C$6))-11.282*(E69-'Summary Sheet'!$C$4)-2.201*(LN(D69)-LN('Summary Sheet'!$C$5))+0.663*(E69^2-'Summary Sheet'!$C$4^2)+0.264*((E69*LN(D69)-'Summary Sheet'!$C$4*LN('Summary Sheet'!$C$5))))","v":33882.927573151166},null,"-",null,null,"Daphnia",null,"Value is from 2007 FW Cu AWQC Appendix C recommendation","Well water"]
[null,"Cladoceran, Daphnia magna","S, U, T",45.1,7.25,1.1000000000000001,null,2800,"Shephard 1983",null,{"$f":"EXP(LN(H70)-0.525*(LN(F70)-LN('Summary Sheet'!$C$6))-11.282*(E70-'Summary Sheet'!$C$4)-2.201*(LN(D70)-LN('Summary Sheet'!$C$5))+0.663*(E70^2-'Summary Sheet'!$C$4^2)+0.264*((E70*LN(D70)-'Summary Sheet'!$C$4*LN('Summary Sheet'!$C$5))))","v":4785.6289315477106},null,"-",null,null,"Daphnia",null,"Value is from 2007 FW Cu AWQC Appendix C recommendation","Lake Superior water"]
[null,"Cladoceran, Daphnia magna","S, U, T",168,5.99,0.5,null,500,"European Al Association 2009",">",{"$f":"EXP(LN(H71)-0.525*(LN(F71)-LN('Summary Sheet'!$C$6))-11.282*(E71-'Summary Sheet'!$C$4)-2.201*(LN(D71)-LN('Summary Sheet'!$C$5))+0.663*(E71^2-'Summary Sheet'!$C$4^2)+0.264*((E71*LN(D71)-'Summary Sheet'!$C$4*LN('Summary Sheet'!$C$5))))","v":3780.3474954459602},null,"-",null,null,"Daphnia","Invert","Value is from 2007 FW Cu AWQC Appendix C recommendation","Recon"]
[null,"Cladoceran, Daphnia magna","S, U, T",168,7.92,0.5,null,795.02,"European Al Association 2009",null,{"$f":"EXP(LN(H72)-0.525*(LN(F72)-LN('Summary Sheet'!$C$6))-11.282*(E72-'Summary Sheet'!$C$4)-2.201*(LN(D72)-LN('Summary Sheet'!$C$5))+0.663*(E72^2-'Summary Sheet'!$C$4^2)+0.264*((E72*LN(D72)-'Summary Sheet'!$C$4*LN('Summary Sheet'!$C$5))))","v":1535.9884810060018},null,{"$f":"GEOMEAN(K68:K72)","v":5560.1597238743243},{"$f":"M72","v":5560.1597238743243},null,"Daphnia","Invert","Value is from 2007 FW Cu AWQC Appendix C recommendation","Recon"]
[]
[null,"Ostracod, Stenocypris major","R, M, T",15.63,6.51,1.6,null,3101.96,"Shuhaimi-Othman et al. 2011a",null,{"$f":"EXP(LN(H74)-0.525*(LN(F74)-LN('Summary Sheet'!$C$6))-11.282*(E74-'Summary Sheet'!$C$4)-2.201*(LN(D74)-LN('Summary Sheet'!$C$5))+0.663*(E74^2-'Summary Sheet'!$C$4^2)+0.264*((E74*LN(D74)-'Summary Sheet'!$C$4*LN('Summary Sheet'!$C$5))))","v":17049.413903946021},null,{"$f":"K74","v":17049.413903946021},{"$f":"M74","v":17049.413903946021},null,"Stenocypris","Invert","Value is from 2007 FW Cu AWQC Appendix C recommendation","tap water (Malaysia)"]
[]
[null,"Amphipod, Crangonyx pseudogracilis","R, U, T",50,6.75,1.6,null,9190,"Martin and Holdich 1986",null,{"$f":"EXP(LN(H76)-0.525*(LN(F76)-LN('Summary Sheet'!$C$6))-11.282*(E76-'Summary Sheet'!$C$4)-2.201*(LN(D76)-LN('Summary Sheet'!$C$5))+0.663*(E76^2-'Summary Sheet'!$C$4^2)+0.264*((E76*LN(D76)-'Summary Sheet'!$C$4*LN('Summary Sheet'!$C$5))))","v":20316.055364872027},null,{"$f":"K76","v":20316.055364872027},{"$f":"M76","v":20316.055364872027},null,"Crangonyx","Invert","Value is from 2007 FW Cu AWQC Appendix C recommendation","tap water (UK)"]
[]
[null,"Amphipod, Hyalella azteca","F, M, T",105,6.13,0.48,">",5997,"Wang et al. 2016; Wang et al. 2017",">",{"$f":"EXP(LN(H78)-0.525*(LN(F78)-LN('Summary Sheet'!$C$6))-11.282*(E78-'Summary Sheet'!$C$4)-2.201*(LN(D78)-LN('Summary Sheet'!$C$5))+0.663*(E78^2-'Summary Sheet'!$C$4^2)+0.264*((E78*LN(D78)-'Summary Sheet'!$C$4*LN('Summary Sheet'!$C$5))))","v":46730.442719459272},">",{"$f":"K78","v":46730.442719459272},{"$f":"M78","v":46730.442719459272},">","Hyalella","Invert","Author reported"]
[]
[null,"Stonefly, Acroneuria sp.","S, M, T",47.4,7.46,1.1000000000000001,">",22600,"Call et al. 1984",">",{"$f":"EXP(LN(H80)-0.525*(LN(F80)-LN('Summary Sheet'!$C$6))-11.282*(E80-'Summary Sheet'!$C$4)-2.201*(LN(D80)-LN('Summary Sheet'!$C$5))+0.663*(E80^2-'Summary Sheet'!$C$4^2)+0.264*((E80*LN(D80)-'Summary Sheet'!$C$4*LN('Summary Sheet'!$C$5))))","v":34207.601483982071},">",{"$f":"K80","v":34207.601483982071},{"$f":"M80","v":34207.601483982071},">","Acroneuria","Invert","Value is from 2007 FW Cu AWQC Appendix C recommendation","Lake Superior water"]
[]
[null,"Midge, Chironomus plumosus","S, U, T",80,7,1.6,null,30000,"Fargasova 2001",null,{"$f":"EXP(LN(H82)-0.525*(LN(F82)-LN('Summary Sheet'!$C$6))-11.282*(E82-'Summary Sheet'!$C$4)-2.201*(LN(D82)-LN('Summary Sheet'!$C$5))+0.663*(E82^2-'Summary Sheet'!$C$4^2)+0.264*((E82*LN(D82)-'Summary Sheet'!$C$4*LN('Summary Sheet'!$C$5))))","v":42323.295717913614},null,{"$f":"K82","v":42323.295717913614},{"$f":"M82","v":42323.295717913614},null,"Chironomus","Invert","Value is from 2007 FW Cu AWQC Appendix C recommendation","tap water (Slovakia)"]
[]
[null,"Midge, Paratanytarsus dissimilis","S, M, T",17.43,7.28,2.8,">",77700,"Lamb and Bailey 1981, 1983",">",{"$f":"EXP(LN(H84)-0.525*(LN(F84)-LN('Summary Sheet'!$C$6))-11.282*(E84-'Summary Sheet'!$C$4)-2.201*(LN(D84)-LN('Summary Sheet'!$C$5))+0.663*(E84^2-'Summary Sheet'!$C$4^2)+0.264*((E84*LN(D84)-'Summary Sheet'!$C$4*LN('Summary Sheet'!$C$5))))","v":103997.55471374164},">",{"$f":"K84","v":103997.55471374164},{"$f":"M84","v":103997.55471374164},">","Paratanytarsus","Invert","Value is from 2007 FW Cu AWQC Appendix C recommendation","Liberty Lake, Washington"]
[]
[null,"Rainbow trout, Oncorhynchus mykiss","F, M, T",27.4,7.58,0.5,">",9840,"Gundersen et al. 1994",">",{"$f":"EXP(LN(H86)-0.503*(LN(F86)-LN('Summary Sheet'!$C$6))-3.131*(E86-'Summary Sheet'!$C$4)-3.443*(LN(D86)-LN('Summary Sheet'!$C$5))+0.494*(E86*LN(D86)-'Summary Sheet'!$C$4*LN('Summary Sheet'!$C$5)))","v":34306.356575478138},null,"-",null,null,"Oncorhynchus",null,"Value is from 2007 FW Cu AWQC Appendix C recommendation","RO treated well water: then added salts"]
[null,"Rainbow trout, Oncorhynchus mykiss","F, M, T",45.2,7.62,0.5,">",8070,"Gundersen et al. 1994",">",{"$f":"EXP(LN(H87)-0.503*(LN(F87)-LN('Summary Sheet'!$C$6))-3.131*(E87-'Summary Sheet'!$C$4)-3.443*(LN(D87)-LN('Summary Sheet'!$C$5))+0.494*(E87*LN(D87)-'Summary Sheet'!$C$4*LN('Summary Sheet'!$C$5)))","v":31125.355418267056},null,"-",null,null,"Oncorhynchus",null,"Value is from 2007 FW Cu AWQC Appendix C recommendation","RO treated well water: then added salts"]
[null,"Rainbow trout, Oncorhynchus mykiss","F, M, T",89.5,7.58,0.5,">",8160,"Gundersen et al. 1994",">",{"$f":"EXP(LN(H88)-0.503*(LN(F88)-LN('Summary Sheet'!$C$6))-3.131*(E88-'Summary Sheet'!$C$4)-3.443*(LN(D88)-LN('Summary Sheet'!$C$5))+0.494*(E88*LN(D88)-'Summary Sheet'!$C$4*LN('Summary Sheet'!$C$5)))","v":40651.145643553005},null,"-",null,null,"Oncorhynchus",null,"Value is from 2007 FW Cu AWQC Appendix C recommendation","RO treated well water: then added salts"]
[null,"Rainbow trout, Oncorhynchus mykiss","F, M, T",130.4,7.58,0.5,">",8200,"Gundersen et al. 1994",">",{"$f":"EXP(LN(H89)-0.503*(LN(F89)-LN('Summary Sheet'!$C$6))-3.131*(E89-'Summary Sheet'!$C$4)-3.443*(LN(D89)-LN('Summary Sheet'!$C$5))+0.494*(E89*LN(D89)-'Summary Sheet'!$C$4*LN('Summary Sheet'!$C$5)))","v":45759.503213507523},null,"-",null,null,"Oncorhynchus",null,"Value is from 2007 FW Cu AWQC Appendix C recommendation","RO treated well water: then added salts"]
[null,"Rainbow trout, Oncorhynchus mykiss","F, M, T",23.2,8.25,0.5,null,6170,"Gundersen et al. 1994",null,{"$f":"EXP(LN(H90)-0.503*(LN(F90)-LN('Summary Sheet'!$C$6))-3.131*(E90-'Summary Sheet'!$C$4)-3.443*(LN(D90)-LN('Summary Sheet'!$C$5))+0.494*(E90*LN(D90)-'Summary Sheet'!$C$4*LN('Summary Sheet'!$C$5)))","v":7108.456798386911},null,"-",null,null,"Oncorhynchus",null,"Value is from 2007 FW Cu AWQC Appendix C recommendation","RO treated well water: then added salts"]
[null,"Rainbow trout, Oncorhynchus mykiss","F, M, T",35,8.26,0.5,null,6170,"Gundersen et al. 1994",null,{"$f":"EXP(LN(H91)-0.503*(LN(F91)-LN('Summary Sheet'!$C$6))-3.131*(E91-'Summary Sheet'!$C$4)-3.443*(LN(D91)-LN('Summary Sheet'!$C$5))+0.494*(E91*LN(D91)-'Summary Sheet'!$C$4*LN('Summary Sheet'!$C$5)))","v":9094.0461091479483},null,"-",null,null,"Oncorhynchus",null,"Value is from 2007 FW Cu AWQC Appendix C recommendation","RO treated well water: then added salts"]
[null,"Rainbow trout, Oncorhynchus mykiss","F, M, T",83.6,8.2899999999999991,0.5,null,7670,"Gundersen et al. 1994",null,{"$f":"EXP(LN(H92)-0.503*(LN(F92)-LN('Summary Sheet'!$C$6))-3.131*(E92-'Summary Sheet'!$C$4)-3.443*(LN(D92)-LN('Summary Sheet'!$C$5))+0.494*(E92*LN(D92)-'Summary Sheet'!$C$4*LN('Summary Sheet'!$C$5)))","v":19142.629924945057},null,"-",null,null,"Oncorhynchus",null,"Value is from 2007 FW Cu AWQC Appendix C recommendation","RO treated well water: then added salts"]
[null,"Rainbow trout, Oncorhynchus mykiss","F, M, T",115.8,8.3000000000000007,0.5,null,6930,"Gundersen et al. 1994",null,{"$f":"EXP(LN(H93)-0.503*(LN(F93)-LN('Summary Sheet'!$C$6))-3.131*(E93-'Summary Sheet'!$C$4)-3.443*(LN(D93)-LN('Summary Sheet'!$C$5))+0.494*(E93*LN(D93)-'Summary Sheet'!$C$4*LN('Summary Sheet'!$C$5)))","v":21224.26759419496},null,{"$f":"GEOMEAN(K86:K93)","v":21861.312148831548},{"$f":"M93","v":21861.312148831548},null,"Oncorhynchus","Fish","Value is from 2007 FW Cu AWQC Appendix C recommendation","RO treated well water: then added salts"]
[]
[null,"Atlantic salmon, Salmo salar","S, U, T",6.8,5.5,0.5,null,584,"Hamilton and Haines 1995",null,{"$f":"EXP(LN(H95)-0.503*(LN(F95)-LN('Summary Sheet'!$C$6))-3.131*(E95-'Summary Sheet'!$C$4)-3.443*(LN(D95)-LN('Summary Sheet'!$C$5))+0.494*(E95*LN(D95)-'Summary Sheet'!$C$4*LN('Summary Sheet'!$C$5)))","v":125665.03402363569},null,"-",null,null,"Salmo",null,"Value is from 2007 FW Cu AWQC Appendix C recommendation","Soft recon"]
[null,"Atlantic salmon, Salmo salar","S, U, T",6.8,6.5,0.5,null,599,"Hamilton and Haines 1995",null,{"$f":"EXP(LN(H96)-0.503*(LN(F96)-LN('Summary Sheet'!$C$6))-3.131*(E96-'Summary Sheet'!$C$4)-3.443*(LN(D96)-LN('Summary Sheet'!$C$5))+0.494*(E96*LN(D96)-'Summary Sheet'!$C$4*LN('Summary Sheet'!$C$5)))","v":14511.483370002512},null,{"$f":"GEOMEAN(K95:K96)","v":42703.466503608222},{"$f":"M96","v":42703.466503608222},null,"Salmo","Fish","Value is from 2007 FW Cu AWQC Appendix C recommendation","Soft recon"]
[]
[null,"Brook trout, Salvelinus fontinalis","S, U, T",40,5.6,1.6,null,6530,"Tandjung 1982",null,{"$f":"EXP(LN(H98)-0.503*(LN(F98)-LN('Summary Sheet'!$C$6))-3.131*(E98-'Summary Sheet'!$C$4)-3.443*(LN(D98)-LN('Summary Sheet'!$C$5))+0.494*(E98*LN(D98)-'Summary Sheet'!$C$4*LN('Summary Sheet'!$C$5)))","v":189711.83571443334},null,"-",null,null,"Salvelinus",null,"Value is from 2007 FW Cu AWQC Appendix C recommendation","well water/DI mix"]
[null,"Brook trout, Salvelinus fontinalis","S, U, T",18,5.6,1.6,null,3400,"Tandjung 1982",null,{"$f":"EXP(LN(H99)-0.503*(LN(F99)-LN('Summary Sheet'!$C$6))-3.131*(E99-'Summary Sheet'!$C$4)-3.443*(LN(D99)-LN('Summary Sheet'!$C$5))+0.494*(E99*LN(D99)-'Summary Sheet'!$C$4*LN('Summary Sheet'!$C$5)))","v":169549.52420350662},null,"-",null,null,"Salvelinus",null,"Value is from 2007 FW Cu AWQC Appendix C recommendation","well water/DI mix"]
[null,"Brook trout, Salvelinus fontinalis","S, U, T",2,5.6,1.6,null,370,"Tandjung 1982",null,{"$f":"EXP(LN(H100)-0.503*(LN(F100)-LN('Summary Sheet'!$C$6))-3.131*(E100-'Summary Sheet'!$C$4)-3.443*(LN(D100)-LN('Summary Sheet'!$C$5))+0.494*(E100*LN(D100)-'Summary Sheet'!$C$4*LN('Summary Sheet'!$C$5)))","v":81594.308143698596},null,{"$f":"GEOMEAN(K98:K100)","v":137937.90385509626},{"$f":"M100","v":137937.90385509626},null,"Salvelinus","Fish","Value is from 2007 FW Cu AWQC Appendix C recommendation","well water/DI mix"]
[]
[null,"Green sunfish, Lepomis cyanellus","S, M, T",47.4,7.55,1.1000000000000001,">",50000,"Call et al. 1984",">",{"$f":"EXP(LN(H102)-0.503*(LN(F102)-LN('Summary Sheet'!$C$6))-3.131*(E102-'Summary Sheet'!$C$4)-3.443*(LN(D102)-LN('Summary Sheet'!$C$5))+0.494*(E102*LN(D102)-'Summary Sheet'!$C$4*LN('Summary Sheet'!$C$5)))","v":143495.82856916595},">",{"$f":"K102","v":143495.82856916595},{"$f":"M102","v":143495.82856916595},">","Lepomis","Fish","Value is from 2007 FW Cu AWQC Appendix C recommendation","Lake Superior water"]
[]
[null,"Rio Grande silvery minnow, Hybognathus amarus","R, M, T",140,8.1,0.5,">",59100,"Buhl 2002",">",{"$f":"EXP(LN(H104)-0.503*(LN(F104)-LN('Summary Sheet'!$C$6))-3.131*(E104-'Summary Sheet'!$C$4)-3.443*(LN(D104)-LN('Summary Sheet'!$C$5))+0.494*(E104*LN(D104)-'Summary Sheet'!$C$4*LN('Summary Sheet'!$C$5)))","v":235380.66923026214},">",{"$f":"K104","v":235380.66923026214},{"$f":"M104","v":235380.66923026214},">","Hybognathus","Fish","Value is from 2007 FW Cu AWQC Appendix C recommendation","Recon water"]
[]
[null,"Fathead minnow, Pimephales promelas","S, M, T",47.4,7.61,1.1000000000000001,">",48200,"Call et al. 1984",">",{"$f":"EXP(LN(H106)-0.503*(LN(F106)-LN('Summary Sheet'!$C$6))-3.131*(E106-'Summary Sheet'!$C$4)-3.443*(LN(D106)-LN('Summary Sheet'!$C$5))+0.494*(E106*LN(D106)-'Summary Sheet'!$C$4*LN('Summary Sheet'!$C$5)))","v":128528.61238961635},null,"-",null,null,"Pimephales",null,"Value is from 2007 FW Cu AWQC Appendix C recommendation","Lake Superior water"]
[null,"Fathead minnow, Pimephales promelas","S, M, T",47.4,8.0500000000000007,1.1000000000000001,">",49800,"Call et al. 1984",">",{"$f":"EXP(LN(H107)-0.503*(LN(F107)-LN('Summary Sheet'!$C$6))-3.131*(E107-'Summary Sheet'!$C$4)-3.443*(LN(D107)-LN('Summary Sheet'!$C$5))+0.494*(E107*LN(D107)-'Summary Sheet'!$C$4*LN('Summary Sheet'!$C$5)))","v":77468.982827169195},null,"-",null,null,"Pimephales",null,"Value is from 2007 FW Cu AWQC Appendix C recommendation","Lake Superior water"]
[null,"Fathead minnow, Pimephales promelas","R, M, T",26,7.8,0.5,null,1160,"ENSR 1992c",null,{"$f":"EXP(LN(H108)-0.503*(LN(F108)-LN('Summary Sheet'!$C$6))-3.131*(E108-'Summary Sheet'!$C$4)-3.443*(LN(D108)-LN('Summary Sheet'!$C$5))+0.494*(E108*LN(D108)-'Summary Sheet'!$C$4*LN('Summary Sheet'!$C$5)))","v":2848.382315273825},null,"-",null,null,"Pimephales",null,"Value is from 2007 FW Cu AWQC Appendix C recommendation","Lab Recon water"]
[null,"Fathead minnow, Pimephales promelas","R, M, T",46,7.6,0.5,null,8180,"ENSR 1992c",null,{"$f":"EXP(LN(H109)-0.503*(LN(F109)-LN('Summary Sheet'!$C$6))-3.131*(E109-'Summary Sheet'!$C$4)-3.443*(LN(D109)-LN('Summary Sheet'!$C$5))+0.494*(E109*LN(D109)-'Summary Sheet'!$C$4*LN('Summary Sheet'!$C$5)))","v":32524.417044103269},null,"-",null,null,"Pimephales",null,"Value is from 2007 FW Cu AWQC Appendix C recommendation","Lab Recon water"]
[null,"Fathead minnow, Pimephales promelas","R, M, T",96,8.1,0.5,null,20300,"ENSR 1992c",null,{"$f":"EXP(LN(H110)-0.503*(LN(F110)-LN('Summary Sheet'!$C$6))-3.131*(E110-'Summary Sheet'!$C$4)-3.443*(LN(D110)-LN('Summary Sheet'!$C$5))+0.494*(E110*LN(D110)-'Summary Sheet'!$C$4*LN('Summary Sheet'!$C$5)))","v":65491.013555488047},null,"-",null,null,"Pimephales",null,"Value is from 2007 FW Cu AWQC Appendix C recommendation","Lab Recon water"]
[null,"Fathead minnow, Pimephales promelas","R, M, T",194,8.1,0.5,null,44800,"ENSR 1992c",null,{"$f":"EXP(LN(H111)-0.503*(LN(F111)-LN('Summary Sheet'!$C$6))-3.131*(E111-'Summary Sheet'!$C$4)-3.443*(LN(D111)-LN('Summary Sheet'!$C$5))+0.494*(E111*LN(D111)-'Summary Sheet'!$C$4*LN('Summary Sheet'!$C$5)))","v":214077.94011957743},null,"-",null,null,"Pimephales",null,"Value is from 2007 FW Cu AWQC Appendix C recommendation","Lab Recon water"]
[null,"Fathead minnow, Pimephales promelas","R, M, T",140,8.1,0.5,">",59100,"Buhl 2002",">",{"$f":"EXP(LN(H112)-0.503*(LN(F112)-LN('Summary Sheet'!$C$6))-3.131*(E112-'Summary Sheet'!$C$4)-3.443*(LN(D112)-LN('Summary Sheet'!$C$5))+0.494*(E112*LN(D112)-'Summary Sheet'!$C$4*LN('Summary Sheet'!$C$5)))","v":235380.66923026214},null,{"$f":"GEOMEAN(K106:K112)","v":60722.747517311742},{"$f":"M112","v":60722.747517311742},null,"Pimephales","Fish","Value is from 2007 FW Cu AWQC Appendix C recommendation","Recon water"]
[]
[null,"Smallmouth bass, Micropterus dolomieui","S, M, T",12.45,5.05,1.6,null,130,"Kane and Rabeni 1987",null,{"$f":"EXP(LN(H114)-0.503*(LN(F114)-LN('Summary Sheet'!$C$6))-3.131*(E114-'Summary Sheet'!$C$4)-3.443*(LN(D114)-LN('Summary Sheet'!$C$5))+0.494*(E114*LN(D114)-'Summary Sheet'!$C$4*LN('Summary Sheet'!$C$5)))","v":23464.219042132667},null,{"$f":"GEOMEAN(K114:K114)","v":23464.219042132667},{"$f":"M114","v":23464.219042132667},null,"Micropterus","Fish","Value is from 2007 FW Cu AWQC Appendix C recommendation","well water/DI mix"]
[]
[null,"Green tree frog, Hyla cinerea","R, M, T",4.55,5.49,0.5,">",405.2,"Jung and Jagoe 1995",">",{"$f":"EXP(LN(H116)-0.503*(LN(F116)-LN('Summary Sheet'!$C$6))-3.131*(E116-'Summary Sheet'!$C$4)-3.443*(LN(D116)-LN('Summary Sheet'!$C$5))+0.494*(E116*LN(D116)-'Summary Sheet'!$C$4*LN('Summary Sheet'!$C$5)))","v":119537.29481335128},">",{"$f":"K116","v":119537.29481335128},{"$f":"M116","v":119537.29481335128},">","Hyla","Amphibian","Value is from 2007 FW Cu AWQC Appendix C recommendation","artificial soft recon"]
[]
[]
[]
[]
[]
[null,null,null,null,null,null,null,null,null,null," "]

{"sheet":"Chronic Dataset","index":3,"n_rows":43,"n_cols":18,"rows_kept":43,"cut":false,"hidden":false,"merged":[]}
[null,"Appendix C. Acceptable Chronic Toxicity Data of Aluminum to Freshwater Aquatic Animals"]
[null,null,null,null,null,null,null,null,null,"MLR equation"]
[null,"Species","Hardness (mg/L as CaCO3)","pH","DOC\n(mg/L)","EC20 Endpoint",null,"EC20\n(µg/L)",null,"Normalized Conc.- EC20\n(µg/L)",null,"SMCV-EC20\n(µg/L)","GMCV-EC20\n(µg/L)",null,"Genus",null,"DOC Notes","Dilution water"]
[]
[null,"Oligochaete, Aeolosoma sp.",48,6,0.25,"Reproduction (population size)",null,1235,null,{"$f":"EXP(LN(H5)-0.525*(LN(E5)-LN('Summary Sheet'!$C$6))-11.282*(D5-'Summary Sheet'!$C$4)-2.201*(LN(C5)-LN('Summary Sheet'!$C$5))+0.663*(D5^2-'Summary Sheet'!$C$4^2)+0.264*(D5*LN(C5)-'Summary Sheet'!$C$4*LN('Summary Sheet'!$C$5)))","v":28533.87769289091},null,{"$f":"J5","v":28533.87769289091},{"$f":"L5","v":28533.87769289091},null,"Aeolosoma","Invert","Author reported; half the detection limit"]
[]
[null,"Rotifer, Brachionus calyciflorus",100,6.2,0.25,"Reproduction (population size)",null,431,null,{"$f":"EXP(LN(H7)-0.525*(LN(E7)-LN('Summary Sheet'!$C$6))-11.282*(D7-'Summary Sheet'!$C$4)-2.201*(LN(C7)-LN('Summary Sheet'!$C$5))+0.663*(D7^2-'Summary Sheet'!$C$4^2)+0.264*(D7*LN(C7)-'Summary Sheet'!$C$4*LN('Summary Sheet'!$C$5)))","v":4263.0630091989906},null,{"$f":"J7","v":4263.0630091989906},{"$f":"L7","v":4263.0630091989906},null,"Brachionus","Invert","Author reported; half the detection limit"]
[]
[null,"Great pond snail, Lymnaea stagnalis",117,6.1,0.25,"Biomass",null,745.7,null,{"$f":"EXP(LN(H9)-0.525*(LN(E9)-LN('Summary Sheet'!$C$6))-11.282*(D9-'Summary Sheet'!$C$4)-2.201*(LN(C9)-LN('Summary Sheet'!$C$5))+0.663*(D9^2-'Summary Sheet'!$C$4^2)+0.264*(D9*LN(C9)-'Summary Sheet'!$C$4*LN('Summary Sheet'!$C$5)))","v":8138.5358729295795},null,{"$f":"J9","v":8138.5358729295795},{"$f":"L9","v":8138.5358729295795},null,"Lymnaea","Mollusk","Author reported; half the detection limit"]
[]
[null,"Fatmucket, Lampsilis siliquoidea",105.5,6.04,{"$f":"AVERAGE(0.34,0.45)","v":0.39500000000000002},"Biomass",null,169,null,{"$f":"EXP(LN(H11)-0.525*(LN(E11)-LN('Summary Sheet'!$C$6))-11.282*(D11-'Summary Sheet'!$C$4)-2.201*(LN(C11)-LN('Summary Sheet'!$C$5))+0.663*(D11^2-'Summary Sheet'!$C$4^2)+0.264*(D11*LN(C11)-'Summary Sheet'!$C$4*LN('Summary Sheet'!$C$5)))","v":1739.0511474491395},null,{"$f":"J11","v":1739.0511474491395},{"$f":"L11","v":1739.0511474491395},null,"Lampsilis","Mollusk","Author reported"]
[]
[null,"Cladoceran, Ceriodaphnia dubia",50,7.15,1.1000000000000001,"Reproduction - young/starting adult",null,1779.6,null,{"$f":"EXP(LN(H13)-0.525*(LN(E13)-LN('Summary Sheet'!$C$6))-11.282*(D13-'Summary Sheet'!$C$4)-2.201*(LN(C13)-LN('Summary Sheet'!$C$5))+0.663*(D13^2-'Summary Sheet'!$C$4^2)+0.264*(D13*LN(C13)-'Summary Sheet'!$C$4*LN('Summary Sheet'!$C$5)))","v":3167.6432338504519},null,null,null,null,"Ceriodaphnia",null,"Value is from 2007 FW Cu AWQC Appendix C recommendation","Lake Superior water"]
[null,"Cladoceran, Ceriodaphnia dubia",26,7.3,0.5,"Reproduction - young/female",null,1557,null,{"$f":"EXP(LN(H14)-0.525*(LN(E14)-LN('Summary Sheet'!$C$6))-11.282*(D14-'Summary Sheet'!$C$4)-2.201*(LN(C14)-LN('Summary Sheet'!$C$5))+0.663*(D14^2-'Summary Sheet'!$C$4^2)+0.264*(D14*LN(C14)-'Summary Sheet'!$C$4*LN('Summary Sheet'!$C$5)))","v":4535.856440102898},null,null,null,null,"Ceriodaphnia",null,"Value is from 2007 FW Cu AWQC Appendix C recommendation","Lab Recon"]
[null,"Cladoceran, Ceriodaphnia dubia",46,7.5,0.5,"Reproduction - young/female",null,808.73,null,{"$f":"EXP(LN(H15)-0.525*(LN(E15)-LN('Summary Sheet'!$C$6))-11.282*(D15-'Summary Sheet'!$C$4)-2.201*(LN(C15)-LN('Summary Sheet'!$C$5))+0.663*(D15^2-'Summary Sheet'!$C$4^2)+0.264*(D15*LN(C15)-'Summary Sheet'!$C$4*LN('Summary Sheet'!$C$5)))","v":1838.5550138886465},null,null,null,null,"Ceriodaphnia",null,"Value is from 2007 FW Cu AWQC Appendix C recommendation","Lab Recon"]
[null,"Cladoceran, Ceriodaphnia dubia",96,7.9,0.5,"Reproduction - young/female",null,651.9,null,{"$f":"EXP(LN(H16)-0.525*(LN(E16)-LN('Summary Sheet'!$C$6))-11.282*(D16-'Summary Sheet'!$C$4)-2.201*(LN(C16)-LN('Summary Sheet'!$C$5))+0.663*(D16^2-'Summary Sheet'!$C$4^2)+0.264*(D16*LN(C16)-'Summary Sheet'!$C$4*LN('Summary Sheet'!$C$5)))","v":1328.5524576698278},null,null,null,null,"Ceriodaphnia",null,"Value is from 2007 FW Cu AWQC Appendix C recommendation","Lab Recon"]
[null,"Cladoceran, Ceriodaphnia dubia",194,8.1,0.5,"Reproduction - young/female",null,683.62,null,{"$f":"EXP(LN(H17)-0.525*(LN(E17)-LN('Summary Sheet'!$C$6))-11.282*(D17-'Summary Sheet'!$C$4)-2.201*(LN(C17)-LN('Summary Sheet'!$C$5))+0.663*(D17^2-'Summary Sheet'!$C$4^2)+0.264*(D17*LN(C17)-'Summary Sheet'!$C$4*LN('Summary Sheet'!$C$5)))","v":1482.5430112627844},null,null,null,null,"Ceriodaphnia",null,"Value is from 2007 FW Cu AWQC Appendix C recommendation","Lab Recon"]
[null,"Cladoceran, Ceriodaphnia dubia",25.5,7.03,0.5,"Reproduction (young/female)",null,250,null,{"$f":"EXP(LN(H18)-0.525*(LN(E18)-LN('Summary Sheet'!$C$6))-11.282*(D18-'Summary Sheet'!$C$4)-2.201*(LN(C18)-LN('Summary Sheet'!$C$5))+0.663*(D18^2-'Summary Sheet'!$C$4^2)+0.264*(D18*LN(C18)-'Summary Sheet'!$C$4*LN('Summary Sheet'!$C$5)))","v":940.21099586789455},null,null,null,null,"Ceriodaphnia",null,"Author reported"]
[null,"Cladoceran, Ceriodaphnia dubia",122,7.13,0.5,"Reproduction (young/female)",null,860,null,{"$f":"EXP(LN(H19)-0.525*(LN(E19)-LN('Summary Sheet'!$C$6))-11.282*(D19-'Summary Sheet'!$C$4)-2.201*(LN(C19)-LN('Summary Sheet'!$C$5))+0.663*(D19^2-'Summary Sheet'!$C$4^2)+0.264*(D19*LN(C19)-'Summary Sheet'!$C$4*LN('Summary Sheet'!$C$5)))","v":1770.1888572507992},null,null,null,null,"Ceriodaphnia",null,"Author reported"]
[null,"Cladoceran, Ceriodaphnia dubia",25,7.98,0.5,"Reproduction (young/female)",null,700,null,{"$f":"EXP(LN(H20)-0.525*(LN(E20)-LN('Summary Sheet'!$C$6))-11.282*(D20-'Summary Sheet'!$C$4)-2.201*(LN(C20)-LN('Summary Sheet'!$C$5))+0.663*(D20^2-'Summary Sheet'!$C$4^2)+0.264*(D20*LN(C20)-'Summary Sheet'!$C$4*LN('Summary Sheet'!$C$5)))","v":1679.0774395711012},null,null,null,null,"Ceriodaphnia",null,"Author reported"]
[null,"Cladoceran, Ceriodaphnia dubia",61,8.0299999999999994,0.5,"Reproduction (young/female)",null,1010,null,{"$f":"EXP(LN(H21)-0.525*(LN(E21)-LN('Summary Sheet'!$C$6))-11.282*(D21-'Summary Sheet'!$C$4)-2.201*(LN(C21)-LN('Summary Sheet'!$C$5))+0.663*(D21^2-'Summary Sheet'!$C$4^2)+0.264*(D21*LN(C21)-'Summary Sheet'!$C$4*LN('Summary Sheet'!$C$5)))","v":2274.2884497090777},null,null,null,null,"Ceriodaphnia",null,"Author reported"]
[null,"Cladoceran, Ceriodaphnia dubia",122,8.1,0.5,"Reproduction (young/female)",null,870,null,{"$f":"EXP(LN(H22)-0.525*(LN(E22)-LN('Summary Sheet'!$C$6))-11.282*(D22-'Summary Sheet'!$C$4)-2.201*(LN(C22)-LN('Summary Sheet'!$C$5))+0.663*(D22^2-'Summary Sheet'!$C$4^2)+0.264*(D22*LN(C22)-'Summary Sheet'!$C$4*LN('Summary Sheet'!$C$5)))","v":1942.3257037641199},null,null,null,null,"Ceriodaphnia",null,"Author reported"]
[null,"Cladoceran, Ceriodaphnia dubia",25.5,6.33,0.5,"Reproduction (young/female)",null,260,null,{"$f":"EXP(LN(H23)-0.525*(LN(E23)-LN('Summary Sheet'!$C$6))-11.282*(D23-'Summary Sheet'!$C$4)-2.201*(LN(C23)-LN('Summary Sheet'!$C$5))+0.663*(D23^2-'Summary Sheet'!$C$4^2)+0.264*(D23*LN(C23)-'Summary Sheet'!$C$4*LN('Summary Sheet'!$C$5)))","v":2933.1765131953339},null,null,null,null,"Ceriodaphnia",null,"Author reported"]
[null,"Cladoceran, Ceriodaphnia dubia",121,6.36,0.5,"Reproduction (young/female)",null,390,null,{"$f":"EXP(LN(H24)-0.525*(LN(E24)-LN('Summary Sheet'!$C$6))-11.282*(D24-'Summary Sheet'!$C$4)-2.201*(LN(C24)-LN('Summary Sheet'!$C$5))+0.663*(D24^2-'Summary Sheet'!$C$4^2)+0.264*(D24*LN(C24)-'Summary Sheet'!$C$4*LN('Summary Sheet'!$C$5)))","v":1837.480395877272},null,{"$f":"GEOMEAN(J13:J24)","v":1972.1587208567291},{"$f":"L24","v":1972.1587208567291},null,"Ceriodaphnia","Invert","Author reported"]
[]
[null,"Amphipod, Hyalella azteca",95,6.1,0.51,"Biomass (28 d)",null,199.3,null,{"$f":"EXP(LN(H26)-0.525*(LN(E26)-LN('Summary Sheet'!$C$6))-11.282*(D26-'Summary Sheet'!$C$4)-2.201*(LN(C26)-LN('Summary Sheet'!$C$5))+0.663*(D26^2-'Summary Sheet'!$C$4^2)+0.264*(D26*LN(C26)-'Summary Sheet'!$C$4*LN('Summary Sheet'!$C$5)))","v":1691.8451412348516},null,null,null,null,"Hyalella",null,"Author reported"]
[null,"Amphipod, Hyalella azteca",106,6.04,{"$f":"AVERAGE(0.26,0.39)","v":0.32500000000000001},"Biomass (28 d)",null,425,null,{"$f":"EXP(LN(H27)-0.525*(LN(E27)-LN('Summary Sheet'!$C$6))-11.282*(D27-'Summary Sheet'!$C$4)-2.201*(LN(C27)-LN('Summary Sheet'!$C$5))+0.663*(D27^2-'Summary Sheet'!$C$4^2)+0.264*(D27*LN(C27)-'Summary Sheet'!$C$4*LN('Summary Sheet'!$C$5)))","v":4831.077718182828},null,{"$f":"GEOMEAN(J26:J27)","v":2858.9220633720624},{"$f":"L27","v":2858.9220633720624},null,"Hyalella","Invert","Author reported"]
[]
[null,"Midge, Chironomus riparius",11.8,5.58,1.8,"Adult midge emergence",null,29.547000000000001,null,{"$f":"EXP(LN(H29)-0.525*(LN(E29)-LN('Summary Sheet'!$C$6))-11.282*(D29-'Summary Sheet'!$C$4)-2.201*(LN(C29)-LN('Summary Sheet'!$C$5))+0.663*(D29^2-'Summary Sheet'!$C$4^2)+0.264*(D29*LN(C29)-'Summary Sheet'!$C$4*LN('Summary Sheet'!$C$5)))","v":1989.2932744930927},null,null,null,null,"Chironomus",null,"Based on Cleveland et al. 1989 reported values at a similar pH","well/RO mix"]
[null,"Midge, Chironomus riparius",11.9,5.05,1.8,"Adult midge emergence",null,84.415999999999997,null,{"$f":"EXP(LN(H30)-0.525*(LN(E30)-LN('Summary Sheet'!$C$6))-11.282*(D30-'Summary Sheet'!$C$4)-2.201*(LN(C30)-LN('Summary Sheet'!$C$5))+0.663*(D30^2-'Summary Sheet'!$C$4^2)+0.264*(D30*LN(C30)-'Summary Sheet'!$C$4*LN('Summary Sheet'!$C$5)))","v":37678.089374421688},null,null,null,null,"Chironomus",null,"Based on Cleveland et al. 1989 reported values at a similar pH","well/RO mix"]
[null,"Midge, Chironomus riparius",91,6.6,0.51,"Reproduction (# of eggs/case)",null,3387,null,{"$f":"EXP(LN(H31)-0.525*(LN(E31)-LN('Summary Sheet'!$C$6))-11.282*(D31-'Summary Sheet'!$C$4)-2.201*(LN(C31)-LN('Summary Sheet'!$C$5))+0.663*(D31^2-'Summary Sheet'!$C$4^2)+0.264*(D31*LN(C31)-'Summary Sheet'!$C$4*LN('Summary Sheet'!$C$5)))","v":12789.159282117558},null,{"$f":"GEOMEAN(J29:J31)","v":9859.9919613479033},{"$f":"L31","v":9859.9919613479033},null,"Chironomus","Invert","Author reported"]
[]
[null,"Atlantic salmon, Salmo salar",12.7,5.7,1.8,"Biomass",null,61.564,null,{"$f":"EXP(LN(H33)-0.503*(LN(E33)-LN('Summary Sheet'!$C$6))-3.131*(D33-'Summary Sheet'!$C$4)-3.443*(LN(C33)-LN('Summary Sheet'!$C$5))+0.494*(D33*LN(C33)-'Summary Sheet'!$C$4*LN('Summary Sheet'!$C$5)))","v":3037.0283776868923},null,{"$f":"J33","v":3037.0283776868923},{"$f":"L33","v":3037.0283776868923},null,"Salmo","Fish","Based on Cleveland et al. 1989 reported values at a similar pH","well/RO mix"]
[]
[null,"Brook trout, Salvelinus fontinalis",12.3,6.55,1.9,"Biomass",null,164.35,null,{"$f":"EXP(LN(H35)-0.503*(LN(E35)-LN('Summary Sheet'!$C$6))-3.131*(D35-'Summary Sheet'!$C$4)-3.443*(LN(C35)-LN('Summary Sheet'!$C$5))+0.494*(D35*LN(C35)-'Summary Sheet'!$C$4*LN('Summary Sheet'!$C$5)))","v":1613.0189976498095},null,null,null,null,"Salvelinus",null,"Author reported","well/RO mix"]
[null,"Brook trout, Salvelinus fontinalis",12.8,5.65,1.8,"Biomass",null,143.47,null,{"$f":"EXP(LN(H36)-0.503*(LN(E36)-LN('Summary Sheet'!$C$6))-3.131*(D36-'Summary Sheet'!$C$4)-3.443*(LN(C36)-LN('Summary Sheet'!$C$5))+0.494*(D36*LN(C36)-'Summary Sheet'!$C$4*LN('Summary Sheet'!$C$5)))","v":7733.702016178434},null,{"$f":"GEOMEAN(J35:J36)","v":3531.9411481872753},{"$f":"L36","v":3531.9411481872753},null,"Salvelinus","Fish","Author reported","well/RO mix"]
[]
[null,"Fathead minnow, Pimephales promelas",220,7.7,1.6,"Biomass",null,6193.6,null,{"$f":"EXP(LN(H38)-0.503*(LN(E38)-LN('Summary Sheet'!$C$6))-3.131*(D38-'Summary Sheet'!$C$4)-3.443*(LN(C38)-LN('Summary Sheet'!$C$5))+0.494*(D38*LN(C38)-'Summary Sheet'!$C$4*LN('Summary Sheet'!$C$5)))","v":21315.456816358077},null,null,null,null,"Pimephales",null,"Value is from 2007 FW Cu AWQC Appendix C recommendation","well water"]
[null,"Fathead minnow, Pimephales promelas",96,6.2,0.25,"Fry survival",null,428.6,null,{"$f":"EXP(LN(H39)-0.503*(LN(E39)-LN('Summary Sheet'!$C$6))-3.131*(D39-'Summary Sheet'!$C$4)-3.443*(LN(C39)-LN('Summary Sheet'!$C$5))+0.494*(D39*LN(C39)-'Summary Sheet'!$C$4*LN('Summary Sheet'!$C$5)))","v":10355.48854048668},null,{"$f":"GEOMEAN(J38:J39)","v":14857.051147419355},{"$f":"L39","v":14857.051147419355},null,"Pimephales","Fish","Author reported; half the detection limit"]
[]
[null,"Zebrafish, Danio rerio",83,6.1,0.25,"Biomass",null,234.4,null,{"$f":"EXP(LN(H41)-0.503*(LN(E41)-LN('Summary Sheet'!$C$6))-3.131*(D41-'Summary Sheet'!$C$4)-3.443*(LN(C41)-LN('Summary Sheet'!$C$5))+0.494*(D41*LN(C41)-'Summary Sheet'!$C$4*LN('Summary Sheet'!$C$5)))","v":6580.7775356757729},null,{"$f":"J41","v":6580.7775356757729},{"$f":"L41","v":6580.7775356757729},null,"Danio","Fish","Author reported; half the detection limit"]
[]
[null,"Wood frog, Rana sylvatica",115,4.6900000000000004,1.6,"MATC-survival",">",2000,">",{"$f":"EXP(LN(H43)-0.503*(LN(E43)-LN('Summary Sheet'!$C$6))-3.131*(D43-'Summary Sheet'!$C$4)-3.443*(LN(C43)-LN('Summary Sheet'!$C$5))+0.494*(D43*LN(C43)-'Summary Sheet'!$C$4*LN('Summary Sheet'!$C$5)))","v":58200.530838483137},">",{"$f":"J43","v":58200.530838483137},{"$f":"L43","v":58200.530838483137},">","Rana","Amphib - Other Data","Value is from 2007 FW Cu AWQC Appendix C recommendation","aged tap water"]