{"text_format":"1","workbook":"xlsx","n_sheets":7,"sheets":["HDV","HDV FTP NMOG+NOX AB&T MYSummary","LDV LDT Cold NMHC","LDV LDT Cold NMHC AB&T MYSum'ry","Evap","Evap AB&T MY Summary","Sheet2"],"not_rendered":{"charts":0,"images":1,"macros":1,"external_links":0,"defined_names":11,"comments":6,"pivot_tables":0},"unopened":[],"bounds":{"document_bytes":16777216,"sheet_cells":100000,"rows_first":2000,"rows_last":500,"rows_between":2000,"halvings":0,"cell_chars":16384,"cell_head_chars":4096},"cells_cut":0,"cells_raw":0,"read":"whole","date_system":"1900"}

{"sheet":"HDV","index":0,"n_rows":483,"n_cols":19,"rows_kept":483,"cut":false,"hidden":false,"merged":[[1,11,1,13],[1,2,1,9],[4,0,4,18],[3,0,3,18],[12,16,12,18],[6,5,6,9],[13,6,14,12],[7,12,8,12],[7,11,8,11],[6,11,6,15],[6,0,6,2],[15,6,15,12],[9,0,9,1],[16,6,16,12],[17,6,17,12],[13,16,14,16],[13,17,14,17],[13,18,14,18],[18,6,18,12],[19,6,19,12],[13,0,14,0],[13,2,14,2],[13,15,14,15],[24,6,24,12],[25,6,25,12],[26,6,26,12],[27,6,27,12],[28,6,28,12],[20,6,20,12],[21,6,21,12],[22,6,22,12],[23,6,23,12],[34,6,34,12],[35,6,35,12],[36,6,36,12],[37,6,37,12],[38,6,38,12],[29,6,29,12],[30,6,30,12],[31,6,31,12],[32,6,32,12],[33,6,33,12],[44,6,44,12],[45,6,45,12],[46,6,46,12],[47,6,47,12],[48,6,48,12],[39,6,39,12],[40,6,40,12],[41,6,41,12],[42,6,42,12],[43,6,43,12],[54,6,54,12],[55,6,55,12],[56,6,56,12],[57,6,57,12],[58,6,58,12],[49,6,49,12],[50,6,50,12],[51,6,51,12],[52,6,52,12],[53,6,53,12],[64,6,64,12],[65,6,65,12],[66,6,66,12],[67,6,67,12],[68,6,68,12],[59,6,59,12],[60,6,60,12],[61,6,61,12],[62,6,62,12],[63,6,63,12],[74,6,74,12],[75,6,75,12],[76,6,76,12],[77,6,77,12],[78,6,78,12],[69,6,69,12],[70,6,70,12],[71,6,71,12],[72,6,72,12],[73,6,73,12],[84,6,84,12],[85,6,85,12],[86,6,86,12],[87,6,87,12],[88,6,88,12],[79,6,79,12],[80,6,80,12],[81,6,81,12],[82,6,82,12],[83,6,83,12],[94,6,94,12],[95,6,95,12],[96,6,96,12],[97,6,97,12],[98,6,98,12],[89,6,89,12],[90,6,90,12],[91,6,91,12],[92,6,92,12],[93,6,93,12],[104,6,104,12],[105,6,105,12],[106,6,106,12],[107,6,107,12],[108,6,108,12],[99,6,99,12],[100,6,100,12],[101,6,101,12],[102,6,102,12],[103,6,103,12],[114,6,114,12],[115,6,115,12],[116,6,116,12],[117,6,117,12],[118,6,118,12],[109,6,109,12],[110,6,110,12],[111,6,111,12],[112,6,112,12],[113,6,113,12],[124,6,124,12],[125,6,125,12],[126,6,126,12],[127,6,127,12],[128,6,128,12],[119,6,119,12],[120,6,120,12],[121,6,121,12],[122,6,122,12],[123,6,123,12],[134,6,134,12],[135,6,135,12],[136,6,136,12],[137,6,137,12],[138,6,138,12],[129,6,129,12],[130,6,130,12],[131,6,131,12],[132,6,132,12],[133,6,133,12],[144,6,144,12],[145,6,145,12],[146,6,146,12],[147,6,147,12],[148,6,148,12],[139,6,139,12],[140,6,140,12],[141,6,141,12],[142,6,142,12],[143,6,143,12],[154,6,154,12],[155,6,155,12],[156,6,156,12],[157,6,157,12],[158,6,158,12],[149,6,149,12],[150,6,150,12],[151,6,151,12],[152,6,152,12],[153,6,153,12],[164,6,164,12],[165,6,165,12],[166,6,166,12],[167,6,167,12],[168,6,168,12],[159,6,159,12],[160,6,160,12],[161,6,161,12],[162,6,162,12],[163,6,163,12],[174,6,174,12],[175,6,175,12],[176,6,176,12],[177,6,177,12],[178,6,178,12],[169,6,169,12],[170,6,170,12],[171,6,171,12],[172,6,172,12],[173,6,173,12],[184,6,184,12],[185,6,185,12],[186,6,186,12],[187,6,187,12],[188,6,188,12],[179,6,179,12],[180,6,180,12],[181,6,181,12],[182,6,182,12],[183,6,183,12],[194,6,194,12],[195,6,195,12],[196,6,196,12],[197,6,197,12],[198,6,198,12],[189,6,189,12],[190,6,190,12],[191,6,191,12],[192,6,192,12],[193,6,193,12],[204,6,204,12],[205,6,205,12],[206,6,206,12],[207,6,207,12],[208,6,208,12],[199,6,199,12],[200,6,200,12],[201,6,201,12],[202,6,202,12],[203,6,203,12],[214,6,214,12],[215,6,215,12],[216,6,216,12],[217,6,217,12],[218,6,218,12],[209,6,209,12],[210,6,210,12],[211,6,211,12],[212,6,212,12],[213,6,213,12],[224,6,224,12],[225,6,225,12],[226,6,226,12],[227,6,227,12],[228,6,228,12],[219,6,219,12],[220,6,220,12],[221,6,221,12],[222,6,222,12],[223,6,223,12],[234,6,234,12],[235,6,235,12],[236,6,236,12],[237,6,237,12],[238,6,238,12],[229,6,229,12],[230,6,230,12],[231,6,231,12],[232,6,232,12],[233,6,233,12],[244,6,244,12],[245,6,245,12],[246,6,246,12],[247,6,247,12],[248,6,248,12],[239,6,239,12],[240,6,240,12],[241,6,241,12],[242,6,242,12],[243,6,243,12],[254,6,254,12],[255,6,255,12],[256,6,256,12],[257,6,257,12],[258,6,258,12],[249,6,249,12],[250,6,250,12],[251,6,251,12],[252,6,252,12],[253,6,253,12],[264,6,264,12],[265,6,265,12],[266,6,266,12],[267,6,267,12],[268,6,268,12],[259,6,259,12],[260,6,260,12],[261,6,261,12],[262,6,262,12],[263,6,263,12],[274,6,274,12],[275,6,275,12],[276,6,276,12],[277,6,277,12],[278,6,278,12],[269,6,269,12],[270,6,270,12],[271,6,271,12],[272,6,272,12],[273,6,273,12],[284,6,284,12],[285,6,285,12],[286,6,286,12],[287,6,287,12],[288,6,288,12],[279,6,279,12],[280,6,280,12],[281,6,281,12],[282,6,282,12],[283,6,283,12],[294,6,294,12],[295,6,295,12],[296,6,296,12],[297,6,297,12],[298,6,298,12],[289,6,289,12],[290,6,290,12],[291,6,291,12],[292,6,292,12],[293,6,293,12],[304,6,304,12],[305,6,305,12],[306,6,306,12],[307,6,307,12],[308,6,308,12],[299,6,299,12],[300,6,300,12],[301,6,301,12],[302,6,302,12],[303,6,303,12],[314,6,314,12],[315,6,315,12],[316,6,316,12],[317,6,317,12],[318,6,318,12],[309,6,309,12],[310,6,310,12],[311,6,311,12],[312,6,312,12],[313,6,313,12],[324,6,324,12],[325,6,325,12],[326,6,326,12],[327,6,327,12],[328,6,328,12],[319,6,319,12],[320,6,320,12],[321,6,321,12],[322,6,322,12],[323,6,323,12],[334,6,334,12],[335,6,335,12],[336,6,336,12],[337,6,337,12],[338,6,338,12],[329,6,329,12],[330,6,330,12],[331,6,331,12],[332,6,332,12],[333,6,333,12],[344,6,344,12],[345,6,345,12],[346,6,346,12],[347,6,347,12],[348,6,348,12],[339,6,339,12],[340,6,340,12],[341,6,341,12],[342,6,342,12],[343,6,343,12],[354,6,354,12],[355,6,355,12],[356,6,356,12],[357,6,357,12],[358,6,358,12],[349,6,349,12],[350,6,350,12],[351,6,351,12],[352,6,352,12],[353,6,353,12],[364,6,364,12],[365,6,365,12],[366,6,366,12],[367,6,367,12],[368,6,368,12],[359,6,359,12],[360,6,360,12],[361,6,361,12],[362,6,362,12],[363,6,363,12],[374,6,374,12],[375,6,375,12],[376,6,376,12],[377,6,377,12],[378,6,378,12],[369,6,369,12],[370,6,370,12],[371,6,371,12],[372,6,372,12],[373,6,373,12],[384,6,384,12],[385,6,385,12],[386,6,386,12],[387,6,387,12],[388,6,388,12],[379,6,379,12],[380,6,380,12],[381,6,381,12],[382,6,382,12],[383,6,383,12],[394,6,394,12],[395,6,395,12],[396,6,396,12],[397,6,397,12],[398,6,398,12],[389,6,389,12],[390,6,390,12],[391,6,391,12],[392,6,392,12],[393,6,393,12],[404,6,404,12],[405,6,405,12],[406,6,406,12],[407,6,407,12],[408,6,408,12],[399,6,399,12],[400,6,400,12],[401,6,401,12],[402,6,402,12],[403,6,403,12],[414,6,414,12],[415,6,415,12],[416,6,416,12],[417,6,417,12],[418,6,418,12],[409,6,409,12],[410,6,410,12],[411,6,411,12],[412,6,412,12],[413,6,413,12],[424,6,424,12],[425,6,425,12],[426,6,426,12],[427,6,427,12],[428,6,428,12],[419,6,419,12],[420,6,420,12],[421,6,421,12],[422,6,422,12],[423,6,423,12],[434,6,434,12],[435,6,435,12],[436,6,436,12],[437,6,437,12],[438,6,438,12],[429,6,429,12],[430,6,430,12],[431,6,431,12],[432,6,432,12],[433,6,433,12],[444,6,444,12],[445,6,445,12],[446,6,446,12],[447,6,447,12],[448,6,448,12],[439,6,439,12],[440,6,440,12],[441,6,441,12],[442,6,442,12],[443,6,443,12],[463,6,463,12],[454,6,454,12],[455,6,455,12],[456,6,456,12],[457,6,457,12],[458,6,458,12],[449,6,449,12],[450,6,450,12],[451,6,451,12],[452,6,452,12],[453,6,453,12],[0,0,0,18],[479,6,479,12],[480,6,480,12],[481,6,481,12],[482,6,482,12],[474,6,474,12],[475,6,475,12],[476,6,476,12],[477,6,477,12],[478,6,478,12],[469,6,469,12],[470,6,470,12],[471,6,471,12],[472,6,472,12],[473,6,473,12],[464,6,464,12],[465,6,465,12],[466,6,466,12],[467,6,467,12],[468,6,468,12],[459,6,459,12],[460,6,460,12],[461,6,461,12],[462,6,462,12]]}
["Example Template - HDV Class 2b/3 - Federal Tier 3 FTP Fleet Average NMOG+NOx Calculations for One Model Year"]
[null,null,"Manufacturer: ___________________________",null,null,null,null,null,null,null,null,"Date: _____________"]
[]
["Purpose and Scope of this Guidance Document          "]
["        This document was prepared by EPA's Office of Transportation and Air Quality (OTAQ).  It is one of several intended to aid regulated parties in reporting Tier 3 and Cold NMHC Averaging, Banking and Trading (AB&T) information and calculating AB&T fleet average credits for light-duty vehicles and certain heavy-duty class 2b and 3 vehicles, ref. 40 CFR 86.1862-04(c).  It contains EPA's recommended format for manufacturers to report to EPA their end-of-year Tier 3 AB&T calculations, credits and other information with respect to the implementation of the AB&T provisions of the EPA Tier 3 final rule (79 FR 23414, April 28, 2014) as amended (80 FR 9078, February 19, 2015; 80 FR 26463, May 8, 2015);  ref. 40 CFR Parts 85, 86, 600, 1065, 1066.  Use of this document is purely optional.\n       This document does not in any way alter or waive the requirements in EPA regulations.  Although the calculations and formulas provided in this document are intended to assist manufacturers in the implementation of EPA regulations, this document does not establish or change the legal rights or obligations of manufacturers or others in complying with EPA regulations, including 40 CFR 86.1862-04(c). If an error or other discrepancy is found in this document, including the calculation formulas, please contact your EPA certification team member or Dave Good at (734) 214-4450 or by email at good.david@epa.gov.  The regulations take precedence."]
[]
["OMB Control Number 2060-0104\nExpires 3-31-2020",null,null,null,null,"HDV Class 2b Averaging Set",null,null,null,null,null,"HDV Class 3 Averaging Set"]
[null,null,null,null,null,"Emission Standard","Total Production","Fleet average compliance value","Fleet average standard","Credits or Debits",null,"Emission Standard","Total Production","Fleet average compliance value","Fleet average standard","Credits or Debits"]
["Instructions",null,null,null,null,null,null,"g/mi","g/mi","g/mi",null,null,null,"g/mi","g/mi","g/mi"]
["Select Model Year:",null,2019,null,null,"FTP (NMOG+NOx)",{"$f":"SUMIF(B16:B483,\"2b\",F16:F483)","v":193840},{"$f":"astm(SUMIF(B16:B483,\"2b\",P16:P483),3)","v":0.224},{"$f":"IF(C10=2016,0.333,IF(C10=2017,0.31,IF(C10=2018,0.278,IF(C10=2019,0.253,IF(C10=2020,0.228,IF(C10=2021,0.203,IF(C10>=2022,0.178,\"n/a\")))))))","v":0.253},{"$f":"astm(((I10-H10)*$G$10),0)","v":5621},null,"FTP (NMOG+\nNOx)",{"$f":"SUMIF(B16:B483,\"3\",F16:F483)","v":340000},{"$f":"astm(SUMIF(B16:B483,\"3\",P16:P483),3)","v":0.42099999999999999},{"$f":" IF(C10=2016,0.548,IF(C10=2017,0.508,IF(C10=2018,0.451,IF(C10=2019,0.4,IF(C10=2020,0.349,IF(C10=2021,0.298,IF(C10>=2022,0.247,\"n/a\")))))))","v":0.4},{"$f":"astm(((O10-N10)*$M$10),0)","v":-7140}]
[]
[]
[null,null,null,null,null,null,null,null,null,null,null,null,null,null,null,null,"Error Checks"]
["Test Group","HDV  Class of Test Group (and Class of Averaging Set)","Bin\n(NMOG + NOx)","Test Group Useful Life Miles","FTP\nUseful Life of Averaging Set\n(must be 150K)","Production\n(50-State)","Comments",null,null,null,null,null,null,"FTP\nNMOG + NOx Standard\n[Column C Bin x 0.001]","FTP\nProduction\nx Bin Standard\n[Columns\n G x Q]","FTP Intermediate calculation\n\n[(Production x Bin Std)/Total Production]","Error Check for Valid HDV Class & Bin","Error Check: Valid Use of Trans-itional Bins","Error Check for Valid Test Group Useful Life"]
[null,"2b or 3",null,"x1000 Mi","(x 1000 Miles)","# of Units",null,null,null,null,null,null,null,"g/mi","g/mi"]
["A","2b",395,120,150,39458,null,null,null,null,null,null,null,{"$f":"IF(A16=\"\",\"\",C16/1000)","v":0.39500000000000002},{"$f":"  IF(AND(A16=\"\",F16=\"\"),\"\", IF(AND(A16=\"\",F16<>\"\"), \"FIX TEST GRP\", IF(B16=\"\",\"FIX CLASS\",IF(C16=\"\",\"FIX BIN\",IF(F16=\"\",\"FIX PROD'N\",F16*N16)))))","v":15585.91},{"$f":"IF(A16=\"\",\"\",IF(C16=\"\",\"FIX BIN\", IF(D16=\"\",\"FIX U/L MILES\", IFERROR(O16/(IF(B16=\"2b\",$G$10,$M$10)),\"\"))))","v":8.0406056541477505E-2},{"$f":"IF(A16=\"\",\"\",IF(ISERROR(VLOOKUP(CONCATENATE(HDV!B16,\"_\",HDV!C16),Sheet2!$A$28:$A$40,1,FALSE))=TRUE,\"ERROR\",\"OK\"))","v":"OK"},{"$f":"IF(A16=\"\",\"\", IF(AND($C$10>2021, C16=340),\"ERROR\",IF(AND($C$10>2021, C16=395),\"ERROR\",IF(AND($C$10>2021, C16>400),\"ERROR\", \"OK\"))))","v":"OK"},{"$f":"IF(B16=\"\",\"\", IF(AND($C$10>2021, D16<150),\"ERROR\",IF(AND(D16<150, N16=395),\"ERROR\",IF(AND(D16<150, N16=340),\"ERROR\",IF(AND(D16<150, N16>400),\"ERROR\", \"OK\")))))","v":"OK"}]
["B","2b",340,120,150,20382,null,null,null,null,null,null,null,0.34,6929.88,3.5750515889393313E-2,{"$f":"IF(A17=\"\",\"\",IF(ISERROR(VLOOKUP(CONCATENATE(HDV!B17,\"_\",HDV!C17),Sheet2!$A$28:$A$40,1,FALSE))=TRUE,\"ERROR\",\"OK\"))","v":"OK"},"OK","OK"]
["C","2b",200,150,150,45000,null,null,null,null,null,null,null,0.2,9000,4.643004539826661E-2,{"$f":"IF(A18=\"\",\"\",IF(ISERROR(VLOOKUP(CONCATENATE(HDV!B18,\"_\",HDV!C18),Sheet2!$A$28:$A$40,1,FALSE))=TRUE,\"ERROR\",\"OK\"))","v":"OK"},"OK","OK"]
["D","2b",150,150,150,79000,null,null,null,null,null,null,null,0.15,11850,6.1132893107717703E-2,{"$f":"IF(A19=\"\",\"\",IF(ISERROR(VLOOKUP(CONCATENATE(HDV!B19,\"_\",HDV!C19),Sheet2!$A$28:$A$40,1,FALSE))=TRUE,\"ERROR\",\"OK\"))","v":"OK"},"OK","OK"]
["E","2b",0,150,150,10000,null,null,null,null,null,null,null,0,0,0,{"$f":"IF(A20=\"\",\"\",IF(ISERROR(VLOOKUP(CONCATENATE(HDV!B20,\"_\",HDV!C20),Sheet2!$A$28:$A$40,1,FALSE))=TRUE,\"ERROR\",\"OK\"))","v":"OK"},"OK","OK"]
["F",3,630,120,150,90000,null,null,null,null,null,null,null,0.63,56700,0.16676470588235295,{"$f":"IF(A21=\"\",\"\",IF(ISERROR(VLOOKUP(CONCATENATE(HDV!B21,\"_\",HDV!C21),Sheet2!$A$28:$A$40,1,FALSE))=TRUE,\"ERROR\",\"OK\"))","v":"OK"},"OK","OK"]
["G",3,570,120,150,120000,null,null,null,null,null,null,null,0.56999999999999995,68400,0.20117647058823529,{"$f":"IF(A22=\"\",\"\",IF(ISERROR(VLOOKUP(CONCATENATE(HDV!B22,\"_\",HDV!C22),Sheet2!$A$28:$A$40,1,FALSE))=TRUE,\"ERROR\",\"OK\"))","v":"OK"},"OK","OK"]
["H",3,200,150,150,90000,null,null,null,null,null,null,null,0.2,18000,5.2941176470588235E-2,{"$f":"IF(A23=\"\",\"\",IF(ISERROR(VLOOKUP(CONCATENATE(HDV!B23,\"_\",HDV!C23),Sheet2!$A$28:$A$40,1,FALSE))=TRUE,\"ERROR\",\"OK\"))","v":"OK"},"OK","OK"]
["I",3,0,150,150,40000,null,null,null,null,null,null,null,0,0,0,{"$f":"IF(A24=\"\",\"\",IF(ISERROR(VLOOKUP(CONCATENATE(HDV!B24,\"_\",HDV!C24),Sheet2!$A$28:$A$40,1,FALSE))=TRUE,\"ERROR\",\"OK\"))","v":"OK"},"OK","OK"]
[null,null,null,null,null,null,null,null,null,null,null,null,null,"","","",{"$f":"IF(A25=\"\",\"\",IF(ISERROR(VLOOKUP(CONCATENATE(HDV!B25,\"_\",HDV!C25),Sheet2!$A$28:$A$40,1,FALSE))=TRUE,\"ERROR\",\"OK\"))","v":""},"",""]
[null,null,null,null,null,null,null,null,null,null,null,null,null,"","","",{"$f":"IF(A26=\"\",\"\",IF(ISERROR(VLOOKUP(CONCATENATE(HDV!B26,\"_\",HDV!C26),Sheet2!$A$28:$A$40,1,FALSE))=TRUE,\"ERROR\",\"OK\"))","v":""},"",""]
[null,null,null,null,null,null,null,null,null,null,null,null,null,"","","",{"$f":"IF(A27=\"\",\"\",IF(ISERROR(VLOOKUP(CONCATENATE(HDV!B27,\"_\",HDV!C27),Sheet2!$A$28:$A$40,1,FALSE))=TRUE,\"ERROR\",\"OK\"))","v":""},"",""]
[null,null,null,null,null,null,null,null,null,null,null,null,null,"","","",{"$f":"IF(A28=\"\",\"\",IF(ISERROR(VLOOKUP(CONCATENATE(HDV!B28,\"_\",HDV!C28),Sheet2!$A$28:$A$40,1,FALSE))=TRUE,\"ERROR\",\"OK\"))","v":""},"",""]
[null,null,null,null,null,null,null,null,null,null,null,null,null,"","","",{"$f":"IF(A29=\"\",\"\",IF(ISERROR(VLOOKUP(CONCATENATE(HDV!B29,\"_\",HDV!C29),Sheet2!$A$28:$A$40,1,FALSE))=TRUE,\"ERROR\",\"OK\"))","v":""},"",""]
[null,null,null,null,null,null,null,null,null,null,null,null,null,"","","",{"$f":"IF(A30=\"\",\"\",IF(ISERROR(VLOOKUP(CONCATENATE(HDV!B30,\"_\",HDV!C30),Sheet2!$A$28:$A$40,1,FALSE))=TRUE,\"ERROR\",\"OK\"))","v":""},"",""]
[null,null,null,null,null,null,null,null,null,null,null,null,null,"","","",{"$f":"IF(A31=\"\",\"\",IF(ISERROR(VLOOKUP(CONCATENATE(HDV!B31,\"_\",HDV!C31),Sheet2!$A$28:$A$40,1,FALSE))=TRUE,\"ERROR\",\"OK\"))","v":""},"",""]
[null,null,null,null,null,null,null,null,null,null,null,null,null,"","","",{"$f":"IF(A32=\"\",\"\",IF(ISERROR(VLOOKUP(CONCATENATE(HDV!B32,\"_\",HDV!C32),Sheet2!$A$28:$A$40,1,FALSE))=TRUE,\"ERROR\",\"OK\"))","v":""},"",""]
[null,null,null,null,null,null,null,null,null,null,null,null,null,"","","",{"$f":"IF(A33=\"\",\"\",IF(ISERROR(VLOOKUP(CONCATENATE(HDV!B33,\"_\",HDV!C33),Sheet2!$A$28:$A$40,1,FALSE))=TRUE,\"ERROR\",\"OK\"))","v":""},"",""]
[null,null,null,null,null,null,null,null,null,null,null,null,null,"","","",{"$f":"IF(A34=\"\",\"\",IF(ISERROR(VLOOKUP(CONCATENATE(HDV!B34,\"_\",HDV!C34),Sheet2!$A$28:$A$40,1,FALSE))=TRUE,\"ERROR\",\"OK\"))","v":""},"",""]
[null,null,null,null,null,null,null,null,null,null,null,null,null,"","","",{"$f":"IF(A35=\"\",\"\",IF(ISERROR(VLOOKUP(CONCATENATE(HDV!B35,\"_\",HDV!C35),Sheet2!$A$28:$A$40,1,FALSE))=TRUE,\"ERROR\",\"OK\"))","v":""},"",""]
[null,null,null,null,null,null,null,null,null,null,null,null,null,"","","",{"$f":"IF(A36=\"\",\"\",IF(ISERROR(VLOOKUP(CONCATENATE(HDV!B36,\"_\",HDV!C36),Sheet2!$A$28:$A$40,1,FALSE))=TRUE,\"ERROR\",\"OK\"))","v":""},"",""]
[null,null,null,null,null,null,null,null,null,null,null,null,null,"","","",{"$f":"IF(A37=\"\",\"\",IF(ISERROR(VLOOKUP(CONCATENATE(HDV!B37,\"_\",HDV!C37),Sheet2!$A$28:$A$40,1,FALSE))=TRUE,\"ERROR\",\"OK\"))","v":""},"",""]
[null,null,null,null,null,null,null,null,null,null,null,null,null,"","","",{"$f":"IF(A38=\"\",\"\",IF(ISERROR(VLOOKUP(CONCATENATE(HDV!B38,\"_\",HDV!C38),Sheet2!$A$28:$A$40,1,FALSE))=TRUE,\"ERROR\",\"OK\"))","v":""},"",""]
[null,null,null,null,null,null,null,null,null,null,null,null,null,"","","",{"$f":"IF(A39=\"\",\"\",IF(ISERROR(VLOOKUP(CONCATENATE(HDV!B39,\"_\",HDV!C39),Sheet2!$A$28:$A$40,1,FALSE))=TRUE,\"ERROR\",\"OK\"))","v":""},"",""]
[null,null,null,null,null,null,null,null,null,null,null,null,null,"","","",{"$f":"IF(A40=\"\",\"\",IF(ISERROR(VLOOKUP(CONCATENATE(HDV!B40,\"_\",HDV!C40),Sheet2!$A$28:$A$40,1,FALSE))=TRUE,\"ERROR\",\"OK\"))","v":""},"",""]
[null,null,null,null,null,null,null,null,null,null,null,null,null,"","","",{"$f":"IF(A41=\"\",\"\",IF(ISERROR(VLOOKUP(CONCATENATE(HDV!B41,\"_\",HDV!C41),Sheet2!$A$28:$A$40,1,FALSE))=TRUE,\"ERROR\",\"OK\"))","v":""},"",""]
[null,null,null,null,null,null,null,null,null,null,null,null,null,"","","",{"$f":"IF(A42=\"\",\"\",IF(ISERROR(VLOOKUP(CONCATENATE(HDV!B42,\"_\",HDV!C42),Sheet2!$A$28:$A$40,1,FALSE))=TRUE,\"ERROR\",\"OK\"))","v":""},"",""]
[null,null,null,null,null,null,null,null,null,null,null,null,null,"","","",{"$f":"IF(A43=\"\",\"\",IF(ISERROR(VLOOKUP(CONCATENATE(HDV!B43,\"_\",HDV!C43),Sheet2!$A$28:$A$40,1,FALSE))=TRUE,\"ERROR\",\"OK\"))","v":""},"",""]
[null,null,null,null,null,null,null,null,null,null,null,null,null,"","","",{"$f":"IF(A44=\"\",\"\",IF(ISERROR(VLOOKUP(CONCATENATE(HDV!B44,\"_\",HDV!C44),Sheet2!$A$28:$A$40,1,FALSE))=TRUE,\"ERROR\",\"OK\"))","v":""},"",""]
[null,null,null,null,null,null,null,null,null,null,null,null,null,"","","",{"$f":"IF(A45=\"\",\"\",IF(ISERROR(VLOOKUP(CONCATENATE(HDV!B45,\"_\",HDV!C45),Sheet2!$A$28:$A$40,1,FALSE))=TRUE,\"ERROR\",\"OK\"))","v":""},"",""]
[null,null,null,null,null,null,null,null,null,null,null,null,null,"","","",{"$f":"IF(A46=\"\",\"\",IF(ISERROR(VLOOKUP(CONCATENATE(HDV!B46,\"_\",HDV!C46),Sheet2!$A$28:$A$40,1,FALSE))=TRUE,\"ERROR\",\"OK\"))","v":""},"",""]
[null,null,null,null,null,null,null,null,null,null,null,null,null,"","","",{"$f":"IF(A47=\"\",\"\",IF(ISERROR(VLOOKUP(CONCATENATE(HDV!B47,\"_\",HDV!C47),Sheet2!$A$28:$A$40,1,FALSE))=TRUE,\"ERROR\",\"OK\"))","v":""},"",""]
[null,null,null,null,null,null,null,null,null,null,null,null,null,"","","",{"$f":"IF(A48=\"\",\"\",IF(ISERROR(VLOOKUP(CONCATENATE(HDV!B48,\"_\",HDV!C48),Sheet2!$A$28:$A$40,1,FALSE))=TRUE,\"ERROR\",\"OK\"))","v":""},"",""]
[null,null,null,null,null,null,null,null,null,null,null,null,null,"","","",{"$f":"IF(A49=\"\",\"\",IF(ISERROR(VLOOKUP(CONCATENATE(HDV!B49,\"_\",HDV!C49),Sheet2!$A$28:$A$40,1,FALSE))=TRUE,\"ERROR\",\"OK\"))","v":""},"",""]
[null,null,null,null,null,null,null,null,null,null,null,null,null,"","","",{"$f":"IF(A50=\"\",\"\",IF(ISERROR(VLOOKUP(CONCATENATE(HDV!B50,\"_\",HDV!C50),Sheet2!$A$28:$A$40,1,FALSE))=TRUE,\"ERROR\",\"OK\"))","v":""},"",""]
[null,null,null,null,null,null,null,null,null,null,null,null,null,"","","",{"$f":"IF(A51=\"\",\"\",IF(ISERROR(VLOOKUP(CONCATENATE(HDV!B51,\"_\",HDV!C51),Sheet2!$A$28:$A$40,1,FALSE))=TRUE,\"ERROR\",\"OK\"))","v":""},"",""]
[null,null,null,null,null,null,null,null,null,null,null,null,null,"","","",{"$f":"IF(A52=\"\",\"\",IF(ISERROR(VLOOKUP(CONCATENATE(HDV!B52,\"_\",HDV!C52),Sheet2!$A$28:$A$40,1,FALSE))=TRUE,\"ERROR\",\"OK\"))","v":""},"",""]
[null,null,null,null,null,null,null,null,null,null,null,null,null,"","","",{"$f":"IF(A53=\"\",\"\",IF(ISERROR(VLOOKUP(CONCATENATE(HDV!B53,\"_\",HDV!C53),Sheet2!$A$28:$A$40,1,FALSE))=TRUE,\"ERROR\",\"OK\"))","v":""},"",""]
[null,null,null,null,null,null,null,null,null,null,null,null,null,"","","",{"$f":"IF(A54=\"\",\"\",IF(ISERROR(VLOOKUP(CONCATENATE(HDV!B54,\"_\",HDV!C54),Sheet2!$A$28:$A$40,1,FALSE))=TRUE,\"ERROR\",\"OK\"))","v":""},"",""]
[null,null,null,null,null,null,null,null,null,null,null,null,null,"","","",{"$f":"IF(A55=\"\",\"\",IF(ISERROR(VLOOKUP(CONCATENATE(HDV!B55,\"_\",HDV!C55),Sheet2!$A$28:$A$40,1,FALSE))=TRUE,\"ERROR\",\"OK\"))","v":""},"",""]
[null,null,null,null,null,null,null,null,null,null,null,null,null,"","","",{"$f":"IF(A56=\"\",\"\",IF(ISERROR(VLOOKUP(CONCATENATE(HDV!B56,\"_\",HDV!C56),Sheet2!$A$28:$A$40,1,FALSE))=TRUE,\"ERROR\",\"OK\"))","v":""},"",""]
[null,null,null,null,null,null,null,null,null,null,null,null,null,"","","",{"$f":"IF(A57=\"\",\"\",IF(ISERROR(VLOOKUP(CONCATENATE(HDV!B57,\"_\",HDV!C57),Sheet2!$A$28:$A$40,1,FALSE))=TRUE,\"ERROR\",\"OK\"))","v":""},"",""]
[null,null,null,null,null,null,null,null,null,null,null,null,null,"","","",{"$f":"IF(A58=\"\",\"\",IF(ISERROR(VLOOKUP(CONCATENATE(HDV!B58,\"_\",HDV!C58),Sheet2!$A$28:$A$40,1,FALSE))=TRUE,\"ERROR\",\"OK\"))","v":""},"",""]
[null,null,null,null,null,null,null,null,null,null,null,null,null,"","","",{"$f":"IF(A59=\"\",\"\",IF(ISERROR(VLOOKUP(CONCATENATE(HDV!B59,\"_\",HDV!C59),Sheet2!$A$28:$A$40,1,FALSE))=TRUE,\"ERROR\",\"OK\"))","v":""},"",""]
[null,null,null,null,null,null,null,null,null,null,null,null,null,"","","",{"$f":"IF(A60=\"\",\"\",IF(ISERROR(VLOOKUP(CONCATENATE(HDV!B60,\"_\",HDV!C60),Sheet2!$A$28:$A$40,1,FALSE))=TRUE,\"ERROR\",\"OK\"))","v":""},"",""]
[null,null,null,null,null,null,null,null,null,null,null,null,null,"","","",{"$f":"IF(A61=\"\",\"\",IF(ISERROR(VLOOKUP(CONCATENATE(HDV!B61,\"_\",HDV!C61),Sheet2!$A$28:$A$40,1,FALSE))=TRUE,\"ERROR\",\"OK\"))","v":""},"",""]
[null,null,null,null,null,null,null,null,null,null,null,null,null,"","","",{"$f":"IF(A62=\"\",\"\",IF(ISERROR(VLOOKUP(CONCATENATE(HDV!B62,\"_\",HDV!C62),Sheet2!$A$28:$A$40,1,FALSE))=TRUE,\"ERROR\",\"OK\"))","v":""},"",""]
[null,null,null,null,null,null,null,null,null,null,null,null,null,"","","",{"$f":"IF(A63=\"\",\"\",IF(ISERROR(VLOOKUP(CONCATENATE(HDV!B63,\"_\",HDV!C63),Sheet2!$A$28:$A$40,1,FALSE))=TRUE,\"ERROR\",\"OK\"))","v":""},"",""]
[null,null,null,null,null,null,null,null,null,null,null,null,null,"","","",{"$f":"IF(A64=\"\",\"\",IF(ISERROR(VLOOKUP(CONCATENATE(HDV!B64,\"_\",HDV!C64),Sheet2!$A$28:$A$40,1,FALSE))=TRUE,\"ERROR\",\"OK\"))","v":""},"",""]
[null,null,null,null,null,null,null,null,null,null,null,null,null,"","","",{"$f":"IF(A65=\"\",\"\",IF(ISERROR(VLOOKUP(CONCATENATE(HDV!B65,\"_\",HDV!C65),Sheet2!$A$28:$A$40,1,FALSE))=TRUE,\"ERROR\",\"OK\"))","v":""},"",""]
[null,null,null,null,null,null,null,null,null,null,null,null,null,"","","",{"$f":"IF(A66=\"\",\"\",IF(ISERROR(VLOOKUP(CONCATENATE(HDV!B66,\"_\",HDV!C66),Sheet2!$A$28:$A$40,1,FALSE))=TRUE,\"ERROR\",\"OK\"))","v":""},"",""]
[null,null,null,null,null,null,null,null,null,null,null,null,null,"","","",{"$f":"IF(A67=\"\",\"\",IF(ISERROR(VLOOKUP(CONCATENATE(HDV!B67,\"_\",HDV!C67),Sheet2!$A$28:$A$40,1,FALSE))=TRUE,\"ERROR\",\"OK\"))","v":""},"",""]
[null,null,null,null,null,null,null,null,null,null,null,null,null,"","","",{"$f":"IF(A68=\"\",\"\",IF(ISERROR(VLOOKUP(CONCATENATE(HDV!B68,\"_\",HDV!C68),Sheet2!$A$28:$A$40,1,FALSE))=TRUE,\"ERROR\",\"OK\"))","v":""},"",""]
[null,null,null,null,null,null,null,null,null,null,null,null,null,"","","",{"$f":"IF(A69=\"\",\"\",IF(ISERROR(VLOOKUP(CONCATENATE(HDV!B69,\"_\",HDV!C69),Sheet2!$A$28:$A$40,1,FALSE))=TRUE,\"ERROR\",\"OK\"))","v":""},"",""]
[null,null,null,null,null,null,null,null,null,null,null,null,null,"","","",{"$f":"IF(A70=\"\",\"\",IF(ISERROR(VLOOKUP(CONCATENATE(HDV!B70,\"_\",HDV!C70),Sheet2!$A$28:$A$40,1,FALSE))=TRUE,\"ERROR\",\"OK\"))","v":""},"",""]
[null,null,null,null,null,null,null,null,null,null,null,null,null,"","","",{"$f":"IF(A71=\"\",\"\",IF(ISERROR(VLOOKUP(CONCATENATE(HDV!B71,\"_\",HDV!C71),Sheet2!$A$28:$A$40,1,FALSE))=TRUE,\"ERROR\",\"OK\"))","v":""},"",""]
[null,null,null,null,null,null,null,null,null,null,null,null,null,"","","",{"$f":"IF(A72=\"\",\"\",IF(ISERROR(VLOOKUP(CONCATENATE(HDV!B72,\"_\",HDV!C72),Sheet2!$A$28:$A$40,1,FALSE))=TRUE,\"ERROR\",\"OK\"))","v":""},"",""]
[null,null,null,null,null,null,null,null,null,null,null,null,null,"","","",{"$f":"IF(A73=\"\",\"\",IF(ISERROR(VLOOKUP(CONCATENATE(HDV!B73,\"_\",HDV!C73),Sheet2!$A$28:$A$40,1,FALSE))=TRUE,\"ERROR\",\"OK\"))","v":""},"",""]
[null,null,null,null,null,null,null,null,null,null,null,null,null,"","","",{"$f":"IF(A74=\"\",\"\",IF(ISERROR(VLOOKUP(CONCATENATE(HDV!B74,\"_\",HDV!C74),Sheet2!$A$28:$A$40,1,FALSE))=TRUE,\"ERROR\",\"OK\"))","v":""},"",""]
[null,null,null,null,null,null,null,null,null,null,null,null,null,"","","",{"$f":"IF(A75=\"\",\"\",IF(ISERROR(VLOOKUP(CONCATENATE(HDV!B75,\"_\",HDV!C75),Sheet2!$A$28:$A$40,1,FALSE))=TRUE,\"ERROR\",\"OK\"))","v":""},"",""]
[null,null,null,null,null,null,null,null,null,null,null,null,null,"","","",{"$f":"IF(A76=\"\",\"\",IF(ISERROR(VLOOKUP(CONCATENATE(HDV!B76,\"_\",HDV!C76),Sheet2!$A$28:$A$40,1,FALSE))=TRUE,\"ERROR\",\"OK\"))","v":""},"",""]
[null,null,null,null,null,null,null,null,null,null,null,null,null,"","","",{"$f":"IF(A77=\"\",\"\",IF(ISERROR(VLOOKUP(CONCATENATE(HDV!B77,\"_\",HDV!C77),Sheet2!$A$28:$A$40,1,FALSE))=TRUE,\"ERROR\",\"OK\"))","v":""},"",""]
[null,null,null,null,null,null,null,null,null,null,null,null,null,"","","",{"$f":"IF(A78=\"\",\"\",IF(ISERROR(VLOOKUP(CONCATENATE(HDV!B78,\"_\",HDV!C78),Sheet2!$A$28:$A$40,1,FALSE))=TRUE,\"ERROR\",\"OK\"))","v":""},"",""]
[null,null,null,null,null,null,null,null,null,null,null,null,null,"","","",{"$f":"IF(A79=\"\",\"\",IF(ISERROR(VLOOKUP(CONCATENATE(HDV!B79,\"_\",HDV!C79),Sheet2!$A$28:$A$40,1,FALSE))=TRUE,\"ERROR\",\"OK\"))","v":""},"",""]
[null,null,null,null,null,null,null,null,null,null,null,null,null,{"$f":"IF(A80=\"\",\"\",C80/1000)","v":""},{"$f":"  IF(AND(A80=\"\",F80=\"\"),\"\", IF(AND(A80=\"\",F80<>\"\"), \"FIX TEST GRP\", IF(B80=\"\",\"FIX CLASS\",IF(C80=\"\",\"FIX BIN\",IF(F80=\"\",\"FIX PROD'N\",F80*N80)))))","v":""},{"$f":"IF(A80=\"\",\"\",IF(C80=\"\",\"FIX BIN\", IF(D80=\"\",\"FIX U/L MILES\", IFERROR(O80/(IF(B80=\"2b\",$G$10,$M$10)),\"\"))))","v":""},{"$f":"IF(A80=\"\",\"\",IF(ISERROR(VLOOKUP(CONCATENATE(HDV!B80,\"_\",HDV!C80),Sheet2!$A$28:$A$40,1,FALSE))=TRUE,\"ERROR\",\"OK\"))","v":""},{"$f":"IF(A80=\"\",\"\", IF(AND($C$10>2021, C80=340),\"ERROR\",IF(AND($C$10>2021, C80=395),\"ERROR\",IF(AND($C$10>2021, C80>400),\"ERROR\", \"OK\"))))","v":""},{"$f":"IF(B80=\"\",\"\", IF(AND($C$10>2021, D80<150),\"ERROR\",IF(AND(D80<150, N80=395),\"ERROR\",IF(AND(D80<150, N80=340),\"ERROR\",IF(AND(D80<150, N80>400),\"ERROR\", \"OK\")))))","v":""}]
[null,null,null,null,null,null,null,null,null,null,null,null,null,"","","",{"$f":"IF(A81=\"\",\"\",IF(ISERROR(VLOOKUP(CONCATENATE(HDV!B81,\"_\",HDV!C81),Sheet2!$A$28:$A$40,1,FALSE))=TRUE,\"ERROR\",\"OK\"))","v":""},"",""]
[null,null,null,null,null,null,null,null,null,null,null,null,null,"","","",{"$f":"IF(A82=\"\",\"\",IF(ISERROR(VLOOKUP(CONCATENATE(HDV!B82,\"_\",HDV!C82),Sheet2!$A$28:$A$40,1,FALSE))=TRUE,\"ERROR\",\"OK\"))","v":""},"",""]
[null,null,null,null,null,null,null,null,null,null,null,null,null,"","","",{"$f":"IF(A83=\"\",\"\",IF(ISERROR(VLOOKUP(CONCATENATE(HDV!B83,\"_\",HDV!C83),Sheet2!$A$28:$A$40,1,FALSE))=TRUE,\"ERROR\",\"OK\"))","v":""},"",""]
[null,null,null,null,null,null,null,null,null,null,null,null,null,"","","",{"$f":"IF(A84=\"\",\"\",IF(ISERROR(VLOOKUP(CONCATENATE(HDV!B84,\"_\",HDV!C84),Sheet2!$A$28:$A$40,1,FALSE))=TRUE,\"ERROR\",\"OK\"))","v":""},"",""]
[null,null,null,null,null,null,null,null,null,null,null,null,null,"","","",{"$f":"IF(A85=\"\",\"\",IF(ISERROR(VLOOKUP(CONCATENATE(HDV!B85,\"_\",HDV!C85),Sheet2!$A$28:$A$40,1,FALSE))=TRUE,\"ERROR\",\"OK\"))","v":""},"",""]
[null,null,null,null,null,null,null,null,null,null,null,null,null,"","","",{"$f":"IF(A86=\"\",\"\",IF(ISERROR(VLOOKUP(CONCATENATE(HDV!B86,\"_\",HDV!C86),Sheet2!$A$28:$A$40,1,FALSE))=TRUE,\"ERROR\",\"OK\"))","v":""},"",""]
[null,null,null,null,null,null,null,null,null,null,null,null,null,"","","",{"$f":"IF(A87=\"\",\"\",IF(ISERROR(VLOOKUP(CONCATENATE(HDV!B87,\"_\",HDV!C87),Sheet2!$A$28:$A$40,1,FALSE))=TRUE,\"ERROR\",\"OK\"))","v":""},"",""]
[null,null,null,null,null,null,null,null,null,null,null,null,null,"","","",{"$f":"IF(A88=\"\",\"\",IF(ISERROR(VLOOKUP(CONCATENATE(HDV!B88,\"_\",HDV!C88),Sheet2!$A$28:$A$40,1,FALSE))=TRUE,\"ERROR\",\"OK\"))","v":""},"",""]
[null,null,null,null,null,null,null,null,null,null,null,null,null,"","","",{"$f":"IF(A89=\"\",\"\",IF(ISERROR(VLOOKUP(CONCATENATE(HDV!B89,\"_\",HDV!C89),Sheet2!$A$28:$A$40,1,FALSE))=TRUE,\"ERROR\",\"OK\"))","v":""},"",""]
[null,null,null,null,null,null,null,null,null,null,null,null,null,"","","",{"$f":"IF(A90=\"\",\"\",IF(ISERROR(VLOOKUP(CONCATENATE(HDV!B90,\"_\",HDV!C90),Sheet2!$A$28:$A$40,1,FALSE))=TRUE,\"ERROR\",\"OK\"))","v":""},"",""]
[null,null,null,null,null,null,null,null,null,null,null,null,null,"","","",{"$f":"IF(A91=\"\",\"\",IF(ISERROR(VLOOKUP(CONCATENATE(HDV!B91,\"_\",HDV!C91),Sheet2!$A$28:$A$40,1,FALSE))=TRUE,\"ERROR\",\"OK\"))","v":""},"",""]
[null,null,null,null,null,null,null,null,null,null,null,null,null,"","","",{"$f":"IF(A92=\"\",\"\",IF(ISERROR(VLOOKUP(CONCATENATE(HDV!B92,\"_\",HDV!C92),Sheet2!$A$28:$A$40,1,FALSE))=TRUE,\"ERROR\",\"OK\"))","v":""},"",""]
[null,null,null,null,null,null,null,null,null,null,null,null,null,"","","",{"$f":"IF(A93=\"\",\"\",IF(ISERROR(VLOOKUP(CONCATENATE(HDV!B93,\"_\",HDV!C93),Sheet2!$A$28:$A$40,1,FALSE))=TRUE,\"ERROR\",\"OK\"))","v":""},"",""]
[null,null,null,null,null,null,null,null,null,null,null,null,null,"","","",{"$f":"IF(A94=\"\",\"\",IF(ISERROR(VLOOKUP(CONCATENATE(HDV!B94,\"_\",HDV!C94),Sheet2!$A$28:$A$40,1,FALSE))=TRUE,\"ERROR\",\"OK\"))","v":""},"",""]
[null,null,null,null,null,null,null,null,null,null,null,null,null,"","","",{"$f":"IF(A95=\"\",\"\",IF(ISERROR(VLOOKUP(CONCATENATE(HDV!B95,\"_\",HDV!C95),Sheet2!$A$28:$A$40,1,FALSE))=TRUE,\"ERROR\",\"OK\"))","v":""},"",""]
[null,null,null,null,null,null,null,null,null,null,null,null,null,"","","",{"$f":"IF(A96=\"\",\"\",IF(ISERROR(VLOOKUP(CONCATENATE(HDV!B96,\"_\",HDV!C96),Sheet2!$A$28:$A$40,1,FALSE))=TRUE,\"ERROR\",\"OK\"))","v":""},"",""]
[null,null,null,null,null,null,null,null,null,null,null,null,null,"","","",{"$f":"IF(A97=\"\",\"\",IF(ISERROR(VLOOKUP(CONCATENATE(HDV!B97,\"_\",HDV!C97),Sheet2!$A$28:$A$40,1,FALSE))=TRUE,\"ERROR\",\"OK\"))","v":""},"",""]
[null,null,null,null,null,null,null,null,null,null,null,null,null,"","","",{"$f":"IF(A98=\"\",\"\",IF(ISERROR(VLOOKUP(CONCATENATE(HDV!B98,\"_\",HDV!C98),Sheet2!$A$28:$A$40,1,FALSE))=TRUE,\"ERROR\",\"OK\"))","v":""},"",""]
[null,null,null,null,null,null,null,null,null,null,null,null,null,"","","",{"$f":"IF(A99=\"\",\"\",IF(ISERROR(VLOOKUP(CONCATENATE(HDV!B99,\"_\",HDV!C99),Sheet2!$A$28:$A$40,1,FALSE))=TRUE,\"ERROR\",\"OK\"))","v":""},"",""]
[null,null,null,null,null,null,null,null,null,null,null,null,null,"","","",{"$f":"IF(A100=\"\",\"\",IF(ISERROR(VLOOKUP(CONCATENATE(HDV!B100,\"_\",HDV!C100),Sheet2!$A$28:$A$40,1,FALSE))=TRUE,\"ERROR\",\"OK\"))","v":""},"",""]
[null,null,null,null,null,null,null,null,null,null,null,null,null,"","","",{"$f":"IF(A101=\"\",\"\",IF(ISERROR(VLOOKUP(CONCATENATE(HDV!B101,\"_\",HDV!C101),Sheet2!$A$28:$A$40,1,FALSE))=TRUE,\"ERROR\",\"OK\"))","v":""},"",""]
[null,null,null,null,null,null,null,null,null,null,null,null,null,"","","",{"$f":"IF(A102=\"\",\"\",IF(ISERROR(VLOOKUP(CONCATENATE(HDV!B102,\"_\",HDV!C102),Sheet2!$A$28:$A$40,1,FALSE))=TRUE,\"ERROR\",\"OK\"))","v":""},"",""]
[null,null,null,null,null,null,null,null,null,null,null,null,null,"","","",{"$f":"IF(A103=\"\",\"\",IF(ISERROR(VLOOKUP(CONCATENATE(HDV!B103,\"_\",HDV!C103),Sheet2!$A$28:$A$40,1,FALSE))=TRUE,\"ERROR\",\"OK\"))","v":""},"",""]
[null,null,null,null,null,null,null,null,null,null,null,null,null,"","","",{"$f":"IF(A104=\"\",\"\",IF(ISERROR(VLOOKUP(CONCATENATE(HDV!B104,\"_\",HDV!C104),Sheet2!$A$28:$A$40,1,FALSE))=TRUE,\"ERROR\",\"OK\"))","v":""},"",""]
[null,null,null,null,null,null,null,null,null,null,null,null,null,"","","",{"$f":"IF(A105=\"\",\"\",IF(ISERROR(VLOOKUP(CONCATENATE(HDV!B105,\"_\",HDV!C105),Sheet2!$A$28:$A$40,1,FALSE))=TRUE,\"ERROR\",\"OK\"))","v":""},"",""]
[null,null,null,null,null,null,null,null,null,null,null,null,null,"","","",{"$f":"IF(A106=\"\",\"\",IF(ISERROR(VLOOKUP(CONCATENATE(HDV!B106,\"_\",HDV!C106),Sheet2!$A$28:$A$40,1,FALSE))=TRUE,\"ERROR\",\"OK\"))","v":""},"",""]
[null,null,null,null,null,null,null,null,null,null,null,null,null,"","","",{"$f":"IF(A107=\"\",\"\",IF(ISERROR(VLOOKUP(CONCATENATE(HDV!B107,\"_\",HDV!C107),Sheet2!$A$28:$A$40,1,FALSE))=TRUE,\"ERROR\",\"OK\"))","v":""},"",""]
[null,null,null,null,null,null,null,null,null,null,null,null,null,"","","",{"$f":"IF(A108=\"\",\"\",IF(ISERROR(VLOOKUP(CONCATENATE(HDV!B108,\"_\",HDV!C108),Sheet2!$A$28:$A$40,1,FALSE))=TRUE,\"ERROR\",\"OK\"))","v":""},"",""]
[null,null,null,null,null,null,null,null,null,null,null,null,null,"","","",{"$f":"IF(A109=\"\",\"\",IF(ISERROR(VLOOKUP(CONCATENATE(HDV!B109,\"_\",HDV!C109),Sheet2!$A$28:$A$40,1,FALSE))=TRUE,\"ERROR\",\"OK\"))","v":""},"",""]
[null,null,null,null,null,null,null,null,null,null,null,null,null,"","","",{"$f":"IF(A110=\"\",\"\",IF(ISERROR(VLOOKUP(CONCATENATE(HDV!B110,\"_\",HDV!C110),Sheet2!$A$28:$A$40,1,FALSE))=TRUE,\"ERROR\",\"OK\"))","v":""},"",""]
[null,null,null,null,null,null,null,null,null,null,null,null,null,"","","",{"$f":"IF(A111=\"\",\"\",IF(ISERROR(VLOOKUP(CONCATENATE(HDV!B111,\"_\",HDV!C111),Sheet2!$A$28:$A$40,1,FALSE))=TRUE,\"ERROR\",\"OK\"))","v":""},"",""]
[null,null,null,null,null,null,null,null,null,null,null,null,null,"","","",{"$f":"IF(A112=\"\",\"\",IF(ISERROR(VLOOKUP(CONCATENATE(HDV!B112,\"_\",HDV!C112),Sheet2!$A$28:$A$40,1,FALSE))=TRUE,\"ERROR\",\"OK\"))","v":""},"",""]
[null,null,null,null,null,null,null,null,null,null,null,null,null,"","","",{"$f":"IF(A113=\"\",\"\",IF(ISERROR(VLOOKUP(CONCATENATE(HDV!B113,\"_\",HDV!C113),Sheet2!$A$28:$A$40,1,FALSE))=TRUE,\"ERROR\",\"OK\"))","v":""},"",""]
[null,null,null,null,null,null,null,null,null,null,null,null,null,"","","",{"$f":"IF(A114=\"\",\"\",IF(ISERROR(VLOOKUP(CONCATENATE(HDV!B114,\"_\",HDV!C114),Sheet2!$A$28:$A$40,1,FALSE))=TRUE,\"ERROR\",\"OK\"))","v":""},"",""]
[null,null,null,null,null,null,null,null,null,null,null,null,null,"","","",{"$f":"IF(A115=\"\",\"\",IF(ISERROR(VLOOKUP(CONCATENATE(HDV!B115,\"_\",HDV!C115),Sheet2!$A$28:$A$40,1,FALSE))=TRUE,\"ERROR\",\"OK\"))","v":""},"",""]
[null,null,null,null,null,null,null,null,null,null,null,null,null,"","","",{"$f":"IF(A116=\"\",\"\",IF(ISERROR(VLOOKUP(CONCATENATE(HDV!B116,\"_\",HDV!C116),Sheet2!$A$28:$A$40,1,FALSE))=TRUE,\"ERROR\",\"OK\"))","v":""},"",""]
[null,null,null,null,null,null,null,null,null,null,null,null,null,"","","",{"$f":"IF(A117=\"\",\"\",IF(ISERROR(VLOOKUP(CONCATENATE(HDV!B117,\"_\",HDV!C117),Sheet2!$A$28:$A$40,1,FALSE))=TRUE,\"ERROR\",\"OK\"))","v":""},"",""]
[null,null,null,null,null,null,null,null,null,null,null,null,null,"","","",{"$f":"IF(A118=\"\",\"\",IF(ISERROR(VLOOKUP(CONCATENATE(HDV!B118,\"_\",HDV!C118),Sheet2!$A$28:$A$40,1,FALSE))=TRUE,\"ERROR\",\"OK\"))","v":""},"",""]
[null,null,null,null,null,null,null,null,null,null,null,null,null,"","","",{"$f":"IF(A119=\"\",\"\",IF(ISERROR(VLOOKUP(CONCATENATE(HDV!B119,\"_\",HDV!C119),Sheet2!$A$28:$A$40,1,FALSE))=TRUE,\"ERROR\",\"OK\"))","v":""},"",""]
[null,null,null,null,null,null,null,null,null,null,null,null,null,"","","",{"$f":"IF(A120=\"\",\"\",IF(ISERROR(VLOOKUP(CONCATENATE(HDV!B120,\"_\",HDV!C120),Sheet2!$A$28:$A$40,1,FALSE))=TRUE,\"ERROR\",\"OK\"))","v":""},"",""]
[null,null,null,null,null,null,null,null,null,null,null,null,null,"","","",{"$f":"IF(A121=\"\",\"\",IF(ISERROR(VLOOKUP(CONCATENATE(HDV!B121,\"_\",HDV!C121),Sheet2!$A$28:$A$40,1,FALSE))=TRUE,\"ERROR\",\"OK\"))","v":""},"",""]
[null,null,null,null,null,null,null,null,null,null,null,null,null,"","","",{"$f":"IF(A122=\"\",\"\",IF(ISERROR(VLOOKUP(CONCATENATE(HDV!B122,\"_\",HDV!C122),Sheet2!$A$28:$A$40,1,FALSE))=TRUE,\"ERROR\",\"OK\"))","v":""},"",""]
[null,null,null,null,null,null,null,null,null,null,null,null,null,"","","",{"$f":"IF(A123=\"\",\"\",IF(ISERROR(VLOOKUP(CONCATENATE(HDV!B123,\"_\",HDV!C123),Sheet2!$A$28:$A$40,1,FALSE))=TRUE,\"ERROR\",\"OK\"))","v":""},"",""]
[null,null,null,null,null,null,null,null,null,null,null,null,null,"","","",{"$f":"IF(A124=\"\",\"\",IF(ISERROR(VLOOKUP(CONCATENATE(HDV!B124,\"_\",HDV!C124),Sheet2!$A$28:$A$40,1,FALSE))=TRUE,\"ERROR\",\"OK\"))","v":""},"",""]
[null,null,null,null,null,null,null,null,null,null,null,null,null,"","","",{"$f":"IF(A125=\"\",\"\",IF(ISERROR(VLOOKUP(CONCATENATE(HDV!B125,\"_\",HDV!C125),Sheet2!$A$28:$A$40,1,FALSE))=TRUE,\"ERROR\",\"OK\"))","v":""},"",""]
[null,null,null,null,null,null,null,null,null,null,null,null,null,"","","",{"$f":"IF(A126=\"\",\"\",IF(ISERROR(VLOOKUP(CONCATENATE(HDV!B126,\"_\",HDV!C126),Sheet2!$A$28:$A$40,1,FALSE))=TRUE,\"ERROR\",\"OK\"))","v":""},"",""]
[null,null,null,null,null,null,null,null,null,null,null,null,null,"","","",{"$f":"IF(A127=\"\",\"\",IF(ISERROR(VLOOKUP(CONCATENATE(HDV!B127,\"_\",HDV!C127),Sheet2!$A$28:$A$40,1,FALSE))=TRUE,\"ERROR\",\"OK\"))","v":""},"",""]
[null,null,null,null,null,null,null,null,null,null,null,null,null,"","","",{"$f":"IF(A128=\"\",\"\",IF(ISERROR(VLOOKUP(CONCATENATE(HDV!B128,\"_\",HDV!C128),Sheet2!$A$28:$A$40,1,FALSE))=TRUE,\"ERROR\",\"OK\"))","v":""},"",""]
[null,null,null,null,null,null,null,null,null,null,null,null,null,"","","",{"$f":"IF(A129=\"\",\"\",IF(ISERROR(VLOOKUP(CONCATENATE(HDV!B129,\"_\",HDV!C129),Sheet2!$A$28:$A$40,1,FALSE))=TRUE,\"ERROR\",\"OK\"))","v":""},"",""]
[null,null,null,null,null,null,null,null,null,null,null,null,null,"","","",{"$f":"IF(A130=\"\",\"\",IF(ISERROR(VLOOKUP(CONCATENATE(HDV!B130,\"_\",HDV!C130),Sheet2!$A$28:$A$40,1,FALSE))=TRUE,\"ERROR\",\"OK\"))","v":""},"",""]
[null,null,null,null,null,null,null,null,null,null,null,null,null,"","","",{"$f":"IF(A131=\"\",\"\",IF(ISERROR(VLOOKUP(CONCATENATE(HDV!B131,\"_\",HDV!C131),Sheet2!$A$28:$A$40,1,FALSE))=TRUE,\"ERROR\",\"OK\"))","v":""},"",""]
[null,null,null,null,null,null,null,null,null,null,null,null,null,"","","",{"$f":"IF(A132=\"\",\"\",IF(ISERROR(VLOOKUP(CONCATENATE(HDV!B132,\"_\",HDV!C132),Sheet2!$A$28:$A$40,1,FALSE))=TRUE,\"ERROR\",\"OK\"))","v":""},"",""]
[null,null,null,null,null,null,null,null,null,null,null,null,null,"","","",{"$f":"IF(A133=\"\",\"\",IF(ISERROR(VLOOKUP(CONCATENATE(HDV!B133,\"_\",HDV!C133),Sheet2!$A$28:$A$40,1,FALSE))=TRUE,\"ERROR\",\"OK\"))","v":""},"",""]
[null,null,null,null,null,null,null,null,null,null,null,null,null,"","","",{"$f":"IF(A134=\"\",\"\",IF(ISERROR(VLOOKUP(CONCATENATE(HDV!B134,\"_\",HDV!C134),Sheet2!$A$28:$A$40,1,FALSE))=TRUE,\"ERROR\",\"OK\"))","v":""},"",""]
[null,null,null,null,null,null,null,null,null,null,null,null,null,"","","",{"$f":"IF(A135=\"\",\"\",IF(ISERROR(VLOOKUP(CONCATENATE(HDV!B135,\"_\",HDV!C135),Sheet2!$A$28:$A$40,1,FALSE))=TRUE,\"ERROR\",\"OK\"))","v":""},"",""]
[null,null,null,null,null,null,null,null,null,null,null,null,null,"","","",{"$f":"IF(A136=\"\",\"\",IF(ISERROR(VLOOKUP(CONCATENATE(HDV!B136,\"_\",HDV!C136),Sheet2!$A$28:$A$40,1,FALSE))=TRUE,\"ERROR\",\"OK\"))","v":""},"",""]
[null,null,null,null,null,null,null,null,null,null,null,null,null,"","","",{"$f":"IF(A137=\"\",\"\",IF(ISERROR(VLOOKUP(CONCATENATE(HDV!B137,\"_\",HDV!C137),Sheet2!$A$28:$A$40,1,FALSE))=TRUE,\"ERROR\",\"OK\"))","v":""},"",""]
[null,null,null,null,null,null,null,null,null,null,null,null,null,"","","",{"$f":"IF(A138=\"\",\"\",IF(ISERROR(VLOOKUP(CONCATENATE(HDV!B138,\"_\",HDV!C138),Sheet2!$A$28:$A$40,1,FALSE))=TRUE,\"ERROR\",\"OK\"))","v":""},"",""]
[null,null,null,null,null,null,null,null,null,null,null,null,null,"","","",{"$f":"IF(A139=\"\",\"\",IF(ISERROR(VLOOKUP(CONCATENATE(HDV!B139,\"_\",HDV!C139),Sheet2!$A$28:$A$40,1,FALSE))=TRUE,\"ERROR\",\"OK\"))","v":""},"",""]
[null,null,null,null,null,null,null,null,null,null,null,null,null,"","","",{"$f":"IF(A140=\"\",\"\",IF(ISERROR(VLOOKUP(CONCATENATE(HDV!B140,\"_\",HDV!C140),Sheet2!$A$28:$A$40,1,FALSE))=TRUE,\"ERROR\",\"OK\"))","v":""},"",""]
[null,null,null,null,null,null,null,null,null,null,null,null,null,"","","",{"$f":"IF(A141=\"\",\"\",IF(ISERROR(VLOOKUP(CONCATENATE(HDV!B141,\"_\",HDV!C141),Sheet2!$A$28:$A$40,1,FALSE))=TRUE,\"ERROR\",\"OK\"))","v":""},"",""]
[null,null,null,null,null,null,null,null,null,null,null,null,null,"","","",{"$f":"IF(A142=\"\",\"\",IF(ISERROR(VLOOKUP(CONCATENATE(HDV!B142,\"_\",HDV!C142),Sheet2!$A$28:$A$40,1,FALSE))=TRUE,\"ERROR\",\"OK\"))","v":""},"",""]
[null,null,null,null,null,null,null,null,null,null,null,null,null,"","","",{"$f":"IF(A143=\"\",\"\",IF(ISERROR(VLOOKUP(CONCATENATE(HDV!B143,\"_\",HDV!C143),Sheet2!$A$28:$A$40,1,FALSE))=TRUE,\"ERROR\",\"OK\"))","v":""},"",""]
[null,null,null,null,null,null,null,null,null,null,null,null,null,{"$f":"IF(A144=\"\",\"\",C144/1000)","v":""},{"$f":"  IF(AND(A144=\"\",F144=\"\"),\"\", IF(AND(A144=\"\",F144<>\"\"), \"FIX TEST GRP\", IF(B144=\"\",\"FIX CLASS\",IF(C144=\"\",\"FIX BIN\",IF(F144=\"\",\"FIX PROD'N\",F144*N144)))))","v":""},{"$f":"IF(A144=\"\",\"\",IF(C144=\"\",\"FIX BIN\", IF(D144=\"\",\"FIX U/L MILES\", IFERROR(O144/(IF(B144=\"2b\",$G$10,$M$10)),\"\"))))","v":""},{"$f":"IF(A144=\"\",\"\",IF(ISERROR(VLOOKUP(CONCATENATE(HDV!B144,\"_\",HDV!C144),Sheet2!$A$28:$A$40,1,FALSE))=TRUE,\"ERROR\",\"OK\"))","v":""},{"$f":"IF(A144=\"\",\"\", IF(AND($C$10>2021, C144=340),\"ERROR\",IF(AND($C$10>2021, C144=395),\"ERROR\",IF(AND($C$10>2021, C144>400),\"ERROR\", \"OK\"))))","v":""},{"$f":"IF(B144=\"\",\"\", IF(AND($C$10>2021, D144<150),\"ERROR\",IF(AND(D144<150, N144=395),\"ERROR\",IF(AND(D144<150, N144=340),\"ERROR\",IF(AND(D144<150, N144>400),\"ERROR\", \"OK\")))))","v":""}]
[null,null,null,null,null,null,null,null,null,null,null,null,null,"","","",{"$f":"IF(A145=\"\",\"\",IF(ISERROR(VLOOKUP(CONCATENATE(HDV!B145,\"_\",HDV!C145),Sheet2!$A$28:$A$40,1,FALSE))=TRUE,\"ERROR\",\"OK\"))","v":""},"",""]
[null,null,null,null,null,null,null,null,null,null,null,null,null,"","","",{"$f":"IF(A146=\"\",\"\",IF(ISERROR(VLOOKUP(CONCATENATE(HDV!B146,\"_\",HDV!C146),Sheet2!$A$28:$A$40,1,FALSE))=TRUE,\"ERROR\",\"OK\"))","v":""},"",""]
[null,null,null,null,null,null,null,null,null,null,null,null,null,"","","",{"$f":"IF(A147=\"\",\"\",IF(ISERROR(VLOOKUP(CONCATENATE(HDV!B147,\"_\",HDV!C147),Sheet2!$A$28:$A$40,1,FALSE))=TRUE,\"ERROR\",\"OK\"))","v":""},"",""]
[null,null,null,null,null,null,null,null,null,null,null,null,null,"","","",{"$f":"IF(A148=\"\",\"\",IF(ISERROR(VLOOKUP(CONCATENATE(HDV!B148,\"_\",HDV!C148),Sheet2!$A$28:$A$40,1,FALSE))=TRUE,\"ERROR\",\"OK\"))","v":""},"",""]
[null,null,null,null,null,null,null,null,null,null,null,null,null,"","","",{"$f":"IF(A149=\"\",\"\",IF(ISERROR(VLOOKUP(CONCATENATE(HDV!B149,\"_\",HDV!C149),Sheet2!$A$28:$A$40,1,FALSE))=TRUE,\"ERROR\",\"OK\"))","v":""},"",""]
[null,null,null,null,null,null,null,null,null,null,null,null,null,"","","",{"$f":"IF(A150=\"\",\"\",IF(ISERROR(VLOOKUP(CONCATENATE(HDV!B150,\"_\",HDV!C150),Sheet2!$A$28:$A$40,1,FALSE))=TRUE,\"ERROR\",\"OK\"))","v":""},"",""]
[null,null,null,null,null,null,null,null,null,null,null,null,null,"","","",{"$f":"IF(A151=\"\",\"\",IF(ISERROR(VLOOKUP(CONCATENATE(HDV!B151,\"_\",HDV!C151),Sheet2!$A$28:$A$40,1,FALSE))=TRUE,\"ERROR\",\"OK\"))","v":""},"",""]
[null,null,null,null,null,null,null,null,null,null,null,null,null,"","","",{"$f":"IF(A152=\"\",\"\",IF(ISERROR(VLOOKUP(CONCATENATE(HDV!B152,\"_\",HDV!C152),Sheet2!$A$28:$A$40,1,FALSE))=TRUE,\"ERROR\",\"OK\"))","v":""},"",""]
[null,null,null,null,null,null,null,null,null,null,null,null,null,"","","",{"$f":"IF(A153=\"\",\"\",IF(ISERROR(VLOOKUP(CONCATENATE(HDV!B153,\"_\",HDV!C153),Sheet2!$A$28:$A$40,1,FALSE))=TRUE,\"ERROR\",\"OK\"))","v":""},"",""]
[null,null,null,null,null,null,null,null,null,null,null,null,null,"","","",{"$f":"IF(A154=\"\",\"\",IF(ISERROR(VLOOKUP(CONCATENATE(HDV!B154,\"_\",HDV!C154),Sheet2!$A$28:$A$40,1,FALSE))=TRUE,\"ERROR\",\"OK\"))","v":""},"",""]
[null,null,null,null,null,null,null,null,null,null,null,null,null,"","","",{"$f":"IF(A155=\"\",\"\",IF(ISERROR(VLOOKUP(CONCATENATE(HDV!B155,\"_\",HDV!C155),Sheet2!$A$28:$A$40,1,FALSE))=TRUE,\"ERROR\",\"OK\"))","v":""},"",""]
[null,null,null,null,null,null,null,null,null,null,null,null,null,"","","",{"$f":"IF(A156=\"\",\"\",IF(ISERROR(VLOOKUP(CONCATENATE(HDV!B156,\"_\",HDV!C156),Sheet2!$A$28:$A$40,1,FALSE))=TRUE,\"ERROR\",\"OK\"))","v":""},"",""]
[null,null,null,null,null,null,null,null,null,null,null,null,null,"","","",{"$f":"IF(A157=\"\",\"\",IF(ISERROR(VLOOKUP(CONCATENATE(HDV!B157,\"_\",HDV!C157),Sheet2!$A$28:$A$40,1,FALSE))=TRUE,\"ERROR\",\"OK\"))","v":""},"",""]
[null,null,null,null,null,null,null,null,null,null,null,null,null,"","","",{"$f":"IF(A158=\"\",\"\",IF(ISERROR(VLOOKUP(CONCATENATE(HDV!B158,\"_\",HDV!C158),Sheet2!$A$28:$A$40,1,FALSE))=TRUE,\"ERROR\",\"OK\"))","v":""},"",""]
[null,null,null,null,null,null,null,null,null,null,null,null,null,"","","",{"$f":"IF(A159=\"\",\"\",IF(ISERROR(VLOOKUP(CONCATENATE(HDV!B159,\"_\",HDV!C159),Sheet2!$A$28:$A$40,1,FALSE))=TRUE,\"ERROR\",\"OK\"))","v":""},"",""]
[null,null,null,null,null,null,null,null,null,null,null,null,null,"","","",{"$f":"IF(A160=\"\",\"\",IF(ISERROR(VLOOKUP(CONCATENATE(HDV!B160,\"_\",HDV!C160),Sheet2!$A$28:$A$40,1,FALSE))=TRUE,\"ERROR\",\"OK\"))","v":""},"",""]
[null,null,null,null,null,null,null,null,null,null,null,null,null,"","","",{"$f":"IF(A161=\"\",\"\",IF(ISERROR(VLOOKUP(CONCATENATE(HDV!B161,\"_\",HDV!C161),Sheet2!$A$28:$A$40,1,FALSE))=TRUE,\"ERROR\",\"OK\"))","v":""},"",""]
[null,null,null,null,null,null,null,null,null,null,null,null,null,"","","",{"$f":"IF(A162=\"\",\"\",IF(ISERROR(VLOOKUP(CONCATENATE(HDV!B162,\"_\",HDV!C162),Sheet2!$A$28:$A$40,1,FALSE))=TRUE,\"ERROR\",\"OK\"))","v":""},"",""]
[null,null,null,null,null,null,null,null,null,null,null,null,null,"","","",{"$f":"IF(A163=\"\",\"\",IF(ISERROR(VLOOKUP(CONCATENATE(HDV!B163,\"_\",HDV!C163),Sheet2!$A$28:$A$40,1,FALSE))=TRUE,\"ERROR\",\"OK\"))","v":""},"",""]
[null,null,null,null,null,null,null,null,null,null,null,null,null,"","","",{"$f":"IF(A164=\"\",\"\",IF(ISERROR(VLOOKUP(CONCATENATE(HDV!B164,\"_\",HDV!C164),Sheet2!$A$28:$A$40,1,FALSE))=TRUE,\"ERROR\",\"OK\"))","v":""},"",""]
[null,null,null,null,null,null,null,null,null,null,null,null,null,"","","",{"$f":"IF(A165=\"\",\"\",IF(ISERROR(VLOOKUP(CONCATENATE(HDV!B165,\"_\",HDV!C165),Sheet2!$A$28:$A$40,1,FALSE))=TRUE,\"ERROR\",\"OK\"))","v":""},"",""]
[null,null,null,null,null,null,null,null,null,null,null,null,null,"","","",{"$f":"IF(A166=\"\",\"\",IF(ISERROR(VLOOKUP(CONCATENATE(HDV!B166,\"_\",HDV!C166),Sheet2!$A$28:$A$40,1,FALSE))=TRUE,\"ERROR\",\"OK\"))","v":""},"",""]
[null,null,null,null,null,null,null,null,null,null,null,null,null,"","","",{"$f":"IF(A167=\"\",\"\",IF(ISERROR(VLOOKUP(CONCATENATE(HDV!B167,\"_\",HDV!C167),Sheet2!$A$28:$A$40,1,FALSE))=TRUE,\"ERROR\",\"OK\"))","v":""},"",""]
[null,null,null,null,null,null,null,null,null,null,null,null,null,"","","",{"$f":"IF(A168=\"\",\"\",IF(ISERROR(VLOOKUP(CONCATENATE(HDV!B168,\"_\",HDV!C168),Sheet2!$A$28:$A$40,1,FALSE))=TRUE,\"ERROR\",\"OK\"))","v":""},"",""]
[null,null,null,null,null,null,null,null,null,null,null,null,null,"","","",{"$f":"IF(A169=\"\",\"\",IF(ISERROR(VLOOKUP(CONCATENATE(HDV!B169,\"_\",HDV!C169),Sheet2!$A$28:$A$40,1,FALSE))=TRUE,\"ERROR\",\"OK\"))","v":""},"",""]
[null,null,null,null,null,null,null,null,null,null,null,null,null,"","","",{"$f":"IF(A170=\"\",\"\",IF(ISERROR(VLOOKUP(CONCATENATE(HDV!B170,\"_\",HDV!C170),Sheet2!$A$28:$A$40,1,FALSE))=TRUE,\"ERROR\",\"OK\"))","v":""},"",""]
[null,null,null,null,null,null,null,null,null,null,null,null,null,"","","",{"$f":"IF(A171=\"\",\"\",IF(ISERROR(VLOOKUP(CONCATENATE(HDV!B171,\"_\",HDV!C171),Sheet2!$A$28:$A$40,1,FALSE))=TRUE,\"ERROR\",\"OK\"))","v":""},"",""]
[null,null,null,null,null,null,null,null,null,null,null,null,null,"","","",{"$f":"IF(A172=\"\",\"\",IF(ISERROR(VLOOKUP(CONCATENATE(HDV!B172,\"_\",HDV!C172),Sheet2!$A$28:$A$40,1,FALSE))=TRUE,\"ERROR\",\"OK\"))","v":""},"",""]
[null,null,null,null,null,null,null,null,null,null,null,null,null,"","","",{"$f":"IF(A173=\"\",\"\",IF(ISERROR(VLOOKUP(CONCATENATE(HDV!B173,\"_\",HDV!C173),Sheet2!$A$28:$A$40,1,FALSE))=TRUE,\"ERROR\",\"OK\"))","v":""},"",""]
[null,null,null,null,null,null,null,null,null,null,null,null,null,"","","",{"$f":"IF(A174=\"\",\"\",IF(ISERROR(VLOOKUP(CONCATENATE(HDV!B174,\"_\",HDV!C174),Sheet2!$A$28:$A$40,1,FALSE))=TRUE,\"ERROR\",\"OK\"))","v":""},"",""]
[null,null,null,null,null,null,null,null,null,null,null,null,null,"","","",{"$f":"IF(A175=\"\",\"\",IF(ISERROR(VLOOKUP(CONCATENATE(HDV!B175,\"_\",HDV!C175),Sheet2!$A$28:$A$40,1,FALSE))=TRUE,\"ERROR\",\"OK\"))","v":""},"",""]
[null,null,null,null,null,null,null,null,null,null,null,null,null,"","","",{"$f":"IF(A176=\"\",\"\",IF(ISERROR(VLOOKUP(CONCATENATE(HDV!B176,\"_\",HDV!C176),Sheet2!$A$28:$A$40,1,FALSE))=TRUE,\"ERROR\",\"OK\"))","v":""},"",""]
[null,null,null,null,null,null,null,null,null,null,null,null,null,"","","",{"$f":"IF(A177=\"\",\"\",IF(ISERROR(VLOOKUP(CONCATENATE(HDV!B177,\"_\",HDV!C177),Sheet2!$A$28:$A$40,1,FALSE))=TRUE,\"ERROR\",\"OK\"))","v":""},"",""]
[null,null,null,null,null,null,null,null,null,null,null,null,null,"","","",{"$f":"IF(A178=\"\",\"\",IF(ISERROR(VLOOKUP(CONCATENATE(HDV!B178,\"_\",HDV!C178),Sheet2!$A$28:$A$40,1,FALSE))=TRUE,\"ERROR\",\"OK\"))","v":""},"",""]
[null,null,null,null,null,null,null,null,null,null,null,null,null,"","","",{"$f":"IF(A179=\"\",\"\",IF(ISERROR(VLOOKUP(CONCATENATE(HDV!B179,\"_\",HDV!C179),Sheet2!$A$28:$A$40,1,FALSE))=TRUE,\"ERROR\",\"OK\"))","v":""},"",""]
[null,null,null,null,null,null,null,null,null,null,null,null,null,"","","",{"$f":"IF(A180=\"\",\"\",IF(ISERROR(VLOOKUP(CONCATENATE(HDV!B180,\"_\",HDV!C180),Sheet2!$A$28:$A$40,1,FALSE))=TRUE,\"ERROR\",\"OK\"))","v":""},"",""]
[null,null,null,null,null,null,null,null,null,null,null,null,null,"","","",{"$f":"IF(A181=\"\",\"\",IF(ISERROR(VLOOKUP(CONCATENATE(HDV!B181,\"_\",HDV!C181),Sheet2!$A$28:$A$40,1,FALSE))=TRUE,\"ERROR\",\"OK\"))","v":""},"",""]
[null,null,null,null,null,null,null,null,null,null,null,null,null,"","","",{"$f":"IF(A182=\"\",\"\",IF(ISERROR(VLOOKUP(CONCATENATE(HDV!B182,\"_\",HDV!C182),Sheet2!$A$28:$A$40,1,FALSE))=TRUE,\"ERROR\",\"OK\"))","v":""},"",""]
[null,null,null,null,null,null,null,null,null,null,null,null,null,"","","",{"$f":"IF(A183=\"\",\"\",IF(ISERROR(VLOOKUP(CONCATENATE(HDV!B183,\"_\",HDV!C183),Sheet2!$A$28:$A$40,1,FALSE))=TRUE,\"ERROR\",\"OK\"))","v":""},"",""]
[null,null,null,null,null,null,null,null,null,null,null,null,null,"","","",{"$f":"IF(A184=\"\",\"\",IF(ISERROR(VLOOKUP(CONCATENATE(HDV!B184,\"_\",HDV!C184),Sheet2!$A$28:$A$40,1,FALSE))=TRUE,\"ERROR\",\"OK\"))","v":""},"",""]
[null,null,null,null,null,null,null,null,null,null,null,null,null,"","","",{"$f":"IF(A185=\"\",\"\",IF(ISERROR(VLOOKUP(CONCATENATE(HDV!B185,\"_\",HDV!C185),Sheet2!$A$28:$A$40,1,FALSE))=TRUE,\"ERROR\",\"OK\"))","v":""},"",""]
[null,null,null,null,null,null,null,null,null,null,null,null,null,"","","",{"$f":"IF(A186=\"\",\"\",IF(ISERROR(VLOOKUP(CONCATENATE(HDV!B186,\"_\",HDV!C186),Sheet2!$A$28:$A$40,1,FALSE))=TRUE,\"ERROR\",\"OK\"))","v":""},"",""]
[null,null,null,null,null,null,null,null,null,null,null,null,null,"","","",{"$f":"IF(A187=\"\",\"\",IF(ISERROR(VLOOKUP(CONCATENATE(HDV!B187,\"_\",HDV!C187),Sheet2!$A$28:$A$40,1,FALSE))=TRUE,\"ERROR\",\"OK\"))","v":""},"",""]
[null,null,null,null,null,null,null,null,null,null,null,null,null,"","","",{"$f":"IF(A188=\"\",\"\",IF(ISERROR(VLOOKUP(CONCATENATE(HDV!B188,\"_\",HDV!C188),Sheet2!$A$28:$A$40,1,FALSE))=TRUE,\"ERROR\",\"OK\"))","v":""},"",""]
[null,null,null,null,null,null,null,null,null,null,null,null,null,"","","",{"$f":"IF(A189=\"\",\"\",IF(ISERROR(VLOOKUP(CONCATENATE(HDV!B189,\"_\",HDV!C189),Sheet2!$A$28:$A$40,1,FALSE))=TRUE,\"ERROR\",\"OK\"))","v":""},"",""]
[null,null,null,null,null,null,null,null,null,null,null,null,null,"","","",{"$f":"IF(A190=\"\",\"\",IF(ISERROR(VLOOKUP(CONCATENATE(HDV!B190,\"_\",HDV!C190),Sheet2!$A$28:$A$40,1,FALSE))=TRUE,\"ERROR\",\"OK\"))","v":""},"",""]
[null,null,null,null,null,null,null,null,null,null,null,null,null,"","","",{"$f":"IF(A191=\"\",\"\",IF(ISERROR(VLOOKUP(CONCATENATE(HDV!B191,\"_\",HDV!C191),Sheet2!$A$28:$A$40,1,FALSE))=TRUE,\"ERROR\",\"OK\"))","v":""},"",""]
[null,null,null,null,null,null,null,null,null,null,null,null,null,"","","",{"$f":"IF(A192=\"\",\"\",IF(ISERROR(VLOOKUP(CONCATENATE(HDV!B192,\"_\",HDV!C192),Sheet2!$A$28:$A$40,1,FALSE))=TRUE,\"ERROR\",\"OK\"))","v":""},"",""]
[null,null,null,null,null,null,null,null,null,null,null,null,null,"","","",{"$f":"IF(A193=\"\",\"\",IF(ISERROR(VLOOKUP(CONCATENATE(HDV!B193,\"_\",HDV!C193),Sheet2!$A$28:$A$40,1,FALSE))=TRUE,\"ERROR\",\"OK\"))","v":""},"",""]
[null,null,null,null,null,null,null,null,null,null,null,null,null,"","","",{"$f":"IF(A194=\"\",\"\",IF(ISERROR(VLOOKUP(CONCATENATE(HDV!B194,\"_\",HDV!C194),Sheet2!$A$28:$A$40,1,FALSE))=TRUE,\"ERROR\",\"OK\"))","v":""},"",""]
[null,null,null,null,null,null,null,null,null,null,null,null,null,"","","",{"$f":"IF(A195=\"\",\"\",IF(ISERROR(VLOOKUP(CONCATENATE(HDV!B195,\"_\",HDV!C195),Sheet2!$A$28:$A$40,1,FALSE))=TRUE,\"ERROR\",\"OK\"))","v":""},"",""]
[null,null,null,null,null,null,null,null,null,null,null,null,null,"","","",{"$f":"IF(A196=\"\",\"\",IF(ISERROR(VLOOKUP(CONCATENATE(HDV!B196,\"_\",HDV!C196),Sheet2!$A$28:$A$40,1,FALSE))=TRUE,\"ERROR\",\"OK\"))","v":""},"",""]
[null,null,null,null,null,null,null,null,null,null,null,null,null,"","","",{"$f":"IF(A197=\"\",\"\",IF(ISERROR(VLOOKUP(CONCATENATE(HDV!B197,\"_\",HDV!C197),Sheet2!$A$28:$A$40,1,FALSE))=TRUE,\"ERROR\",\"OK\"))","v":""},"",""]
[null,null,null,null,null,null,null,null,null,null,null,null,null,"","","",{"$f":"IF(A198=\"\",\"\",IF(ISERROR(VLOOKUP(CONCATENATE(HDV!B198,\"_\",HDV!C198),Sheet2!$A$28:$A$40,1,FALSE))=TRUE,\"ERROR\",\"OK\"))","v":""},"",""]
[null,null,null,null,null,null,null,null,null,null,null,null,null,"","","",{"$f":"IF(A199=\"\",\"\",IF(ISERROR(VLOOKUP(CONCATENATE(HDV!B199,\"_\",HDV!C199),Sheet2!$A$28:$A$40,1,FALSE))=TRUE,\"ERROR\",\"OK\"))","v":""},"",""]
[null,null,null,null,null,null,null,null,null,null,null,null,null,"","","",{"$f":"IF(A200=\"\",\"\",IF(ISERROR(VLOOKUP(CONCATENATE(HDV!B200,\"_\",HDV!C200),Sheet2!$A$28:$A$40,1,FALSE))=TRUE,\"ERROR\",\"OK\"))","v":""},"",""]
[null,null,null,null,null,null,null,null,null,null,null,null,null,"","","",{"$f":"IF(A201=\"\",\"\",IF(ISERROR(VLOOKUP(CONCATENATE(HDV!B201,\"_\",HDV!C201),Sheet2!$A$28:$A$40,1,FALSE))=TRUE,\"ERROR\",\"OK\"))","v":""},"",""]
[null,null,null,null,null,null,null,null,null,null,null,null,null,"","","",{"$f":"IF(A202=\"\",\"\",IF(ISERROR(VLOOKUP(CONCATENATE(HDV!B202,\"_\",HDV!C202),Sheet2!$A$28:$A$40,1,FALSE))=TRUE,\"ERROR\",\"OK\"))","v":""},"",""]
[null,null,null,null,null,null,null,null,null,null,null,null,null,"","","",{"$f":"IF(A203=\"\",\"\",IF(ISERROR(VLOOKUP(CONCATENATE(HDV!B203,\"_\",HDV!C203),Sheet2!$A$28:$A$40,1,FALSE))=TRUE,\"ERROR\",\"OK\"))","v":""},"",""]
[null,null,null,null,null,null,null,null,null,null,null,null,null,"","","",{"$f":"IF(A204=\"\",\"\",IF(ISERROR(VLOOKUP(CONCATENATE(HDV!B204,\"_\",HDV!C204),Sheet2!$A$28:$A$40,1,FALSE))=TRUE,\"ERROR\",\"OK\"))","v":""},"",""]
[null,null,null,null,null,null,null,null,null,null,null,null,null,"","","",{"$f":"IF(A205=\"\",\"\",IF(ISERROR(VLOOKUP(CONCATENATE(HDV!B205,\"_\",HDV!C205),Sheet2!$A$28:$A$40,1,FALSE))=TRUE,\"ERROR\",\"OK\"))","v":""},"",""]
[null,null,null,null,null,null,null,null,null,null,null,null,null,"","","",{"$f":"IF(A206=\"\",\"\",IF(ISERROR(VLOOKUP(CONCATENATE(HDV!B206,\"_\",HDV!C206),Sheet2!$A$28:$A$40,1,FALSE))=TRUE,\"ERROR\",\"OK\"))","v":""},"",""]
[null,null,null,null,null,null,null,null,null,null,null,null,null,"","","",{"$f":"IF(A207=\"\",\"\",IF(ISERROR(VLOOKUP(CONCATENATE(HDV!B207,\"_\",HDV!C207),Sheet2!$A$28:$A$40,1,FALSE))=TRUE,\"ERROR\",\"OK\"))","v":""},"",""]
[null,null,null,null,null,null,null,null,null,null,null,null,null,{"$f":"IF(A208=\"\",\"\",C208/1000)","v":""},{"$f":"  IF(AND(A208=\"\",F208=\"\"),\"\", IF(AND(A208=\"\",F208<>\"\"), \"FIX TEST GRP\", IF(B208=\"\",\"FIX CLASS\",IF(C208=\"\",\"FIX BIN\",IF(F208=\"\",\"FIX PROD'N\",F208*N208)))))","v":""},{"$f":"IF(A208=\"\",\"\",IF(C208=\"\",\"FIX BIN\", IF(D208=\"\",\"FIX U/L MILES\", IFERROR(O208/(IF(B208=\"2b\",$G$10,$M$10)),\"\"))))","v":""},{"$f":"IF(A208=\"\",\"\",IF(ISERROR(VLOOKUP(CONCATENATE(HDV!B208,\"_\",HDV!C208),Sheet2!$A$28:$A$40,1,FALSE))=TRUE,\"ERROR\",\"OK\"))","v":""},{"$f":"IF(A208=\"\",\"\", IF(AND($C$10>2021, C208=340),\"ERROR\",IF(AND($C$10>2021, C208=395),\"ERROR\",IF(AND($C$10>2021, C208>400),\"ERROR\", \"OK\"))))","v":""},{"$f":"IF(B208=\"\",\"\", IF(AND($C$10>2021, D208<150),\"ERROR\",IF(AND(D208<150, N208=395),\"ERROR\",IF(AND(D208<150, N208=340),\"ERROR\",IF(AND(D208<150, N208>400),\"ERROR\", \"OK\")))))","v":""}]
[null,null,null,null,null,null,null,null,null,null,null,null,null,"","","",{"$f":"IF(A209=\"\",\"\",IF(ISERROR(VLOOKUP(CONCATENATE(HDV!B209,\"_\",HDV!C209),Sheet2!$A$28:$A$40,1,FALSE))=TRUE,\"ERROR\",\"OK\"))","v":""},"",""]
[null,null,null,null,null,null,null,null,null,null,null,null,null,"","","",{"$f":"IF(A210=\"\",\"\",IF(ISERROR(VLOOKUP(CONCATENATE(HDV!B210,\"_\",HDV!C210),Sheet2!$A$28:$A$40,1,FALSE))=TRUE,\"ERROR\",\"OK\"))","v":""},"",""]
[null,null,null,null,null,null,null,null,null,null,null,null,null,"","","",{"$f":"IF(A211=\"\",\"\",IF(ISERROR(VLOOKUP(CONCATENATE(HDV!B211,\"_\",HDV!C211),Sheet2!$A$28:$A$40,1,FALSE))=TRUE,\"ERROR\",\"OK\"))","v":""},"",""]
[null,null,null,null,null,null,null,null,null,null,null,null,null,"","","",{"$f":"IF(A212=\"\",\"\",IF(ISERROR(VLOOKUP(CONCATENATE(HDV!B212,\"_\",HDV!C212),Sheet2!$A$28:$A$40,1,FALSE))=TRUE,\"ERROR\",\"OK\"))","v":""},"",""]
[null,null,null,null,null,null,null,null,null,null,null,null,null,"","","",{"$f":"IF(A213=\"\",\"\",IF(ISERROR(VLOOKUP(CONCATENATE(HDV!B213,\"_\",HDV!C213),Sheet2!$A$28:$A$40,1,FALSE))=TRUE,\"ERROR\",\"OK\"))","v":""},"",""]
[null,null,null,null,null,null,null,null,null,null,null,null,null,"","","",{"$f":"IF(A214=\"\",\"\",IF(ISERROR(VLOOKUP(CONCATENATE(HDV!B214,\"_\",HDV!C214),Sheet2!$A$28:$A$40,1,FALSE))=TRUE,\"ERROR\",\"OK\"))","v":""},"",""]
[null,null,null,null,null,null,null,null,null,null,null,null,null,"","","",{"$f":"IF(A215=\"\",\"\",IF(ISERROR(VLOOKUP(CONCATENATE(HDV!B215,\"_\",HDV!C215),Sheet2!$A$28:$A$40,1,FALSE))=TRUE,\"ERROR\",\"OK\"))","v":""},"",""]
[null,null,null,null,null,null,null,null,null,null,null,null,null,"","","",{"$f":"IF(A216=\"\",\"\",IF(ISERROR(VLOOKUP(CONCATENATE(HDV!B216,\"_\",HDV!C216),Sheet2!$A$28:$A$40,1,FALSE))=TRUE,\"ERROR\",\"OK\"))","v":""},"",""]
[null,null,null,null,null,null,null,null,null,null,null,null,null,"","","",{"$f":"IF(A217=\"\",\"\",IF(ISERROR(VLOOKUP(CONCATENATE(HDV!B217,\"_\",HDV!C217),Sheet2!$A$28:$A$40,1,FALSE))=TRUE,\"ERROR\",\"OK\"))","v":""},"",""]
[null,null,null,null,null,null,null,null,null,null,null,null,null,"","","",{"$f":"IF(A218=\"\",\"\",IF(ISERROR(VLOOKUP(CONCATENATE(HDV!B218,\"_\",HDV!C218),Sheet2!$A$28:$A$40,1,FALSE))=TRUE,\"ERROR\",\"OK\"))","v":""},"",""]
[null,null,null,null,null,null,null,null,null,null,null,null,null,"","","",{"$f":"IF(A219=\"\",\"\",IF(ISERROR(VLOOKUP(CONCATENATE(HDV!B219,\"_\",HDV!C219),Sheet2!$A$28:$A$40,1,FALSE))=TRUE,\"ERROR\",\"OK\"))","v":""},"",""]
[null,null,null,null,null,null,null,null,null,null,null,null,null,"","","",{"$f":"IF(A220=\"\",\"\",IF(ISERROR(VLOOKUP(CONCATENATE(HDV!B220,\"_\",HDV!C220),Sheet2!$A$28:$A$40,1,FALSE))=TRUE,\"ERROR\",\"OK\"))","v":""},"",""]
[null,null,null,null,null,null,null,null,null,null,null,null,null,"","","",{"$f":"IF(A221=\"\",\"\",IF(ISERROR(VLOOKUP(CONCATENATE(HDV!B221,\"_\",HDV!C221),Sheet2!$A$28:$A$40,1,FALSE))=TRUE,\"ERROR\",\"OK\"))","v":""},"",""]
[null,null,null,null,null,null,null,null,null,null,null,null,null,"","","",{"$f":"IF(A222=\"\",\"\",IF(ISERROR(VLOOKUP(CONCATENATE(HDV!B222,\"_\",HDV!C222),Sheet2!$A$28:$A$40,1,FALSE))=TRUE,\"ERROR\",\"OK\"))","v":""},"",""]
[null,null,null,null,null,null,null,null,null,null,null,null,null,"","","",{"$f":"IF(A223=\"\",\"\",IF(ISERROR(VLOOKUP(CONCATENATE(HDV!B223,\"_\",HDV!C223),Sheet2!$A$28:$A$40,1,FALSE))=TRUE,\"ERROR\",\"OK\"))","v":""},"",""]
[null,null,null,null,null,null,null,null,null,null,null,null,null,"","","",{"$f":"IF(A224=\"\",\"\",IF(ISERROR(VLOOKUP(CONCATENATE(HDV!B224,\"_\",HDV!C224),Sheet2!$A$28:$A$40,1,FALSE))=TRUE,\"ERROR\",\"OK\"))","v":""},"",""]
[null,null,null,null,null,null,null,null,null,null,null,null,null,"","","",{"$f":"IF(A225=\"\",\"\",IF(ISERROR(VLOOKUP(CONCATENATE(HDV!B225,\"_\",HDV!C225),Sheet2!$A$28:$A$40,1,FALSE))=TRUE,\"ERROR\",\"OK\"))","v":""},"",""]
[null,null,null,null,null,null,null,null,null,null,null,null,null,"","","",{"$f":"IF(A226=\"\",\"\",IF(ISERROR(VLOOKUP(CONCATENATE(HDV!B226,\"_\",HDV!C226),Sheet2!$A$28:$A$40,1,FALSE))=TRUE,\"ERROR\",\"OK\"))","v":""},"",""]
[null,null,null,null,null,null,null,null,null,null,null,null,null,"","","",{"$f":"IF(A227=\"\",\"\",IF(ISERROR(VLOOKUP(CONCATENATE(HDV!B227,\"_\",HDV!C227),Sheet2!$A$28:$A$40,1,FALSE))=TRUE,\"ERROR\",\"OK\"))","v":""},"",""]
[null,null,null,null,null,null,null,null,null,null,null,null,null,"","","",{"$f":"IF(A228=\"\",\"\",IF(ISERROR(VLOOKUP(CONCATENATE(HDV!B228,\"_\",HDV!C228),Sheet2!$A$28:$A$40,1,FALSE))=TRUE,\"ERROR\",\"OK\"))","v":""},"",""]
[null,null,null,null,null,null,null,null,null,null,null,null,null,"","","",{"$f":"IF(A229=\"\",\"\",IF(ISERROR(VLOOKUP(CONCATENATE(HDV!B229,\"_\",HDV!C229),Sheet2!$A$28:$A$40,1,FALSE))=TRUE,\"ERROR\",\"OK\"))","v":""},"",""]
[null,null,null,null,null,null,null,null,null,null,null,null,null,"","","",{"$f":"IF(A230=\"\",\"\",IF(ISERROR(VLOOKUP(CONCATENATE(HDV!B230,\"_\",HDV!C230),Sheet2!$A$28:$A$40,1,FALSE))=TRUE,\"ERROR\",\"OK\"))","v":""},"",""]
[null,null,null,null,null,null,null,null,null,null,null,null,null,"","","",{"$f":"IF(A231=\"\",\"\",IF(ISERROR(VLOOKUP(CONCATENATE(HDV!B231,\"_\",HDV!C231),Sheet2!$A$28:$A$40,1,FALSE))=TRUE,\"ERROR\",\"OK\"))","v":""},"",""]
[null,null,null,null,null,null,null,null,null,null,null,null,null,"","","",{"$f":"IF(A232=\"\",\"\",IF(ISERROR(VLOOKUP(CONCATENATE(HDV!B232,\"_\",HDV!C232),Sheet2!$A$28:$A$40,1,FALSE))=TRUE,\"ERROR\",\"OK\"))","v":""},"",""]
[null,null,null,null,null,null,null,null,null,null,null,null,null,"","","",{"$f":"IF(A233=\"\",\"\",IF(ISERROR(VLOOKUP(CONCATENATE(HDV!B233,\"_\",HDV!C233),Sheet2!$A$28:$A$40,1,FALSE))=TRUE,\"ERROR\",\"OK\"))","v":""},"",""]
[null,null,null,null,null,null,null,null,null,null,null,null,null,"","","",{"$f":"IF(A234=\"\",\"\",IF(ISERROR(VLOOKUP(CONCATENATE(HDV!B234,\"_\",HDV!C234),Sheet2!$A$28:$A$40,1,FALSE))=TRUE,\"ERROR\",\"OK\"))","v":""},"",""]
[null,null,null,null,null,null,null,null,null,null,null,null,null,"","","",{"$f":"IF(A235=\"\",\"\",IF(ISERROR(VLOOKUP(CONCATENATE(HDV!B235,\"_\",HDV!C235),Sheet2!$A$28:$A$40,1,FALSE))=TRUE,\"ERROR\",\"OK\"))","v":""},"",""]
[null,null,null,null,null,null,null,null,null,null,null,null,null,"","","",{"$f":"IF(A236=\"\",\"\",IF(ISERROR(VLOOKUP(CONCATENATE(HDV!B236,\"_\",HDV!C236),Sheet2!$A$28:$A$40,1,FALSE))=TRUE,\"ERROR\",\"OK\"))","v":""},"",""]
[null,null,null,null,null,null,null,null,null,null,null,null,null,"","","",{"$f":"IF(A237=\"\",\"\",IF(ISERROR(VLOOKUP(CONCATENATE(HDV!B237,\"_\",HDV!C237),Sheet2!$A$28:$A$40,1,FALSE))=TRUE,\"ERROR\",\"OK\"))","v":""},"",""]
[null,null,null,null,null,null,null,null,null,null,null,null,null,"","","",{"$f":"IF(A238=\"\",\"\",IF(ISERROR(VLOOKUP(CONCATENATE(HDV!B238,\"_\",HDV!C238),Sheet2!$A$28:$A$40,1,FALSE))=TRUE,\"ERROR\",\"OK\"))","v":""},"",""]
[null,null,null,null,null,null,null,null,null,null,null,null,null,"","","",{"$f":"IF(A239=\"\",\"\",IF(ISERROR(VLOOKUP(CONCATENATE(HDV!B239,\"_\",HDV!C239),Sheet2!$A$28:$A$40,1,FALSE))=TRUE,\"ERROR\",\"OK\"))","v":""},"",""]
[null,null,null,null,null,null,null,null,null,null,null,null,null,"","","",{"$f":"IF(A240=\"\",\"\",IF(ISERROR(VLOOKUP(CONCATENATE(HDV!B240,\"_\",HDV!C240),Sheet2!$A$28:$A$40,1,FALSE))=TRUE,\"ERROR\",\"OK\"))","v":""},"",""]
[null,null,null,null,null,null,null,null,null,null,null,null,null,"","","",{"$f":"IF(A241=\"\",\"\",IF(ISERROR(VLOOKUP(CONCATENATE(HDV!B241,\"_\",HDV!C241),Sheet2!$A$28:$A$40,1,FALSE))=TRUE,\"ERROR\",\"OK\"))","v":""},"",""]
[null,null,null,null,null,null,null,null,null,null,null,null,null,"","","",{"$f":"IF(A242=\"\",\"\",IF(ISERROR(VLOOKUP(CONCATENATE(HDV!B242,\"_\",HDV!C242),Sheet2!$A$28:$A$40,1,FALSE))=TRUE,\"ERROR\",\"OK\"))","v":""},"",""]
[null,null,null,null,null,null,null,null,null,null,null,null,null,"","","",{"$f":"IF(A243=\"\",\"\",IF(ISERROR(VLOOKUP(CONCATENATE(HDV!B243,\"_\",HDV!C243),Sheet2!$A$28:$A$40,1,FALSE))=TRUE,\"ERROR\",\"OK\"))","v":""},"",""]
[null,null,null,null,null,null,null,null,null,null,null,null,null,"","","",{"$f":"IF(A244=\"\",\"\",IF(ISERROR(VLOOKUP(CONCATENATE(HDV!B244,\"_\",HDV!C244),Sheet2!$A$28:$A$40,1,FALSE))=TRUE,\"ERROR\",\"OK\"))","v":""},"",""]
[null,null,null,null,null,null,null,null,null,null,null,null,null,"","","",{"$f":"IF(A245=\"\",\"\",IF(ISERROR(VLOOKUP(CONCATENATE(HDV!B245,\"_\",HDV!C245),Sheet2!$A$28:$A$40,1,FALSE))=TRUE,\"ERROR\",\"OK\"))","v":""},"",""]
[null,null,null,null,null,null,null,null,null,null,null,null,null,"","","",{"$f":"IF(A246=\"\",\"\",IF(ISERROR(VLOOKUP(CONCATENATE(HDV!B246,\"_\",HDV!C246),Sheet2!$A$28:$A$40,1,FALSE))=TRUE,\"ERROR\",\"OK\"))","v":""},"",""]
[null,null,null,null,null,null,null,null,null,null,null,null,null,"","","",{"$f":"IF(A247=\"\",\"\",IF(ISERROR(VLOOKUP(CONCATENATE(HDV!B247,\"_\",HDV!C247),Sheet2!$A$28:$A$40,1,FALSE))=TRUE,\"ERROR\",\"OK\"))","v":""},"",""]
[null,null,null,null,null,null,null,null,null,null,null,null,null,"","","",{"$f":"IF(A248=\"\",\"\",IF(ISERROR(VLOOKUP(CONCATENATE(HDV!B248,\"_\",HDV!C248),Sheet2!$A$28:$A$40,1,FALSE))=TRUE,\"ERROR\",\"OK\"))","v":""},"",""]
[null,null,null,null,null,null,null,null,null,null,null,null,null,"","","",{"$f":"IF(A249=\"\",\"\",IF(ISERROR(VLOOKUP(CONCATENATE(HDV!B249,\"_\",HDV!C249),Sheet2!$A$28:$A$40,1,FALSE))=TRUE,\"ERROR\",\"OK\"))","v":""},"",""]
[null,null,null,null,null,null,null,null,null,null,null,null,null,"","","",{"$f":"IF(A250=\"\",\"\",IF(ISERROR(VLOOKUP(CONCATENATE(HDV!B250,\"_\",HDV!C250),Sheet2!$A$28:$A$40,1,FALSE))=TRUE,\"ERROR\",\"OK\"))","v":""},"",""]
[null,null,null,null,null,null,null,null,null,null,null,null,null,"","","",{"$f":"IF(A251=\"\",\"\",IF(ISERROR(VLOOKUP(CONCATENATE(HDV!B251,\"_\",HDV!C251),Sheet2!$A$28:$A$40,1,FALSE))=TRUE,\"ERROR\",\"OK\"))","v":""},"",""]
[null,null,null,null,null,null,null,null,null,null,null,null,null,"","","",{"$f":"IF(A252=\"\",\"\",IF(ISERROR(VLOOKUP(CONCATENATE(HDV!B252,\"_\",HDV!C252),Sheet2!$A$28:$A$40,1,FALSE))=TRUE,\"ERROR\",\"OK\"))","v":""},"",""]
[null,null,null,null,null,null,null,null,null,null,null,null,null,"","","",{"$f":"IF(A253=\"\",\"\",IF(ISERROR(VLOOKUP(CONCATENATE(HDV!B253,\"_\",HDV!C253),Sheet2!$A$28:$A$40,1,FALSE))=TRUE,\"ERROR\",\"OK\"))","v":""},"",""]
[null,null,null,null,null,null,null,null,null,null,null,null,null,"","","",{"$f":"IF(A254=\"\",\"\",IF(ISERROR(VLOOKUP(CONCATENATE(HDV!B254,\"_\",HDV!C254),Sheet2!$A$28:$A$40,1,FALSE))=TRUE,\"ERROR\",\"OK\"))","v":""},"",""]
[null,null,null,null,null,null,null,null,null,null,null,null,null,"","","",{"$f":"IF(A255=\"\",\"\",IF(ISERROR(VLOOKUP(CONCATENATE(HDV!B255,\"_\",HDV!C255),Sheet2!$A$28:$A$40,1,FALSE))=TRUE,\"ERROR\",\"OK\"))","v":""},"",""]
[null,null,null,null,null,null,null,null,null,null,null,null,null,"","","",{"$f":"IF(A256=\"\",\"\",IF(ISERROR(VLOOKUP(CONCATENATE(HDV!B256,\"_\",HDV!C256),Sheet2!$A$28:$A$40,1,FALSE))=TRUE,\"ERROR\",\"OK\"))","v":""},"",""]
[null,null,null,null,null,null,null,null,null,null,null,null,null,"","","",{"$f":"IF(A257=\"\",\"\",IF(ISERROR(VLOOKUP(CONCATENATE(HDV!B257,\"_\",HDV!C257),Sheet2!$A$28:$A$40,1,FALSE))=TRUE,\"ERROR\",\"OK\"))","v":""},"",""]
[null,null,null,null,null,null,null,null,null,null,null,null,null,"","","",{"$f":"IF(A258=\"\",\"\",IF(ISERROR(VLOOKUP(CONCATENATE(HDV!B258,\"_\",HDV!C258),Sheet2!$A$28:$A$40,1,FALSE))=TRUE,\"ERROR\",\"OK\"))","v":""},"",""]
[null,null,null,null,null,null,null,null,null,null,null,null,null,"","","",{"$f":"IF(A259=\"\",\"\",IF(ISERROR(VLOOKUP(CONCATENATE(HDV!B259,\"_\",HDV!C259),Sheet2!$A$28:$A$40,1,FALSE))=TRUE,\"ERROR\",\"OK\"))","v":""},"",""]
[null,null,null,null,null,null,null,null,null,null,null,null,null,"","","",{"$f":"IF(A260=\"\",\"\",IF(ISERROR(VLOOKUP(CONCATENATE(HDV!B260,\"_\",HDV!C260),Sheet2!$A$28:$A$40,1,FALSE))=TRUE,\"ERROR\",\"OK\"))","v":""},"",""]
[null,null,null,null,null,null,null,null,null,null,null,null,null,"","","",{"$f":"IF(A261=\"\",\"\",IF(ISERROR(VLOOKUP(CONCATENATE(HDV!B261,\"_\",HDV!C261),Sheet2!$A$28:$A$40,1,FALSE))=TRUE,\"ERROR\",\"OK\"))","v":""},"",""]
[null,null,null,null,null,null,null,null,null,null,null,null,null,"","","",{"$f":"IF(A262=\"\",\"\",IF(ISERROR(VLOOKUP(CONCATENATE(HDV!B262,\"_\",HDV!C262),Sheet2!$A$28:$A$40,1,FALSE))=TRUE,\"ERROR\",\"OK\"))","v":""},"",""]
[null,null,null,null,null,null,null,null,null,null,null,null,null,"","","",{"$f":"IF(A263=\"\",\"\",IF(ISERROR(VLOOKUP(CONCATENATE(HDV!B263,\"_\",HDV!C263),Sheet2!$A$28:$A$40,1,FALSE))=TRUE,\"ERROR\",\"OK\"))","v":""},"",""]
[null,null,null,null,null,null,null,null,null,null,null,null,null,"","","",{"$f":"IF(A264=\"\",\"\",IF(ISERROR(VLOOKUP(CONCATENATE(HDV!B264,\"_\",HDV!C264),Sheet2!$A$28:$A$40,1,FALSE))=TRUE,\"ERROR\",\"OK\"))","v":""},"",""]
[null,null,null,null,null,null,null,null,null,null,null,null,null,"","","",{"$f":"IF(A265=\"\",\"\",IF(ISERROR(VLOOKUP(CONCATENATE(HDV!B265,\"_\",HDV!C265),Sheet2!$A$28:$A$40,1,FALSE))=TRUE,\"ERROR\",\"OK\"))","v":""},"",""]
[null,null,null,null,null,null,null,null,null,null,null,null,null,"","","",{"$f":"IF(A266=\"\",\"\",IF(ISERROR(VLOOKUP(CONCATENATE(HDV!B266,\"_\",HDV!C266),Sheet2!$A$28:$A$40,1,FALSE))=TRUE,\"ERROR\",\"OK\"))","v":""},"",""]
[null,null,null,null,null,null,null,null,null,null,null,null,null,"","","",{"$f":"IF(A267=\"\",\"\",IF(ISERROR(VLOOKUP(CONCATENATE(HDV!B267,\"_\",HDV!C267),Sheet2!$A$28:$A$40,1,FALSE))=TRUE,\"ERROR\",\"OK\"))","v":""},"",""]
[null,null,null,null,null,null,null,null,null,null,null,null,null,"","","",{"$f":"IF(A268=\"\",\"\",IF(ISERROR(VLOOKUP(CONCATENATE(HDV!B268,\"_\",HDV!C268),Sheet2!$A$28:$A$40,1,FALSE))=TRUE,\"ERROR\",\"OK\"))","v":""},"",""]
[null,null,null,null,null,null,null,null,null,null,null,null,null,"","","",{"$f":"IF(A269=\"\",\"\",IF(ISERROR(VLOOKUP(CONCATENATE(HDV!B269,\"_\",HDV!C269),Sheet2!$A$28:$A$40,1,FALSE))=TRUE,\"ERROR\",\"OK\"))","v":""},"",""]
[null,null,null,null,null,null,null,null,null,null,null,null,null,"","","",{"$f":"IF(A270=\"\",\"\",IF(ISERROR(VLOOKUP(CONCATENATE(HDV!B270,\"_\",HDV!C270),Sheet2!$A$28:$A$40,1,FALSE))=TRUE,\"ERROR\",\"OK\"))","v":""},"",""]
[null,null,null,null,null,null,null,null,null,null,null,null,null,"","","",{"$f":"IF(A271=\"\",\"\",IF(ISERROR(VLOOKUP(CONCATENATE(HDV!B271,\"_\",HDV!C271),Sheet2!$A$28:$A$40,1,FALSE))=TRUE,\"ERROR\",\"OK\"))","v":""},"",""]
[null,null,null,null,null,null,null,null,null,null,null,null,null,{"$f":"IF(A272=\"\",\"\",C272/1000)","v":""},{"$f":"  IF(AND(A272=\"\",F272=\"\"),\"\", IF(AND(A272=\"\",F272<>\"\"), \"FIX TEST GRP\", IF(B272=\"\",\"FIX CLASS\",IF(C272=\"\",\"FIX BIN\",IF(F272=\"\",\"FIX PROD'N\",F272*N272)))))","v":""},{"$f":"IF(A272=\"\",\"\",IF(C272=\"\",\"FIX BIN\", IF(D272=\"\",\"FIX U/L MILES\", IFERROR(O272/(IF(B272=\"2b\",$G$10,$M$10)),\"\"))))","v":""},{"$f":"IF(A272=\"\",\"\",IF(ISERROR(VLOOKUP(CONCATENATE(HDV!B272,\"_\",HDV!C272),Sheet2!$A$28:$A$40,1,FALSE))=TRUE,\"ERROR\",\"OK\"))","v":""},{"$f":"IF(A272=\"\",\"\", IF(AND($C$10>2021, C272=340),\"ERROR\",IF(AND($C$10>2021, C272=395),\"ERROR\",IF(AND($C$10>2021, C272>400),\"ERROR\", \"OK\"))))","v":""},{"$f":"IF(B272=\"\",\"\", IF(AND($C$10>2021, D272<150),\"ERROR\",IF(AND(D272<150, N272=395),\"ERROR\",IF(AND(D272<150, N272=340),\"ERROR\",IF(AND(D272<150, N272>400),\"ERROR\", \"OK\")))))","v":""}]
[null,null,null,null,null,null,null,null,null,null,null,null,null,"","","",{"$f":"IF(A273=\"\",\"\",IF(ISERROR(VLOOKUP(CONCATENATE(HDV!B273,\"_\",HDV!C273),Sheet2!$A$28:$A$40,1,FALSE))=TRUE,\"ERROR\",\"OK\"))","v":""},"",""]
[null,null,null,null,null,null,null,null,null,null,null,null,null,"","","",{"$f":"IF(A274=\"\",\"\",IF(ISERROR(VLOOKUP(CONCATENATE(HDV!B274,\"_\",HDV!C274),Sheet2!$A$28:$A$40,1,FALSE))=TRUE,\"ERROR\",\"OK\"))","v":""},"",""]
[null,null,null,null,null,null,null,null,null,null,null,null,null,"","","",{"$f":"IF(A275=\"\",\"\",IF(ISERROR(VLOOKUP(CONCATENATE(HDV!B275,\"_\",HDV!C275),Sheet2!$A$28:$A$40,1,FALSE))=TRUE,\"ERROR\",\"OK\"))","v":""},"",""]
[null,null,null,null,null,null,null,null,null,null,null,null,null,"","","",{"$f":"IF(A276=\"\",\"\",IF(ISERROR(VLOOKUP(CONCATENATE(HDV!B276,\"_\",HDV!C276),Sheet2!$A$28:$A$40,1,FALSE))=TRUE,\"ERROR\",\"OK\"))","v":""},"",""]
[null,null,null,null,null,null,null,null,null,null,null,null,null,"","","",{"$f":"IF(A277=\"\",\"\",IF(ISERROR(VLOOKUP(CONCATENATE(HDV!B277,\"_\",HDV!C277),Sheet2!$A$28:$A$40,1,FALSE))=TRUE,\"ERROR\",\"OK\"))","v":""},"",""]
[null,null,null,null,null,null,null,null,null,null,null,null,null,"","","",{"$f":"IF(A278=\"\",\"\",IF(ISERROR(VLOOKUP(CONCATENATE(HDV!B278,\"_\",HDV!C278),Sheet2!$A$28:$A$40,1,FALSE))=TRUE,\"ERROR\",\"OK\"))","v":""},"",""]
[null,null,null,null,null,null,null,null,null,null,null,null,null,"","","",{"$f":"IF(A279=\"\",\"\",IF(ISERROR(VLOOKUP(CONCATENATE(HDV!B279,\"_\",HDV!C279),Sheet2!$A$28:$A$40,1,FALSE))=TRUE,\"ERROR\",\"OK\"))","v":""},"",""]
[null,null,null,null,null,null,null,null,null,null,null,null,null,"","","",{"$f":"IF(A280=\"\",\"\",IF(ISERROR(VLOOKUP(CONCATENATE(HDV!B280,\"_\",HDV!C280),Sheet2!$A$28:$A$40,1,FALSE))=TRUE,\"ERROR\",\"OK\"))","v":""},"",""]
[null,null,null,null,null,null,null,null,null,null,null,null,null,"","","",{"$f":"IF(A281=\"\",\"\",IF(ISERROR(VLOOKUP(CONCATENATE(HDV!B281,\"_\",HDV!C281),Sheet2!$A$28:$A$40,1,FALSE))=TRUE,\"ERROR\",\"OK\"))","v":""},"",""]
[null,null,null,null,null,null,null,null,null,null,null,null,null,"","","",{"$f":"IF(A282=\"\",\"\",IF(ISERROR(VLOOKUP(CONCATENATE(HDV!B282,\"_\",HDV!C282),Sheet2!$A$28:$A$40,1,FALSE))=TRUE,\"ERROR\",\"OK\"))","v":""},"",""]
[null,null,null,null,null,null,null,null,null,null,null,null,null,"","","",{"$f":"IF(A283=\"\",\"\",IF(ISERROR(VLOOKUP(CONCATENATE(HDV!B283,\"_\",HDV!C283),Sheet2!$A$28:$A$40,1,FALSE))=TRUE,\"ERROR\",\"OK\"))","v":""},"",""]
[null,null,null,null,null,null,null,null,null,null,null,null,null,"","","",{"$f":"IF(A284=\"\",\"\",IF(ISERROR(VLOOKUP(CONCATENATE(HDV!B284,\"_\",HDV!C284),Sheet2!$A$28:$A$40,1,FALSE))=TRUE,\"ERROR\",\"OK\"))","v":""},"",""]
[null,null,null,null,null,null,null,null,null,null,null,null,null,"","","",{"$f":"IF(A285=\"\",\"\",IF(ISERROR(VLOOKUP(CONCATENATE(HDV!B285,\"_\",HDV!C285),Sheet2!$A$28:$A$40,1,FALSE))=TRUE,\"ERROR\",\"OK\"))","v":""},"",""]
[null,null,null,null,null,null,null,null,null,null,null,null,null,"","","",{"$f":"IF(A286=\"\",\"\",IF(ISERROR(VLOOKUP(CONCATENATE(HDV!B286,\"_\",HDV!C286),Sheet2!$A$28:$A$40,1,FALSE))=TRUE,\"ERROR\",\"OK\"))","v":""},"",""]
[null,null,null,null,null,null,null,null,null,null,null,null,null,"","","",{"$f":"IF(A287=\"\",\"\",IF(ISERROR(VLOOKUP(CONCATENATE(HDV!B287,\"_\",HDV!C287),Sheet2!$A$28:$A$40,1,FALSE))=TRUE,\"ERROR\",\"OK\"))","v":""},"",""]
[null,null,null,null,null,null,null,null,null,null,null,null,null,"","","",{"$f":"IF(A288=\"\",\"\",IF(ISERROR(VLOOKUP(CONCATENATE(HDV!B288,\"_\",HDV!C288),Sheet2!$A$28:$A$40,1,FALSE))=TRUE,\"ERROR\",\"OK\"))","v":""},"",""]
[null,null,null,null,null,null,null,null,null,null,null,null,null,"","","",{"$f":"IF(A289=\"\",\"\",IF(ISERROR(VLOOKUP(CONCATENATE(HDV!B289,\"_\",HDV!C289),Sheet2!$A$28:$A$40,1,FALSE))=TRUE,\"ERROR\",\"OK\"))","v":""},"",""]
[null,null,null,null,null,null,null,null,null,null,null,null,null,"","","",{"$f":"IF(A290=\"\",\"\",IF(ISERROR(VLOOKUP(CONCATENATE(HDV!B290,\"_\",HDV!C290),Sheet2!$A$28:$A$40,1,FALSE))=TRUE,\"ERROR\",\"OK\"))","v":""},"",""]
[null,null,null,null,null,null,null,null,null,null,null,null,null,"","","",{"$f":"IF(A291=\"\",\"\",IF(ISERROR(VLOOKUP(CONCATENATE(HDV!B291,\"_\",HDV!C291),Sheet2!$A$28:$A$40,1,FALSE))=TRUE,\"ERROR\",\"OK\"))","v":""},"",""]
[null,null,null,null,null,null,null,null,null,null,null,null,null,"","","",{"$f":"IF(A292=\"\",\"\",IF(ISERROR(VLOOKUP(CONCATENATE(HDV!B292,\"_\",HDV!C292),Sheet2!$A$28:$A$40,1,FALSE))=TRUE,\"ERROR\",\"OK\"))","v":""},"",""]
[null,null,null,null,null,null,null,null,null,null,null,null,null,"","","",{"$f":"IF(A293=\"\",\"\",IF(ISERROR(VLOOKUP(CONCATENATE(HDV!B293,\"_\",HDV!C293),Sheet2!$A$28:$A$40,1,FALSE))=TRUE,\"ERROR\",\"OK\"))","v":""},"",""]
[null,null,null,null,null,null,null,null,null,null,null,null,null,"","","",{"$f":"IF(A294=\"\",\"\",IF(ISERROR(VLOOKUP(CONCATENATE(HDV!B294,\"_\",HDV!C294),Sheet2!$A$28:$A$40,1,FALSE))=TRUE,\"ERROR\",\"OK\"))","v":""},"",""]
[null,null,null,null,null,null,null,null,null,null,null,null,null,"","","",{"$f":"IF(A295=\"\",\"\",IF(ISERROR(VLOOKUP(CONCATENATE(HDV!B295,\"_\",HDV!C295),Sheet2!$A$28:$A$40,1,FALSE))=TRUE,\"ERROR\",\"OK\"))","v":""},"",""]
[null,null,null,null,null,null,null,null,null,null,null,null,null,"","","",{"$f":"IF(A296=\"\",\"\",IF(ISERROR(VLOOKUP(CONCATENATE(HDV!B296,\"_\",HDV!C296),Sheet2!$A$28:$A$40,1,FALSE))=TRUE,\"ERROR\",\"OK\"))","v":""},"",""]
[null,null,null,null,null,null,null,null,null,null,null,null,null,"","","",{"$f":"IF(A297=\"\",\"\",IF(ISERROR(VLOOKUP(CONCATENATE(HDV!B297,\"_\",HDV!C297),Sheet2!$A$28:$A$40,1,FALSE))=TRUE,\"ERROR\",\"OK\"))","v":""},"",""]
[null,null,null,null,null,null,null,null,null,null,null,null,null,"","","",{"$f":"IF(A298=\"\",\"\",IF(ISERROR(VLOOKUP(CONCATENATE(HDV!B298,\"_\",HDV!C298),Sheet2!$A$28:$A$40,1,FALSE))=TRUE,\"ERROR\",\"OK\"))","v":""},"",""]
[null,null,null,null,null,null,null,null,null,null,null,null,null,"","","",{"$f":"IF(A299=\"\",\"\",IF(ISERROR(VLOOKUP(CONCATENATE(HDV!B299,\"_\",HDV!C299),Sheet2!$A$28:$A$40,1,FALSE))=TRUE,\"ERROR\",\"OK\"))","v":""},"",""]
[null,null,null,null,null,null,null,null,null,null,null,null,null,"","","",{"$f":"IF(A300=\"\",\"\",IF(ISERROR(VLOOKUP(CONCATENATE(HDV!B300,\"_\",HDV!C300),Sheet2!$A$28:$A$40,1,FALSE))=TRUE,\"ERROR\",\"OK\"))","v":""},"",""]
[null,null,null,null,null,null,null,null,null,null,null,null,null,"","","",{"$f":"IF(A301=\"\",\"\",IF(ISERROR(VLOOKUP(CONCATENATE(HDV!B301,\"_\",HDV!C301),Sheet2!$A$28:$A$40,1,FALSE))=TRUE,\"ERROR\",\"OK\"))","v":""},"",""]
[null,null,null,null,null,null,null,null,null,null,null,null,null,"","","",{"$f":"IF(A302=\"\",\"\",IF(ISERROR(VLOOKUP(CONCATENATE(HDV!B302,\"_\",HDV!C302),Sheet2!$A$28:$A$40,1,FALSE))=TRUE,\"ERROR\",\"OK\"))","v":""},"",""]
[null,null,null,null,null,null,null,null,null,null,null,null,null,"","","",{"$f":"IF(A303=\"\",\"\",IF(ISERROR(VLOOKUP(CONCATENATE(HDV!B303,\"_\",HDV!C303),Sheet2!$A$28:$A$40,1,FALSE))=TRUE,\"ERROR\",\"OK\"))","v":""},"",""]
[null,null,null,null,null,null,null,null,null,null,null,null,null,"","","",{"$f":"IF(A304=\"\",\"\",IF(ISERROR(VLOOKUP(CONCATENATE(HDV!B304,\"_\",HDV!C304),Sheet2!$A$28:$A$40,1,FALSE))=TRUE,\"ERROR\",\"OK\"))","v":""},"",""]
[null,null,null,null,null,null,null,null,null,null,null,null,null,"","","",{"$f":"IF(A305=\"\",\"\",IF(ISERROR(VLOOKUP(CONCATENATE(HDV!B305,\"_\",HDV!C305),Sheet2!$A$28:$A$40,1,FALSE))=TRUE,\"ERROR\",\"OK\"))","v":""},"",""]
[null,null,null,null,null,null,null,null,null,null,null,null,null,"","","",{"$f":"IF(A306=\"\",\"\",IF(ISERROR(VLOOKUP(CONCATENATE(HDV!B306,\"_\",HDV!C306),Sheet2!$A$28:$A$40,1,FALSE))=TRUE,\"ERROR\",\"OK\"))","v":""},"",""]
[null,null,null,null,null,null,null,null,null,null,null,null,null,"","","",{"$f":"IF(A307=\"\",\"\",IF(ISERROR(VLOOKUP(CONCATENATE(HDV!B307,\"_\",HDV!C307),Sheet2!$A$28:$A$40,1,FALSE))=TRUE,\"ERROR\",\"OK\"))","v":""},"",""]
[null,null,null,null,null,null,null,null,null,null,null,null,null,"","","",{"$f":"IF(A308=\"\",\"\",IF(ISERROR(VLOOKUP(CONCATENATE(HDV!B308,\"_\",HDV!C308),Sheet2!$A$28:$A$40,1,FALSE))=TRUE,\"ERROR\",\"OK\"))","v":""},"",""]
[null,null,null,null,null,null,null,null,null,null,null,null,null,"","","",{"$f":"IF(A309=\"\",\"\",IF(ISERROR(VLOOKUP(CONCATENATE(HDV!B309,\"_\",HDV!C309),Sheet2!$A$28:$A$40,1,FALSE))=TRUE,\"ERROR\",\"OK\"))","v":""},"",""]
[null,null,null,null,null,null,null,null,null,null,null,null,null,"","","",{"$f":"IF(A310=\"\",\"\",IF(ISERROR(VLOOKUP(CONCATENATE(HDV!B310,\"_\",HDV!C310),Sheet2!$A$28:$A$40,1,FALSE))=TRUE,\"ERROR\",\"OK\"))","v":""},"",""]
[null,null,null,null,null,null,null,null,null,null,null,null,null,"","","",{"$f":"IF(A311=\"\",\"\",IF(ISERROR(VLOOKUP(CONCATENATE(HDV!B311,\"_\",HDV!C311),Sheet2!$A$28:$A$40,1,FALSE))=TRUE,\"ERROR\",\"OK\"))","v":""},"",""]
[null,null,null,null,null,null,null,null,null,null,null,null,null,"","","",{"$f":"IF(A312=\"\",\"\",IF(ISERROR(VLOOKUP(CONCATENATE(HDV!B312,\"_\",HDV!C312),Sheet2!$A$28:$A$40,1,FALSE))=TRUE,\"ERROR\",\"OK\"))","v":""},"",""]
[null,null,null,null,null,null,null,null,null,null,null,null,null,"","","",{"$f":"IF(A313=\"\",\"\",IF(ISERROR(VLOOKUP(CONCATENATE(HDV!B313,\"_\",HDV!C313),Sheet2!$A$28:$A$40,1,FALSE))=TRUE,\"ERROR\",\"OK\"))","v":""},"",""]
[null,null,null,null,null,null,null,null,null,null,null,null,null,"","","",{"$f":"IF(A314=\"\",\"\",IF(ISERROR(VLOOKUP(CONCATENATE(HDV!B314,\"_\",HDV!C314),Sheet2!$A$28:$A$40,1,FALSE))=TRUE,\"ERROR\",\"OK\"))","v":""},"",""]
[null,null,null,null,null,null,null,null,null,null,null,null,null,"","","",{"$f":"IF(A315=\"\",\"\",IF(ISERROR(VLOOKUP(CONCATENATE(HDV!B315,\"_\",HDV!C315),Sheet2!$A$28:$A$40,1,FALSE))=TRUE,\"ERROR\",\"OK\"))","v":""},"",""]
[null,null,null,null,null,null,null,null,null,null,null,null,null,"","","",{"$f":"IF(A316=\"\",\"\",IF(ISERROR(VLOOKUP(CONCATENATE(HDV!B316,\"_\",HDV!C316),Sheet2!$A$28:$A$40,1,FALSE))=TRUE,\"ERROR\",\"OK\"))","v":""},"",""]
[null,null,null,null,null,null,null,null,null,null,null,null,null,"","","",{"$f":"IF(A317=\"\",\"\",IF(ISERROR(VLOOKUP(CONCATENATE(HDV!B317,\"_\",HDV!C317),Sheet2!$A$28:$A$40,1,FALSE))=TRUE,\"ERROR\",\"OK\"))","v":""},"",""]
[null,null,null,null,null,null,null,null,null,null,null,null,null,"","","",{"$f":"IF(A318=\"\",\"\",IF(ISERROR(VLOOKUP(CONCATENATE(HDV!B318,\"_\",HDV!C318),Sheet2!$A$28:$A$40,1,FALSE))=TRUE,\"ERROR\",\"OK\"))","v":""},"",""]
[null,null,null,null,null,null,null,null,null,null,null,null,null,"","","",{"$f":"IF(A319=\"\",\"\",IF(ISERROR(VLOOKUP(CONCATENATE(HDV!B319,\"_\",HDV!C319),Sheet2!$A$28:$A$40,1,FALSE))=TRUE,\"ERROR\",\"OK\"))","v":""},"",""]
[null,null,null,null,null,null,null,null,null,null,null,null,null,"","","",{"$f":"IF(A320=\"\",\"\",IF(ISERROR(VLOOKUP(CONCATENATE(HDV!B320,\"_\",HDV!C320),Sheet2!$A$28:$A$40,1,FALSE))=TRUE,\"ERROR\",\"OK\"))","v":""},"",""]
[null,null,null,null,null,null,null,null,null,null,null,null,null,"","","",{"$f":"IF(A321=\"\",\"\",IF(ISERROR(VLOOKUP(CONCATENATE(HDV!B321,\"_\",HDV!C321),Sheet2!$A$28:$A$40,1,FALSE))=TRUE,\"ERROR\",\"OK\"))","v":""},"",""]
[null,null,null,null,null,null,null,null,null,null,null,null,null,"","","",{"$f":"IF(A322=\"\",\"\",IF(ISERROR(VLOOKUP(CONCATENATE(HDV!B322,\"_\",HDV!C322),Sheet2!$A$28:$A$40,1,FALSE))=TRUE,\"ERROR\",\"OK\"))","v":""},"",""]
[null,null,null,null,null,null,null,null,null,null,null,null,null,"","","",{"$f":"IF(A323=\"\",\"\",IF(ISERROR(VLOOKUP(CONCATENATE(HDV!B323,\"_\",HDV!C323),Sheet2!$A$28:$A$40,1,FALSE))=TRUE,\"ERROR\",\"OK\"))","v":""},"",""]
[null,null,null,null,null,null,null,null,null,null,null,null,null,"","","",{"$f":"IF(A324=\"\",\"\",IF(ISERROR(VLOOKUP(CONCATENATE(HDV!B324,\"_\",HDV!C324),Sheet2!$A$28:$A$40,1,FALSE))=TRUE,\"ERROR\",\"OK\"))","v":""},"",""]
[null,null,null,null,null,null,null,null,null,null,null,null,null,"","","",{"$f":"IF(A325=\"\",\"\",IF(ISERROR(VLOOKUP(CONCATENATE(HDV!B325,\"_\",HDV!C325),Sheet2!$A$28:$A$40,1,FALSE))=TRUE,\"ERROR\",\"OK\"))","v":""},"",""]
[null,null,null,null,null,null,null,null,null,null,null,null,null,"","","",{"$f":"IF(A326=\"\",\"\",IF(ISERROR(VLOOKUP(CONCATENATE(HDV!B326,\"_\",HDV!C326),Sheet2!$A$28:$A$40,1,FALSE))=TRUE,\"ERROR\",\"OK\"))","v":""},"",""]
[null,null,null,null,null,null,null,null,null,null,null,null,null,"","","",{"$f":"IF(A327=\"\",\"\",IF(ISERROR(VLOOKUP(CONCATENATE(HDV!B327,\"_\",HDV!C327),Sheet2!$A$28:$A$40,1,FALSE))=TRUE,\"ERROR\",\"OK\"))","v":""},"",""]
[null,null,null,null,null,null,null,null,null,null,null,null,null,"","","",{"$f":"IF(A328=\"\",\"\",IF(ISERROR(VLOOKUP(CONCATENATE(HDV!B328,\"_\",HDV!C328),Sheet2!$A$28:$A$40,1,FALSE))=TRUE,\"ERROR\",\"OK\"))","v":""},"",""]
[null,null,null,null,null,null,null,null,null,null,null,null,null,"","","",{"$f":"IF(A329=\"\",\"\",IF(ISERROR(VLOOKUP(CONCATENATE(HDV!B329,\"_\",HDV!C329),Sheet2!$A$28:$A$40,1,FALSE))=TRUE,\"ERROR\",\"OK\"))","v":""},"",""]
[null,null,null,null,null,null,null,null,null,null,null,null,null,"","","",{"$f":"IF(A330=\"\",\"\",IF(ISERROR(VLOOKUP(CONCATENATE(HDV!B330,\"_\",HDV!C330),Sheet2!$A$28:$A$40,1,FALSE))=TRUE,\"ERROR\",\"OK\"))","v":""},"",""]
[null,null,null,null,null,null,null,null,null,null,null,null,null,"","","",{"$f":"IF(A331=\"\",\"\",IF(ISERROR(VLOOKUP(CONCATENATE(HDV!B331,\"_\",HDV!C331),Sheet2!$A$28:$A$40,1,FALSE))=TRUE,\"ERROR\",\"OK\"))","v":""},"",""]
[null,null,null,null,null,null,null,null,null,null,null,null,null,"","","",{"$f":"IF(A332=\"\",\"\",IF(ISERROR(VLOOKUP(CONCATENATE(HDV!B332,\"_\",HDV!C332),Sheet2!$A$28:$A$40,1,FALSE))=TRUE,\"ERROR\",\"OK\"))","v":""},"",""]
[null,null,null,null,null,null,null,null,null,null,null,null,null,"","","",{"$f":"IF(A333=\"\",\"\",IF(ISERROR(VLOOKUP(CONCATENATE(HDV!B333,\"_\",HDV!C333),Sheet2!$A$28:$A$40,1,FALSE))=TRUE,\"ERROR\",\"OK\"))","v":""},"",""]
[null,null,null,null,null,null,null,null,null,null,null,null,null,"","","",{"$f":"IF(A334=\"\",\"\",IF(ISERROR(VLOOKUP(CONCATENATE(HDV!B334,\"_\",HDV!C334),Sheet2!$A$28:$A$40,1,FALSE))=TRUE,\"ERROR\",\"OK\"))","v":""},"",""]
[null,null,null,null,null,null,null,null,null,null,null,null,null,"","","",{"$f":"IF(A335=\"\",\"\",IF(ISERROR(VLOOKUP(CONCATENATE(HDV!B335,\"_\",HDV!C335),Sheet2!$A$28:$A$40,1,FALSE))=TRUE,\"ERROR\",\"OK\"))","v":""},"",""]
[null,null,null,null,null,null,null,null,null,null,null,null,null,{"$f":"IF(A336=\"\",\"\",C336/1000)","v":""},{"$f":"  IF(AND(A336=\"\",F336=\"\"),\"\", IF(AND(A336=\"\",F336<>\"\"), \"FIX TEST GRP\", IF(B336=\"\",\"FIX CLASS\",IF(C336=\"\",\"FIX BIN\",IF(F336=\"\",\"FIX PROD'N\",F336*N336)))))","v":""},{"$f":"IF(A336=\"\",\"\",IF(C336=\"\",\"FIX BIN\", IF(D336=\"\",\"FIX U/L MILES\", IFERROR(O336/(IF(B336=\"2b\",$G$10,$M$10)),\"\"))))","v":""},{"$f":"IF(A336=\"\",\"\",IF(ISERROR(VLOOKUP(CONCATENATE(HDV!B336,\"_\",HDV!C336),Sheet2!$A$28:$A$40,1,FALSE))=TRUE,\"ERROR\",\"OK\"))","v":""},{"$f":"IF(A336=\"\",\"\", IF(AND($C$10>2021, C336=340),\"ERROR\",IF(AND($C$10>2021, C336=395),\"ERROR\",IF(AND($C$10>2021, C336>400),\"ERROR\", \"OK\"))))","v":""},{"$f":"IF(B336=\"\",\"\", IF(AND($C$10>2021, D336<150),\"ERROR\",IF(AND(D336<150, N336=395),\"ERROR\",IF(AND(D336<150, N336=340),\"ERROR\",IF(AND(D336<150, N336>400),\"ERROR\", \"OK\")))))","v":""}]
[null,null,null,null,null,null,null,null,null,null,null,null,null,"","","",{"$f":"IF(A337=\"\",\"\",IF(ISERROR(VLOOKUP(CONCATENATE(HDV!B337,\"_\",HDV!C337),Sheet2!$A$28:$A$40,1,FALSE))=TRUE,\"ERROR\",\"OK\"))","v":""},"",""]
[null,null,null,null,null,null,null,null,null,null,null,null,null,"","","",{"$f":"IF(A338=\"\",\"\",IF(ISERROR(VLOOKUP(CONCATENATE(HDV!B338,\"_\",HDV!C338),Sheet2!$A$28:$A$40,1,FALSE))=TRUE,\"ERROR\",\"OK\"))","v":""},"",""]
[null,null,null,null,null,null,null,null,null,null,null,null,null,"","","",{"$f":"IF(A339=\"\",\"\",IF(ISERROR(VLOOKUP(CONCATENATE(HDV!B339,\"_\",HDV!C339),Sheet2!$A$28:$A$40,1,FALSE))=TRUE,\"ERROR\",\"OK\"))","v":""},"",""]
[null,null,null,null,null,null,null,null,null,null,null,null,null,"","","",{"$f":"IF(A340=\"\",\"\",IF(ISERROR(VLOOKUP(CONCATENATE(HDV!B340,\"_\",HDV!C340),Sheet2!$A$28:$A$40,1,FALSE))=TRUE,\"ERROR\",\"OK\"))","v":""},"",""]
[null,null,null,null,null,null,null,null,null,null,null,null,null,"","","",{"$f":"IF(A341=\"\",\"\",IF(ISERROR(VLOOKUP(CONCATENATE(HDV!B341,\"_\",HDV!C341),Sheet2!$A$28:$A$40,1,FALSE))=TRUE,\"ERROR\",\"OK\"))","v":""},"",""]
[null,null,null,null,null,null,null,null,null,null,null,null,null,"","","",{"$f":"IF(A342=\"\",\"\",IF(ISERROR(VLOOKUP(CONCATENATE(HDV!B342,\"_\",HDV!C342),Sheet2!$A$28:$A$40,1,FALSE))=TRUE,\"ERROR\",\"OK\"))","v":""},"",""]
[null,null,null,null,null,null,null,null,null,null,null,null,null,"","","",{"$f":"IF(A343=\"\",\"\",IF(ISERROR(VLOOKUP(CONCATENATE(HDV!B343,\"_\",HDV!C343),Sheet2!$A$28:$A$40,1,FALSE))=TRUE,\"ERROR\",\"OK\"))","v":""},"",""]
[null,null,null,null,null,null,null,null,null,null,null,null,null,"","","",{"$f":"IF(A344=\"\",\"\",IF(ISERROR(VLOOKUP(CONCATENATE(HDV!B344,\"_\",HDV!C344),Sheet2!$A$28:$A$40,1,FALSE))=TRUE,\"ERROR\",\"OK\"))","v":""},"",""]
[null,null,null,null,null,null,null,null,null,null,null,null,null,"","","",{"$f":"IF(A345=\"\",\"\",IF(ISERROR(VLOOKUP(CONCATENATE(HDV!B345,\"_\",HDV!C345),Sheet2!$A$28:$A$40,1,FALSE))=TRUE,\"ERROR\",\"OK\"))","v":""},"",""]
[null,null,null,null,null,null,null,null,null,null,null,null,null,"","","",{"$f":"IF(A346=\"\",\"\",IF(ISERROR(VLOOKUP(CONCATENATE(HDV!B346,\"_\",HDV!C346),Sheet2!$A$28:$A$40,1,FALSE))=TRUE,\"ERROR\",\"OK\"))","v":""},"",""]
[null,null,null,null,null,null,null,null,null,null,null,null,null,"","","",{"$f":"IF(A347=\"\",\"\",IF(ISERROR(VLOOKUP(CONCATENATE(HDV!B347,\"_\",HDV!C347),Sheet2!$A$28:$A$40,1,FALSE))=TRUE,\"ERROR\",\"OK\"))","v":""},"",""]
[null,null,null,null,null,null,null,null,null,null,null,null,null,"","","",{"$f":"IF(A348=\"\",\"\",IF(ISERROR(VLOOKUP(CONCATENATE(HDV!B348,\"_\",HDV!C348),Sheet2!$A$28:$A$40,1,FALSE))=TRUE,\"ERROR\",\"OK\"))","v":""},"",""]
[null,null,null,null,null,null,null,null,null,null,null,null,null,"","","",{"$f":"IF(A349=\"\",\"\",IF(ISERROR(VLOOKUP(CONCATENATE(HDV!B349,\"_\",HDV!C349),Sheet2!$A$28:$A$40,1,FALSE))=TRUE,\"ERROR\",\"OK\"))","v":""},"",""]
[null,null,null,null,null,null,null,null,null,null,null,null,null,"","","",{"$f":"IF(A350=\"\",\"\",IF(ISERROR(VLOOKUP(CONCATENATE(HDV!B350,\"_\",HDV!C350),Sheet2!$A$28:$A$40,1,FALSE))=TRUE,\"ERROR\",\"OK\"))","v":""},"",""]
[null,null,null,null,null,null,null,null,null,null,null,null,null,"","","",{"$f":"IF(A351=\"\",\"\",IF(ISERROR(VLOOKUP(CONCATENATE(HDV!B351,\"_\",HDV!C351),Sheet2!$A$28:$A$40,1,FALSE))=TRUE,\"ERROR\",\"OK\"))","v":""},"",""]
[null,null,null,null,null,null,null,null,null,null,null,null,null,"","","",{"$f":"IF(A352=\"\",\"\",IF(ISERROR(VLOOKUP(CONCATENATE(HDV!B352,\"_\",HDV!C352),Sheet2!$A$28:$A$40,1,FALSE))=TRUE,\"ERROR\",\"OK\"))","v":""},"",""]
[null,null,null,null,null,null,null,null,null,null,null,null,null,"","","",{"$f":"IF(A353=\"\",\"\",IF(ISERROR(VLOOKUP(CONCATENATE(HDV!B353,\"_\",HDV!C353),Sheet2!$A$28:$A$40,1,FALSE))=TRUE,\"ERROR\",\"OK\"))","v":""},"",""]
[null,null,null,null,null,null,null,null,null,null,null,null,null,"","","",{"$f":"IF(A354=\"\",\"\",IF(ISERROR(VLOOKUP(CONCATENATE(HDV!B354,\"_\",HDV!C354),Sheet2!$A$28:$A$40,1,FALSE))=TRUE,\"ERROR\",\"OK\"))","v":""},"",""]
[null,null,null,null,null,null,null,null,null,null,null,null,null,"","","",{"$f":"IF(A355=\"\",\"\",IF(ISERROR(VLOOKUP(CONCATENATE(HDV!B355,\"_\",HDV!C355),Sheet2!$A$28:$A$40,1,FALSE))=TRUE,\"ERROR\",\"OK\"))","v":""},"",""]
[null,null,null,null,null,null,null,null,null,null,null,null,null,"","","",{"$f":"IF(A356=\"\",\"\",IF(ISERROR(VLOOKUP(CONCATENATE(HDV!B356,\"_\",HDV!C356),Sheet2!$A$28:$A$40,1,FALSE))=TRUE,\"ERROR\",\"OK\"))","v":""},"",""]
[null,null,null,null,null,null,null,null,null,null,null,null,null,"","","",{"$f":"IF(A357=\"\",\"\",IF(ISERROR(VLOOKUP(CONCATENATE(HDV!B357,\"_\",HDV!C357),Sheet2!$A$28:$A$40,1,FALSE))=TRUE,\"ERROR\",\"OK\"))","v":""},"",""]
[null,null,null,null,null,null,null,null,null,null,null,null,null,"","","",{"$f":"IF(A358=\"\",\"\",IF(ISERROR(VLOOKUP(CONCATENATE(HDV!B358,\"_\",HDV!C358),Sheet2!$A$28:$A$40,1,FALSE))=TRUE,\"ERROR\",\"OK\"))","v":""},"",""]
[null,null,null,null,null,null,null,null,null,null,null,null,null,"","","",{"$f":"IF(A359=\"\",\"\",IF(ISERROR(VLOOKUP(CONCATENATE(HDV!B359,\"_\",HDV!C359),Sheet2!$A$28:$A$40,1,FALSE))=TRUE,\"ERROR\",\"OK\"))","v":""},"",""]
[null,null,null,null,null,null,null,null,null,null,null,null,null,"","","",{"$f":"IF(A360=\"\",\"\",IF(ISERROR(VLOOKUP(CONCATENATE(HDV!B360,\"_\",HDV!C360),Sheet2!$A$28:$A$40,1,FALSE))=TRUE,\"ERROR\",\"OK\"))","v":""},"",""]
[null,null,null,null,null,null,null,null,null,null,null,null,null,"","","",{"$f":"IF(A361=\"\",\"\",IF(ISERROR(VLOOKUP(CONCATENATE(HDV!B361,\"_\",HDV!C361),Sheet2!$A$28:$A$40,1,FALSE))=TRUE,\"ERROR\",\"OK\"))","v":""},"",""]
[null,null,null,null,null,null,null,null,null,null,null,null,null,"","","",{"$f":"IF(A362=\"\",\"\",IF(ISERROR(VLOOKUP(CONCATENATE(HDV!B362,\"_\",HDV!C362),Sheet2!$A$28:$A$40,1,FALSE))=TRUE,\"ERROR\",\"OK\"))","v":""},"",""]
[null,null,null,null,null,null,null,null,null,null,null,null,null,"","","",{"$f":"IF(A363=\"\",\"\",IF(ISERROR(VLOOKUP(CONCATENATE(HDV!B363,\"_\",HDV!C363),Sheet2!$A$28:$A$40,1,FALSE))=TRUE,\"ERROR\",\"OK\"))","v":""},"",""]
[null,null,null,null,null,null,null,null,null,null,null,null,null,"","","",{"$f":"IF(A364=\"\",\"\",IF(ISERROR(VLOOKUP(CONCATENATE(HDV!B364,\"_\",HDV!C364),Sheet2!$A$28:$A$40,1,FALSE))=TRUE,\"ERROR\",\"OK\"))","v":""},"",""]
[null,null,null,null,null,null,null,null,null,null,null,null,null,"","","",{"$f":"IF(A365=\"\",\"\",IF(ISERROR(VLOOKUP(CONCATENATE(HDV!B365,\"_\",HDV!C365),Sheet2!$A$28:$A$40,1,FALSE))=TRUE,\"ERROR\",\"OK\"))","v":""},"",""]
[null,null,null,null,null,null,null,null,null,null,null,null,null,"","","",{"$f":"IF(A366=\"\",\"\",IF(ISERROR(VLOOKUP(CONCATENATE(HDV!B366,\"_\",HDV!C366),Sheet2!$A$28:$A$40,1,FALSE))=TRUE,\"ERROR\",\"OK\"))","v":""},"",""]
[null,null,null,null,null,null,null,null,null,null,null,null,null,"","","",{"$f":"IF(A367=\"\",\"\",IF(ISERROR(VLOOKUP(CONCATENATE(HDV!B367,\"_\",HDV!C367),Sheet2!$A$28:$A$40,1,FALSE))=TRUE,\"ERROR\",\"OK\"))","v":""},"",""]
[null,null,null,null,null,null,null,null,null,null,null,null,null,"","","",{"$f":"IF(A368=\"\",\"\",IF(ISERROR(VLOOKUP(CONCATENATE(HDV!B368,\"_\",HDV!C368),Sheet2!$A$28:$A$40,1,FALSE))=TRUE,\"ERROR\",\"OK\"))","v":""},"",""]
[null,null,null,null,null,null,null,null,null,null,null,null,null,"","","",{"$f":"IF(A369=\"\",\"\",IF(ISERROR(VLOOKUP(CONCATENATE(HDV!B369,\"_\",HDV!C369),Sheet2!$A$28:$A$40,1,FALSE))=TRUE,\"ERROR\",\"OK\"))","v":""},"",""]
[null,null,null,null,null,null,null,null,null,null,null,null,null,"","","",{"$f":"IF(A370=\"\",\"\",IF(ISERROR(VLOOKUP(CONCATENATE(HDV!B370,\"_\",HDV!C370),Sheet2!$A$28:$A$40,1,FALSE))=TRUE,\"ERROR\",\"OK\"))","v":""},"",""]
[null,null,null,null,null,null,null,null,null,null,null,null,null,"","","",{"$f":"IF(A371=\"\",\"\",IF(ISERROR(VLOOKUP(CONCATENATE(HDV!B371,\"_\",HDV!C371),Sheet2!$A$28:$A$40,1,FALSE))=TRUE,\"ERROR\",\"OK\"))","v":""},"",""]
[null,null,null,null,null,null,null,null,null,null,null,null,null,"","","",{"$f":"IF(A372=\"\",\"\",IF(ISERROR(VLOOKUP(CONCATENATE(HDV!B372,\"_\",HDV!C372),Sheet2!$A$28:$A$40,1,FALSE))=TRUE,\"ERROR\",\"OK\"))","v":""},"",""]
[null,null,null,null,null,null,null,null,null,null,null,null,null,"","","",{"$f":"IF(A373=\"\",\"\",IF(ISERROR(VLOOKUP(CONCATENATE(HDV!B373,\"_\",HDV!C373),Sheet2!$A$28:$A$40,1,FALSE))=TRUE,\"ERROR\",\"OK\"))","v":""},"",""]
[null,null,null,null,null,null,null,null,null,null,null,null,null,"","","",{"$f":"IF(A374=\"\",\"\",IF(ISERROR(VLOOKUP(CONCATENATE(HDV!B374,\"_\",HDV!C374),Sheet2!$A$28:$A$40,1,FALSE))=TRUE,\"ERROR\",\"OK\"))","v":""},"",""]
[null,null,null,null,null,null,null,null,null,null,null,null,null,"","","",{"$f":"IF(A375=\"\",\"\",IF(ISERROR(VLOOKUP(CONCATENATE(HDV!B375,\"_\",HDV!C375),Sheet2!$A$28:$A$40,1,FALSE))=TRUE,\"ERROR\",\"OK\"))","v":""},"",""]
[null,null,null,null,null,null,null,null,null,null,null,null,null,"","","",{"$f":"IF(A376=\"\",\"\",IF(ISERROR(VLOOKUP(CONCATENATE(HDV!B376,\"_\",HDV!C376),Sheet2!$A$28:$A$40,1,FALSE))=TRUE,\"ERROR\",\"OK\"))","v":""},"",""]
[null,null,null,null,null,null,null,null,null,null,null,null,null,"","","",{"$f":"IF(A377=\"\",\"\",IF(ISERROR(VLOOKUP(CONCATENATE(HDV!B377,\"_\",HDV!C377),Sheet2!$A$28:$A$40,1,FALSE))=TRUE,\"ERROR\",\"OK\"))","v":""},"",""]
[null,null,null,null,null,null,null,null,null,null,null,null,null,"","","",{"$f":"IF(A378=\"\",\"\",IF(ISERROR(VLOOKUP(CONCATENATE(HDV!B378,\"_\",HDV!C378),Sheet2!$A$28:$A$40,1,FALSE))=TRUE,\"ERROR\",\"OK\"))","v":""},"",""]
[null,null,null,null,null,null,null,null,null,null,null,null,null,"","","",{"$f":"IF(A379=\"\",\"\",IF(ISERROR(VLOOKUP(CONCATENATE(HDV!B379,\"_\",HDV!C379),Sheet2!$A$28:$A$40,1,FALSE))=TRUE,\"ERROR\",\"OK\"))","v":""},"",""]
[null,null,null,null,null,null,null,null,null,null,null,null,null,"","","",{"$f":"IF(A380=\"\",\"\",IF(ISERROR(VLOOKUP(CONCATENATE(HDV!B380,\"_\",HDV!C380),Sheet2!$A$28:$A$40,1,FALSE))=TRUE,\"ERROR\",\"OK\"))","v":""},"",""]
[null,null,null,null,null,null,null,null,null,null,null,null,null,"","","",{"$f":"IF(A381=\"\",\"\",IF(ISERROR(VLOOKUP(CONCATENATE(HDV!B381,\"_\",HDV!C381),Sheet2!$A$28:$A$40,1,FALSE))=TRUE,\"ERROR\",\"OK\"))","v":""},"",""]
[null,null,null,null,null,null,null,null,null,null,null,null,null,"","","",{"$f":"IF(A382=\"\",\"\",IF(ISERROR(VLOOKUP(CONCATENATE(HDV!B382,\"_\",HDV!C382),Sheet2!$A$28:$A$40,1,FALSE))=TRUE,\"ERROR\",\"OK\"))","v":""},"",""]
[null,null,null,null,null,null,null,null,null,null,null,null,null,"","","",{"$f":"IF(A383=\"\",\"\",IF(ISERROR(VLOOKUP(CONCATENATE(HDV!B383,\"_\",HDV!C383),Sheet2!$A$28:$A$40,1,FALSE))=TRUE,\"ERROR\",\"OK\"))","v":""},"",""]
[null,null,null,null,null,null,null,null,null,null,null,null,null,"","","",{"$f":"IF(A384=\"\",\"\",IF(ISERROR(VLOOKUP(CONCATENATE(HDV!B384,\"_\",HDV!C384),Sheet2!$A$28:$A$40,1,FALSE))=TRUE,\"ERROR\",\"OK\"))","v":""},"",""]
[null,null,null,null,null,null,null,null,null,null,null,null,null,"","","",{"$f":"IF(A385=\"\",\"\",IF(ISERROR(VLOOKUP(CONCATENATE(HDV!B385,\"_\",HDV!C385),Sheet2!$A$28:$A$40,1,FALSE))=TRUE,\"ERROR\",\"OK\"))","v":""},"",""]
[null,null,null,null,null,null,null,null,null,null,null,null,null,"","","",{"$f":"IF(A386=\"\",\"\",IF(ISERROR(VLOOKUP(CONCATENATE(HDV!B386,\"_\",HDV!C386),Sheet2!$A$28:$A$40,1,FALSE))=TRUE,\"ERROR\",\"OK\"))","v":""},"",""]
[null,null,null,null,null,null,null,null,null,null,null,null,null,"","","",{"$f":"IF(A387=\"\",\"\",IF(ISERROR(VLOOKUP(CONCATENATE(HDV!B387,\"_\",HDV!C387),Sheet2!$A$28:$A$40,1,FALSE))=TRUE,\"ERROR\",\"OK\"))","v":""},"",""]
[null,null,null,null,null,null,null,null,null,null,null,null,null,"","","",{"$f":"IF(A388=\"\",\"\",IF(ISERROR(VLOOKUP(CONCATENATE(HDV!B388,\"_\",HDV!C388),Sheet2!$A$28:$A$40,1,FALSE))=TRUE,\"ERROR\",\"OK\"))","v":""},"",""]
[null,null,null,null,null,null,null,null,null,null,null,null,null,"","","",{"$f":"IF(A389=\"\",\"\",IF(ISERROR(VLOOKUP(CONCATENATE(HDV!B389,\"_\",HDV!C389),Sheet2!$A$28:$A$40,1,FALSE))=TRUE,\"ERROR\",\"OK\"))","v":""},"",""]
[null,null,null,null,null,null,null,null,null,null,null,null,null,"","","",{"$f":"IF(A390=\"\",\"\",IF(ISERROR(VLOOKUP(CONCATENATE(HDV!B390,\"_\",HDV!C390),Sheet2!$A$28:$A$40,1,FALSE))=TRUE,\"ERROR\",\"OK\"))","v":""},"",""]
[null,null,null,null,null,null,null,null,null,null,null,null,null,"","","",{"$f":"IF(A391=\"\",\"\",IF(ISERROR(VLOOKUP(CONCATENATE(HDV!B391,\"_\",HDV!C391),Sheet2!$A$28:$A$40,1,FALSE))=TRUE,\"ERROR\",\"OK\"))","v":""},"",""]
[null,null,null,null,null,null,null,null,null,null,null,null,null,"","","",{"$f":"IF(A392=\"\",\"\",IF(ISERROR(VLOOKUP(CONCATENATE(HDV!B392,\"_\",HDV!C392),Sheet2!$A$28:$A$40,1,FALSE))=TRUE,\"ERROR\",\"OK\"))","v":""},"",""]
[null,null,null,null,null,null,null,null,null,null,null,null,null,"","","",{"$f":"IF(A393=\"\",\"\",IF(ISERROR(VLOOKUP(CONCATENATE(HDV!B393,\"_\",HDV!C393),Sheet2!$A$28:$A$40,1,FALSE))=TRUE,\"ERROR\",\"OK\"))","v":""},"",""]
[null,null,null,null,null,null,null,null,null,null,null,null,null,"","","",{"$f":"IF(A394=\"\",\"\",IF(ISERROR(VLOOKUP(CONCATENATE(HDV!B394,\"_\",HDV!C394),Sheet2!$A$28:$A$40,1,FALSE))=TRUE,\"ERROR\",\"OK\"))","v":""},"",""]
[null,null,null,null,null,null,null,null,null,null,null,null,null,"","","",{"$f":"IF(A395=\"\",\"\",IF(ISERROR(VLOOKUP(CONCATENATE(HDV!B395,\"_\",HDV!C395),Sheet2!$A$28:$A$40,1,FALSE))=TRUE,\"ERROR\",\"OK\"))","v":""},"",""]
[null,null,null,null,null,null,null,null,null,null,null,null,null,"","","",{"$f":"IF(A396=\"\",\"\",IF(ISERROR(VLOOKUP(CONCATENATE(HDV!B396,\"_\",HDV!C396),Sheet2!$A$28:$A$40,1,FALSE))=TRUE,\"ERROR\",\"OK\"))","v":""},"",""]
[null,null,null,null,null,null,null,null,null,null,null,null,null,"","","",{"$f":"IF(A397=\"\",\"\",IF(ISERROR(VLOOKUP(CONCATENATE(HDV!B397,\"_\",HDV!C397),Sheet2!$A$28:$A$40,1,FALSE))=TRUE,\"ERROR\",\"OK\"))","v":""},"",""]
[null,null,null,null,null,null,null,null,null,null,null,null,null,"","","",{"$f":"IF(A398=\"\",\"\",IF(ISERROR(VLOOKUP(CONCATENATE(HDV!B398,\"_\",HDV!C398),Sheet2!$A$28:$A$40,1,FALSE))=TRUE,\"ERROR\",\"OK\"))","v":""},"",""]
[null,null,null,null,null,null,null,null,null,null,null,null,null,"","","",{"$f":"IF(A399=\"\",\"\",IF(ISERROR(VLOOKUP(CONCATENATE(HDV!B399,\"_\",HDV!C399),Sheet2!$A$28:$A$40,1,FALSE))=TRUE,\"ERROR\",\"OK\"))","v":""},"",""]
[null,null,null,null,null,null,null,null,null,null,null,null,null,{"$f":"IF(A400=\"\",\"\",C400/1000)","v":""},{"$f":"  IF(AND(A400=\"\",F400=\"\"),\"\", IF(AND(A400=\"\",F400<>\"\"), \"FIX TEST GRP\", IF(B400=\"\",\"FIX CLASS\",IF(C400=\"\",\"FIX BIN\",IF(F400=\"\",\"FIX PROD'N\",F400*N400)))))","v":""},{"$f":"IF(A400=\"\",\"\",IF(C400=\"\",\"FIX BIN\", IF(D400=\"\",\"FIX U/L MILES\", IFERROR(O400/(IF(B400=\"2b\",$G$10,$M$10)),\"\"))))","v":""},{"$f":"IF(A400=\"\",\"\",IF(ISERROR(VLOOKUP(CONCATENATE(HDV!B400,\"_\",HDV!C400),Sheet2!$A$28:$A$40,1,FALSE))=TRUE,\"ERROR\",\"OK\"))","v":""},{"$f":"IF(A400=\"\",\"\", IF(AND($C$10>2021, C400=340),\"ERROR\",IF(AND($C$10>2021, C400=395),\"ERROR\",IF(AND($C$10>2021, C400>400),\"ERROR\", \"OK\"))))","v":""},{"$f":"IF(B400=\"\",\"\", IF(AND($C$10>2021, D400<150),\"ERROR\",IF(AND(D400<150, N400=395),\"ERROR\",IF(AND(D400<150, N400=340),\"ERROR\",IF(AND(D400<150, N400>400),\"ERROR\", \"OK\")))))","v":""}]
[null,null,null,null,null,null,null,null,null,null,null,null,null,"","","",{"$f":"IF(A401=\"\",\"\",IF(ISERROR(VLOOKUP(CONCATENATE(HDV!B401,\"_\",HDV!C401),Sheet2!$A$28:$A$40,1,FALSE))=TRUE,\"ERROR\",\"OK\"))","v":""},"",""]
[null,null,null,null,null,null,null,null,null,null,null,null,null,"","","",{"$f":"IF(A402=\"\",\"\",IF(ISERROR(VLOOKUP(CONCATENATE(HDV!B402,\"_\",HDV!C402),Sheet2!$A$28:$A$40,1,FALSE))=TRUE,\"ERROR\",\"OK\"))","v":""},"",""]
[null,null,null,null,null,null,null,null,null,null,null,null,null,"","","",{"$f":"IF(A403=\"\",\"\",IF(ISERROR(VLOOKUP(CONCATENATE(HDV!B403,\"_\",HDV!C403),Sheet2!$A$28:$A$40,1,FALSE))=TRUE,\"ERROR\",\"OK\"))","v":""},"",""]
[null,null,null,null,null,null,null,null,null,null,null,null,null,"","","",{"$f":"IF(A404=\"\",\"\",IF(ISERROR(VLOOKUP(CONCATENATE(HDV!B404,\"_\",HDV!C404),Sheet2!$A$28:$A$40,1,FALSE))=TRUE,\"ERROR\",\"OK\"))","v":""},"",""]
[null,null,null,null,null,null,null,null,null,null,null,null,null,"","","",{"$f":"IF(A405=\"\",\"\",IF(ISERROR(VLOOKUP(CONCATENATE(HDV!B405,\"_\",HDV!C405),Sheet2!$A$28:$A$40,1,FALSE))=TRUE,\"ERROR\",\"OK\"))","v":""},"",""]
[null,null,null,null,null,null,null,null,null,null,null,null,null,"","","",{"$f":"IF(A406=\"\",\"\",IF(ISERROR(VLOOKUP(CONCATENATE(HDV!B406,\"_\",HDV!C406),Sheet2!$A$28:$A$40,1,FALSE))=TRUE,\"ERROR\",\"OK\"))","v":""},"",""]
[null,null,null,null,null,null,null,null,null,null,null,null,null,"","","",{"$f":"IF(A407=\"\",\"\",IF(ISERROR(VLOOKUP(CONCATENATE(HDV!B407,\"_\",HDV!C407),Sheet2!$A$28:$A$40,1,FALSE))=TRUE,\"ERROR\",\"OK\"))","v":""},"",""]
[null,null,null,null,null,null,null,null,null,null,null,null,null,"","","",{"$f":"IF(A408=\"\",\"\",IF(ISERROR(VLOOKUP(CONCATENATE(HDV!B408,\"_\",HDV!C408),Sheet2!$A$28:$A$40,1,FALSE))=TRUE,\"ERROR\",\"OK\"))","v":""},"",""]
[null,null,null,null,null,null,null,null,null,null,null,null,null,"","","",{"$f":"IF(A409=\"\",\"\",IF(ISERROR(VLOOKUP(CONCATENATE(HDV!B409,\"_\",HDV!C409),Sheet2!$A$28:$A$40,1,FALSE))=TRUE,\"ERROR\",\"OK\"))","v":""},"",""]
[null,null,null,null,null,null,null,null,null,null,null,null,null,"","","",{"$f":"IF(A410=\"\",\"\",IF(ISERROR(VLOOKUP(CONCATENATE(HDV!B410,\"_\",HDV!C410),Sheet2!$A$28:$A$40,1,FALSE))=TRUE,\"ERROR\",\"OK\"))","v":""},"",""]
[null,null,null,null,null,null,null,null,null,null,null,null,null,"","","",{"$f":"IF(A411=\"\",\"\",IF(ISERROR(VLOOKUP(CONCATENATE(HDV!B411,\"_\",HDV!C411),Sheet2!$A$28:$A$40,1,FALSE))=TRUE,\"ERROR\",\"OK\"))","v":""},"",""]
[null,null,null,null,null,null,null,null,null,null,null,null,null,"","","",{"$f":"IF(A412=\"\",\"\",IF(ISERROR(VLOOKUP(CONCATENATE(HDV!B412,\"_\",HDV!C412),Sheet2!$A$28:$A$40,1,FALSE))=TRUE,\"ERROR\",\"OK\"))","v":""},"",""]
[null,null,null,null,null,null,null,null,null,null,null,null,null,"","","",{"$f":"IF(A413=\"\",\"\",IF(ISERROR(VLOOKUP(CONCATENATE(HDV!B413,\"_\",HDV!C413),Sheet2!$A$28:$A$40,1,FALSE))=TRUE,\"ERROR\",\"OK\"))","v":""},"",""]
[null,null,null,null,null,null,null,null,null,null,null,null,null,"","","",{"$f":"IF(A414=\"\",\"\",IF(ISERROR(VLOOKUP(CONCATENATE(HDV!B414,\"_\",HDV!C414),Sheet2!$A$28:$A$40,1,FALSE))=TRUE,\"ERROR\",\"OK\"))","v":""},"",""]
[null,null,null,null,null,null,null,null,null,null,null,null,null,"","","",{"$f":"IF(A415=\"\",\"\",IF(ISERROR(VLOOKUP(CONCATENATE(HDV!B415,\"_\",HDV!C415),Sheet2!$A$28:$A$40,1,FALSE))=TRUE,\"ERROR\",\"OK\"))","v":""},"",""]
[null,null,null,null,null,null,null,null,null,null,null,null,null,"","","",{"$f":"IF(A416=\"\",\"\",IF(ISERROR(VLOOKUP(CONCATENATE(HDV!B416,\"_\",HDV!C416),Sheet2!$A$28:$A$40,1,FALSE))=TRUE,\"ERROR\",\"OK\"))","v":""},"",""]
[null,null,null,null,null,null,null,null,null,null,null,null,null,"","","",{"$f":"IF(A417=\"\",\"\",IF(ISERROR(VLOOKUP(CONCATENATE(HDV!B417,\"_\",HDV!C417),Sheet2!$A$28:$A$40,1,FALSE))=TRUE,\"ERROR\",\"OK\"))","v":""},"",""]
[null,null,null,null,null,null,null,null,null,null,null,null,null,"","","",{"$f":"IF(A418=\"\",\"\",IF(ISERROR(VLOOKUP(CONCATENATE(HDV!B418,\"_\",HDV!C418),Sheet2!$A$28:$A$40,1,FALSE))=TRUE,\"ERROR\",\"OK\"))","v":""},"",""]
[null,null,null,null,null,null,null,null,null,null,null,null,null,"","","",{"$f":"IF(A419=\"\",\"\",IF(ISERROR(VLOOKUP(CONCATENATE(HDV!B419,\"_\",HDV!C419),Sheet2!$A$28:$A$40,1,FALSE))=TRUE,\"ERROR\",\"OK\"))","v":""},"",""]
[null,null,null,null,null,null,null,null,null,null,null,null,null,"","","",{"$f":"IF(A420=\"\",\"\",IF(ISERROR(VLOOKUP(CONCATENATE(HDV!B420,\"_\",HDV!C420),Sheet2!$A$28:$A$40,1,FALSE))=TRUE,\"ERROR\",\"OK\"))","v":""},"",""]
[null,null,null,null,null,null,null,null,null,null,null,null,null,"","","",{"$f":"IF(A421=\"\",\"\",IF(ISERROR(VLOOKUP(CONCATENATE(HDV!B421,\"_\",HDV!C421),Sheet2!$A$28:$A$40,1,FALSE))=TRUE,\"ERROR\",\"OK\"))","v":""},"",""]
[null,null,null,null,null,null,null,null,null,null,null,null,null,"","","",{"$f":"IF(A422=\"\",\"\",IF(ISERROR(VLOOKUP(CONCATENATE(HDV!B422,\"_\",HDV!C422),Sheet2!$A$28:$A$40,1,FALSE))=TRUE,\"ERROR\",\"OK\"))","v":""},"",""]
[null,null,null,null,null,null,null,null,null,null,null,null,null,"","","",{"$f":"IF(A423=\"\",\"\",IF(ISERROR(VLOOKUP(CONCATENATE(HDV!B423,\"_\",HDV!C423),Sheet2!$A$28:$A$40,1,FALSE))=TRUE,\"ERROR\",\"OK\"))","v":""},"",""]
[null,null,null,null,null,null,null,null,null,null,null,null,null,"","","",{"$f":"IF(A424=\"\",\"\",IF(ISERROR(VLOOKUP(CONCATENATE(HDV!B424,\"_\",HDV!C424),Sheet2!$A$28:$A$40,1,FALSE))=TRUE,\"ERROR\",\"OK\"))","v":""},"",""]
[null,null,null,null,null,null,null,null,null,null,null,null,null,"","","",{"$f":"IF(A425=\"\",\"\",IF(ISERROR(VLOOKUP(CONCATENATE(HDV!B425,\"_\",HDV!C425),Sheet2!$A$28:$A$40,1,FALSE))=TRUE,\"ERROR\",\"OK\"))","v":""},"",""]
[null,null,null,null,null,null,null,null,null,null,null,null,null,"","","",{"$f":"IF(A426=\"\",\"\",IF(ISERROR(VLOOKUP(CONCATENATE(HDV!B426,\"_\",HDV!C426),Sheet2!$A$28:$A$40,1,FALSE))=TRUE,\"ERROR\",\"OK\"))","v":""},"",""]
[null,null,null,null,null,null,null,null,null,null,null,null,null,"","","",{"$f":"IF(A427=\"\",\"\",IF(ISERROR(VLOOKUP(CONCATENATE(HDV!B427,\"_\",HDV!C427),Sheet2!$A$28:$A$40,1,FALSE))=TRUE,\"ERROR\",\"OK\"))","v":""},"",""]
[null,null,null,null,null,null,null,null,null,null,null,null,null,"","","",{"$f":"IF(A428=\"\",\"\",IF(ISERROR(VLOOKUP(CONCATENATE(HDV!B428,\"_\",HDV!C428),Sheet2!$A$28:$A$40,1,FALSE))=TRUE,\"ERROR\",\"OK\"))","v":""},"",""]
[null,null,null,null,null,null,null,null,null,null,null,null,null,"","","",{"$f":"IF(A429=\"\",\"\",IF(ISERROR(VLOOKUP(CONCATENATE(HDV!B429,\"_\",HDV!C429),Sheet2!$A$28:$A$40,1,FALSE))=TRUE,\"ERROR\",\"OK\"))","v":""},"",""]
[null,null,null,null,null,null,null,null,null,null,null,null,null,"","","",{"$f":"IF(A430=\"\",\"\",IF(ISERROR(VLOOKUP(CONCATENATE(HDV!B430,\"_\",HDV!C430),Sheet2!$A$28:$A$40,1,FALSE))=TRUE,\"ERROR\",\"OK\"))","v":""},"",""]
[null,null,null,null,null,null,null,null,null,null,null,null,null,"","","",{"$f":"IF(A431=\"\",\"\",IF(ISERROR(VLOOKUP(CONCATENATE(HDV!B431,\"_\",HDV!C431),Sheet2!$A$28:$A$40,1,FALSE))=TRUE,\"ERROR\",\"OK\"))","v":""},"",""]
[null,null,null,null,null,null,null,null,null,null,null,null,null,"","","",{"$f":"IF(A432=\"\",\"\",IF(ISERROR(VLOOKUP(CONCATENATE(HDV!B432,\"_\",HDV!C432),Sheet2!$A$28:$A$40,1,FALSE))=TRUE,\"ERROR\",\"OK\"))","v":""},"",""]
[null,null,null,null,null,null,null,null,null,null,null,null,null,"","","",{"$f":"IF(A433=\"\",\"\",IF(ISERROR(VLOOKUP(CONCATENATE(HDV!B433,\"_\",HDV!C433),Sheet2!$A$28:$A$40,1,FALSE))=TRUE,\"ERROR\",\"OK\"))","v":""},"",""]
[null,null,null,null,null,null,null,null,null,null,null,null,null,"","","",{"$f":"IF(A434=\"\",\"\",IF(ISERROR(VLOOKUP(CONCATENATE(HDV!B434,\"_\",HDV!C434),Sheet2!$A$28:$A$40,1,FALSE))=TRUE,\"ERROR\",\"OK\"))","v":""},"",""]
[null,null,null,null,null,null,null,null,null,null,null,null,null,"","","",{"$f":"IF(A435=\"\",\"\",IF(ISERROR(VLOOKUP(CONCATENATE(HDV!B435,\"_\",HDV!C435),Sheet2!$A$28:$A$40,1,FALSE))=TRUE,\"ERROR\",\"OK\"))","v":""},"",""]
[null,null,null,null,null,null,null,null,null,null,null,null,null,"","","",{"$f":"IF(A436=\"\",\"\",IF(ISERROR(VLOOKUP(CONCATENATE(HDV!B436,\"_\",HDV!C436),Sheet2!$A$28:$A$40,1,FALSE))=TRUE,\"ERROR\",\"OK\"))","v":""},"",""]
[null,null,null,null,null,null,null,null,null,null,null,null,null,"","","",{"$f":"IF(A437=\"\",\"\",IF(ISERROR(VLOOKUP(CONCATENATE(HDV!B437,\"_\",HDV!C437),Sheet2!$A$28:$A$40,1,FALSE))=TRUE,\"ERROR\",\"OK\"))","v":""},"",""]
[null,null,null,null,null,null,null,null,null,null,null,null,null,"","","",{"$f":"IF(A438=\"\",\"\",IF(ISERROR(VLOOKUP(CONCATENATE(HDV!B438,\"_\",HDV!C438),Sheet2!$A$28:$A$40,1,FALSE))=TRUE,\"ERROR\",\"OK\"))","v":""},"",""]
[null,null,null,null,null,null,null,null,null,null,null,null,null,"","","",{"$f":"IF(A439=\"\",\"\",IF(ISERROR(VLOOKUP(CONCATENATE(HDV!B439,\"_\",HDV!C439),Sheet2!$A$28:$A$40,1,FALSE))=TRUE,\"ERROR\",\"OK\"))","v":""},"",""]
[null,null,null,null,null,null,null,null,null,null,null,null,null,"","","",{"$f":"IF(A440=\"\",\"\",IF(ISERROR(VLOOKUP(CONCATENATE(HDV!B440,\"_\",HDV!C440),Sheet2!$A$28:$A$40,1,FALSE))=TRUE,\"ERROR\",\"OK\"))","v":""},"",""]
[null,null,null,null,null,null,null,null,null,null,null,null,null,"","","",{"$f":"IF(A441=\"\",\"\",IF(ISERROR(VLOOKUP(CONCATENATE(HDV!B441,\"_\",HDV!C441),Sheet2!$A$28:$A$40,1,FALSE))=TRUE,\"ERROR\",\"OK\"))","v":""},"",""]
[null,null,null,null,null,null,null,null,null,null,null,null,null,"","","",{"$f":"IF(A442=\"\",\"\",IF(ISERROR(VLOOKUP(CONCATENATE(HDV!B442,\"_\",HDV!C442),Sheet2!$A$28:$A$40,1,FALSE))=TRUE,\"ERROR\",\"OK\"))","v":""},"",""]
[null,null,null,null,null,null,null,null,null,null,null,null,null,"","","",{"$f":"IF(A443=\"\",\"\",IF(ISERROR(VLOOKUP(CONCATENATE(HDV!B443,\"_\",HDV!C443),Sheet2!$A$28:$A$40,1,FALSE))=TRUE,\"ERROR\",\"OK\"))","v":""},"",""]
[null,null,null,null,null,null,null,null,null,null,null,null,null,"","","",{"$f":"IF(A444=\"\",\"\",IF(ISERROR(VLOOKUP(CONCATENATE(HDV!B444,\"_\",HDV!C444),Sheet2!$A$28:$A$40,1,FALSE))=TRUE,\"ERROR\",\"OK\"))","v":""},"",""]
[null,null,null,null,null,null,null,null,null,null,null,null,null,"","","",{"$f":"IF(A445=\"\",\"\",IF(ISERROR(VLOOKUP(CONCATENATE(HDV!B445,\"_\",HDV!C445),Sheet2!$A$28:$A$40,1,FALSE))=TRUE,\"ERROR\",\"OK\"))","v":""},"",""]
[null,null,null,null,null,null,null,null,null,null,null,null,null,"","","",{"$f":"IF(A446=\"\",\"\",IF(ISERROR(VLOOKUP(CONCATENATE(HDV!B446,\"_\",HDV!C446),Sheet2!$A$28:$A$40,1,FALSE))=TRUE,\"ERROR\",\"OK\"))","v":""},"",""]
[null,null,null,null,null,null,null,null,null,null,null,null,null,"","","",{"$f":"IF(A447=\"\",\"\",IF(ISERROR(VLOOKUP(CONCATENATE(HDV!B447,\"_\",HDV!C447),Sheet2!$A$28:$A$40,1,FALSE))=TRUE,\"ERROR\",\"OK\"))","v":""},"",""]
[null,null,null,null,null,null,null,null,null,null,null,null,null,"","","",{"$f":"IF(A448=\"\",\"\",IF(ISERROR(VLOOKUP(CONCATENATE(HDV!B448,\"_\",HDV!C448),Sheet2!$A$28:$A$40,1,FALSE))=TRUE,\"ERROR\",\"OK\"))","v":""},"",""]
[null,null,null,null,null,null,null,null,null,null,null,null,null,"","","",{"$f":"IF(A449=\"\",\"\",IF(ISERROR(VLOOKUP(CONCATENATE(HDV!B449,\"_\",HDV!C449),Sheet2!$A$28:$A$40,1,FALSE))=TRUE,\"ERROR\",\"OK\"))","v":""},"",""]
[null,null,null,null,null,null,null,null,null,null,null,null,null,"","","",{"$f":"IF(A450=\"\",\"\",IF(ISERROR(VLOOKUP(CONCATENATE(HDV!B450,\"_\",HDV!C450),Sheet2!$A$28:$A$40,1,FALSE))=TRUE,\"ERROR\",\"OK\"))","v":""},"",""]
[null,null,null,null,null,null,null,null,null,null,null,null,null,"","","",{"$f":"IF(A451=\"\",\"\",IF(ISERROR(VLOOKUP(CONCATENATE(HDV!B451,\"_\",HDV!C451),Sheet2!$A$28:$A$40,1,FALSE))=TRUE,\"ERROR\",\"OK\"))","v":""},"",""]
[null,null,null,null,null,null,null,null,null,null,null,null,null,"","","",{"$f":"IF(A452=\"\",\"\",IF(ISERROR(VLOOKUP(CONCATENATE(HDV!B452,\"_\",HDV!C452),Sheet2!$A$28:$A$40,1,FALSE))=TRUE,\"ERROR\",\"OK\"))","v":""},"",""]
[null,null,null,null,null,null,null,null,null,null,null,null,null,"","","",{"$f":"IF(A453=\"\",\"\",IF(ISERROR(VLOOKUP(CONCATENATE(HDV!B453,\"_\",HDV!C453),Sheet2!$A$28:$A$40,1,FALSE))=TRUE,\"ERROR\",\"OK\"))","v":""},"",""]
[null,null,null,null,null,null,null,null,null,null,null,null,null,"","","",{"$f":"IF(A454=\"\",\"\",IF(ISERROR(VLOOKUP(CONCATENATE(HDV!B454,\"_\",HDV!C454),Sheet2!$A$28:$A$40,1,FALSE))=TRUE,\"ERROR\",\"OK\"))","v":""},"",""]
[null,null,null,null,null,null,null,null,null,null,null,null,null,"","","",{"$f":"IF(A455=\"\",\"\",IF(ISERROR(VLOOKUP(CONCATENATE(HDV!B455,\"_\",HDV!C455),Sheet2!$A$28:$A$40,1,FALSE))=TRUE,\"ERROR\",\"OK\"))","v":""},"",""]
[null,null,null,null,null,null,null,null,null,null,null,null,null,"","","",{"$f":"IF(A456=\"\",\"\",IF(ISERROR(VLOOKUP(CONCATENATE(HDV!B456,\"_\",HDV!C456),Sheet2!$A$28:$A$40,1,FALSE))=TRUE,\"ERROR\",\"OK\"))","v":""},"",""]
[null,null,null,null,null,null,null,null,null,null,null,null,null,"","","",{"$f":"IF(A457=\"\",\"\",IF(ISERROR(VLOOKUP(CONCATENATE(HDV!B457,\"_\",HDV!C457),Sheet2!$A$28:$A$40,1,FALSE))=TRUE,\"ERROR\",\"OK\"))","v":""},"",""]
[null,null,null,null,null,null,null,null,null,null,null,null,null,"","","",{"$f":"IF(A458=\"\",\"\",IF(ISERROR(VLOOKUP(CONCATENATE(HDV!B458,\"_\",HDV!C458),Sheet2!$A$28:$A$40,1,FALSE))=TRUE,\"ERROR\",\"OK\"))","v":""},"",""]
[null,null,null,null,null,null,null,null,null,null,null,null,null,"","","",{"$f":"IF(A459=\"\",\"\",IF(ISERROR(VLOOKUP(CONCATENATE(HDV!B459,\"_\",HDV!C459),Sheet2!$A$28:$A$40,1,FALSE))=TRUE,\"ERROR\",\"OK\"))","v":""},"",""]
[null,null,null,null,null,null,null,null,null,null,null,null,null,"","","",{"$f":"IF(A460=\"\",\"\",IF(ISERROR(VLOOKUP(CONCATENATE(HDV!B460,\"_\",HDV!C460),Sheet2!$A$28:$A$40,1,FALSE))=TRUE,\"ERROR\",\"OK\"))","v":""},"",""]
[null,null,null,null,null,null,null,null,null,null,null,null,null,"","","",{"$f":"IF(A461=\"\",\"\",IF(ISERROR(VLOOKUP(CONCATENATE(HDV!B461,\"_\",HDV!C461),Sheet2!$A$28:$A$40,1,FALSE))=TRUE,\"ERROR\",\"OK\"))","v":""},"",""]
[null,null,null,null,null,null,null,null,null,null,null,null,null,"","","",{"$f":"IF(A462=\"\",\"\",IF(ISERROR(VLOOKUP(CONCATENATE(HDV!B462,\"_\",HDV!C462),Sheet2!$A$28:$A$40,1,FALSE))=TRUE,\"ERROR\",\"OK\"))","v":""},"",""]
[null,null,null,null,null,null,null,null,null,null,null,null,null,"","","",{"$f":"IF(A463=\"\",\"\",IF(ISERROR(VLOOKUP(CONCATENATE(HDV!B463,\"_\",HDV!C463),Sheet2!$A$28:$A$40,1,FALSE))=TRUE,\"ERROR\",\"OK\"))","v":""},"",""]
[null,null,null,null,null,null,null,null,null,null,null,null,null,{"$f":"IF(A464=\"\",\"\",C464/1000)","v":""},{"$f":"  IF(AND(A464=\"\",F464=\"\"),\"\", IF(AND(A464=\"\",F464<>\"\"), \"FIX TEST GRP\", IF(B464=\"\",\"FIX CLASS\",IF(C464=\"\",\"FIX BIN\",IF(F464=\"\",\"FIX PROD'N\",F464*N464)))))","v":""},{"$f":"IF(A464=\"\",\"\",IF(C464=\"\",\"FIX BIN\", IF(D464=\"\",\"FIX U/L MILES\", IFERROR(O464/(IF(B464=\"2b\",$G$10,$M$10)),\"\"))))","v":""},{"$f":"IF(A464=\"\",\"\",IF(ISERROR(VLOOKUP(CONCATENATE(HDV!B464,\"_\",HDV!C464),Sheet2!$A$28:$A$40,1,FALSE))=TRUE,\"ERROR\",\"OK\"))","v":""},{"$f":"IF(A464=\"\",\"\", IF(AND($C$10>2021, C464=340),\"ERROR\",IF(AND($C$10>2021, C464=395),\"ERROR\",IF(AND($C$10>2021, C464>400),\"ERROR\", \"OK\"))))","v":""},{"$f":"IF(B464=\"\",\"\", IF(AND($C$10>2021, D464<150),\"ERROR\",IF(AND(D464<150, N464=395),\"ERROR\",IF(AND(D464<150, N464=340),\"ERROR\",IF(AND(D464<150, N464>400),\"ERROR\", \"OK\")))))","v":""}]
[null,null,null,null,null,null,null,null,null,null,null,null,null,"","","",{"$f":"IF(A465=\"\",\"\",IF(ISERROR(VLOOKUP(CONCATENATE(HDV!B465,\"_\",HDV!C465),Sheet2!$A$28:$A$40,1,FALSE))=TRUE,\"ERROR\",\"OK\"))","v":""},"",""]
[null,null,null,null,null,null,null,null,null,null,null,null,null,"","","",{"$f":"IF(A466=\"\",\"\",IF(ISERROR(VLOOKUP(CONCATENATE(HDV!B466,\"_\",HDV!C466),Sheet2!$A$28:$A$40,1,FALSE))=TRUE,\"ERROR\",\"OK\"))","v":""},"",""]
[null,null,null,null,null,null,null,null,null,null,null,null,null,"","","",{"$f":"IF(A467=\"\",\"\",IF(ISERROR(VLOOKUP(CONCATENATE(HDV!B467,\"_\",HDV!C467),Sheet2!$A$28:$A$40,1,FALSE))=TRUE,\"ERROR\",\"OK\"))","v":""},"",""]
[null,null,null,null,null,null,null,null,null,null,null,null,null,"","","",{"$f":"IF(A468=\"\",\"\",IF(ISERROR(VLOOKUP(CONCATENATE(HDV!B468,\"_\",HDV!C468),Sheet2!$A$28:$A$40,1,FALSE))=TRUE,\"ERROR\",\"OK\"))","v":""},"",""]
[null,null,null,null,null,null,null,null,null,null,null,null,null,"","","",{"$f":"IF(A469=\"\",\"\",IF(ISERROR(VLOOKUP(CONCATENATE(HDV!B469,\"_\",HDV!C469),Sheet2!$A$28:$A$40,1,FALSE))=TRUE,\"ERROR\",\"OK\"))","v":""},"",""]
[null,null,null,null,null,null,null,null,null,null,null,null,null,"","","",{"$f":"IF(A470=\"\",\"\",IF(ISERROR(VLOOKUP(CONCATENATE(HDV!B470,\"_\",HDV!C470),Sheet2!$A$28:$A$40,1,FALSE))=TRUE,\"ERROR\",\"OK\"))","v":""},"",""]
[null,null,null,null,null,null,null,null,null,null,null,null,null,"","","",{"$f":"IF(A471=\"\",\"\",IF(ISERROR(VLOOKUP(CONCATENATE(HDV!B471,\"_\",HDV!C471),Sheet2!$A$28:$A$40,1,FALSE))=TRUE,\"ERROR\",\"OK\"))","v":""},"",""]
[null,null,null,null,null,null,null,null,null,null,null,null,null,"","","",{"$f":"IF(A472=\"\",\"\",IF(ISERROR(VLOOKUP(CONCATENATE(HDV!B472,\"_\",HDV!C472),Sheet2!$A$28:$A$40,1,FALSE))=TRUE,\"ERROR\",\"OK\"))","v":""},"",""]
[null,null,null,null,null,null,null,null,null,null,null,null,null,"","","",{"$f":"IF(A473=\"\",\"\",IF(ISERROR(VLOOKUP(CONCATENATE(HDV!B473,\"_\",HDV!C473),Sheet2!$A$28:$A$40,1,FALSE))=TRUE,\"ERROR\",\"OK\"))","v":""},"",""]
[null,null,null,null,null,null,null,null,null,null,null,null,null,"","","",{"$f":"IF(A474=\"\",\"\",IF(ISERROR(VLOOKUP(CONCATENATE(HDV!B474,\"_\",HDV!C474),Sheet2!$A$28:$A$40,1,FALSE))=TRUE,\"ERROR\",\"OK\"))","v":""},"",""]
[null,null,null,null,null,null,null,null,null,null,null,null,null,"","","",{"$f":"IF(A475=\"\",\"\",IF(ISERROR(VLOOKUP(CONCATENATE(HDV!B475,\"_\",HDV!C475),Sheet2!$A$28:$A$40,1,FALSE))=TRUE,\"ERROR\",\"OK\"))","v":""},"",""]
[null,null,null,null,null,null,null,null,null,null,null,null,null,"","","",{"$f":"IF(A476=\"\",\"\",IF(ISERROR(VLOOKUP(CONCATENATE(HDV!B476,\"_\",HDV!C476),Sheet2!$A$28:$A$40,1,FALSE))=TRUE,\"ERROR\",\"OK\"))","v":""},"",""]
[null,null,null,null,null,null,null,null,null,null,null,null,null,"","","",{"$f":"IF(A477=\"\",\"\",IF(ISERROR(VLOOKUP(CONCATENATE(HDV!B477,\"_\",HDV!C477),Sheet2!$A$28:$A$40,1,FALSE))=TRUE,\"ERROR\",\"OK\"))","v":""},"",""]
[null,null,null,null,null,null,null,null,null,null,null,null,null,"","","",{"$f":"IF(A478=\"\",\"\",IF(ISERROR(VLOOKUP(CONCATENATE(HDV!B478,\"_\",HDV!C478),Sheet2!$A$28:$A$40,1,FALSE))=TRUE,\"ERROR\",\"OK\"))","v":""},"",""]
[null,null,null,null,null,null,null,null,null,null,null,null,null,"","","",{"$f":"IF(A479=\"\",\"\",IF(ISERROR(VLOOKUP(CONCATENATE(HDV!B479,\"_\",HDV!C479),Sheet2!$A$28:$A$40,1,FALSE))=TRUE,\"ERROR\",\"OK\"))","v":""},"",""]
[null,null,null,null,null,null,null,null,null,null,null,null,null,"","","",{"$f":"IF(A480=\"\",\"\",IF(ISERROR(VLOOKUP(CONCATENATE(HDV!B480,\"_\",HDV!C480),Sheet2!$A$28:$A$40,1,FALSE))=TRUE,\"ERROR\",\"OK\"))","v":""},"",""]
[null,null,null,null,null,null,null,null,null,null,null,null,null,"","","",{"$f":"IF(A481=\"\",\"\",IF(ISERROR(VLOOKUP(CONCATENATE(HDV!B481,\"_\",HDV!C481),Sheet2!$A$28:$A$40,1,FALSE))=TRUE,\"ERROR\",\"OK\"))","v":""},"",""]
[null,null,null,null,null,null,null,null,null,null,null,null,null,"","","",{"$f":"IF(A482=\"\",\"\",IF(ISERROR(VLOOKUP(CONCATENATE(HDV!B482,\"_\",HDV!C482),Sheet2!$A$28:$A$40,1,FALSE))=TRUE,\"ERROR\",\"OK\"))","v":""},"",""]
[null,null,null,null,null,null,null,null,null,null,null,null,null,"","","",{"$f":"IF(A483=\"\",\"\",IF(ISERROR(VLOOKUP(CONCATENATE(HDV!B483,\"_\",HDV!C483),Sheet2!$A$28:$A$40,1,FALSE))=TRUE,\"ERROR\",\"OK\"))","v":""},"",""]

{"sheet":"HDV FTP NMOG+NOX AB&T MYSummary","index":1,"n_rows":43,"n_cols":11,"rows_kept":43,"cut":false,"hidden":false,"merged":[[3,0,3,10],[42,2,42,5],[40,3,40,5],[35,2,35,5],[9,1,9,2],[9,3,9,5],[33,3,33,5],[24,3,24,5],[19,3,19,5],[12,1,13,1],[27,0,27,2],[26,2,26,5],[11,9,13,9],[0,0,0,10],[11,7,13,7],[12,2,13,2],[8,0,8,2],[8,3,8,5],[11,8,13,8],[11,10,13,10],[6,0,6,2],[1,0,1,8],[11,3,11,5],[11,6,12,6],[6,3,6,4],[7,0,7,2],[12,0,13,0],[7,3,7,5],[4,0,4,10]]}
["Example Template - HDV Tier 3 Class 2b/3 FTP Fleet Average (NMOG + NOx) Credits - AB&T Model Year Summary Table"]
["Manufacturer: _______________________",null,null,null,null,null,null,null,null,null,"Date:_______________"]
[]
["Purpose and Scope of this Guidance Document          "]
["        This document was prepared by EPA's Office of Transportation and Air Quality (OTAQ).  It is one of several intended to aid regulated parties in reporting Tier 3 and Cold NMHC Averaging, Banking and Trading (AB&T) information and calculating AB&T fleet average credits for light-duty vehicles and certain heavy-duty class 2b and 3 vehicles, ref. 40 CFR 86.1862-04(c).  It contains EPA's recommended format for manufacturers to report to EPA their end-of-year Tier 3 AB&T calculations, credits and other information with respect to the implementation of the AB&T provisions of the EPA Tier 3 final rule (79 FR 23414, April 28, 2014) as amended (80 FR 9078, February 19, 2015; 80 FR 26463, May 8, 2015);  ref. 40 CFR Parts 85, 86, 600, 1065, 1066.  Use of this document is purely optional.\n       This document does not in any way alter or waive the requirements in EPA regulations.  Although the calculations and formulas provided in this document are intended to assist manufacturers in the implementation of EPA regulations, this document does not establish or change the legal rights or obligations of manufacturers or others in complying with EPA regulations, including 40 CFR 86.1862-04(c). If an error or other discrepancy is found in this document, including the calculation formulas, please contact your EPA certification team member or Dave Good at (734) 214-4450 or by email at good.david@epa.gov.  The regulations take precedence."]
[]
["Select Model Year: ",null,null,2019,null,null,null,null,null,null,"OMB Control Number 2060-0104"]
["Select Phase-in Approach: ",null,null,"Primary--(Used for 2016-2021MYs)",null,null,null,null,null,null,"Expires 3-31-2020"]
["Applicable Phase-in Regulations: ",null,null,{"$f":"IF(D8=\"Primary--(Used for 2016-2021MYs)\",\"40 CFR 86.1816-18(b)(7) and/or (b)(11)\",IF(D8=\"Alternative---(Used for 2019-2021MYs)\",\"40 CFR 86.1816-18(b)(8)\",\"ERROR\"))","v":"40 CFR 86.1816-18(b)(7) and/or (b)(11)"}]
[null,"Small Volume?",null,"No"]
[]
[null,null,null,"Fleet Average Compliance Level",null,null,"G.  Credit (Debit) \n[Calc from D,E,F]","Date Credits/ Debits were earned","Date Credits will expire","Last Date When Credits can be Traded","Comments"]
["A.  Date of Transaction","B.  Model Year","C. Category","D. Applicable FTP Standards","E.   \nMfr  FTP Compliance Level","F. Production Volume "]
[null,null,null,"gram/mi","gram/mi","units","gram/mi"]
[]
["2016 Early Credits:"]
["2017-05-01",2016,"HD Class 2b",{"$f":"IF(AND(B17=2016,C17=\"HD Class 2b\"),\"0.333\", IF(AND(B17=2017,C17=\"HD Class 2b\"),\"0.310\", IF(AND(B17=2018,C17=\"HD Class 2b\"),\"0.278\", IF(AND(B17=2019,C17=\"HD Class 2b\"),\"0.253\", IF(AND(B17=2020,C17=\"HD Class 2b\"),\"0.228\", IF(AND(B17=2021,C17=\"HD Class 2b\"),\"0.203\", IF(AND(B17>2021,C17=\"HD Class 2b\"),\"0.178\",IF(AND(B17=2016,C17=\"HD Class 3\"),\"0.548\", IF(AND(B17=2017,C17=\"HD Class 3\"),\"0.508\", IF(AND(B17=2018,C17=\"HD Class 3\"),\"0.451\", IF(AND(B17=2019,C17=\"HD Class 3\"),\"0.400\", IF(AND(B17=2020,C17=\"HD Class 3\"),\"0.349\", IF(AND(B17=2021,C17=\"HD Class 3\"),\"0.298\", IF(AND(B17>2021,C17=\"HD Class 3\"),\"0.247\", ERROR))))))))))))))","v":"0.333"},0.30199999999999999,10002,{"$f":"IF($D$8=\"Alternative---(Used for 2019-2021MYs)\", \"Not Allowed\", IF(E17= \"\", \"ERROR\", astm((astm(D17,3)-(astm(E17,3)))*F17,0)))","v":310},"2016-12-31",{"$f":"DATE(YEAR(H17)+5,MONTH(H17),DAY(H17))","v":"2021-12-31"},{"$f":"DATE(YEAR(H17)+5,MONTH(H17),DAY(H17))","v":"2021-12-31"},"2016 Early Tier 3 HD Class 2b FTP Credits earned per 40 CFR 86.1816-18(b)(11); see other spreadsheet. "]
["2017-05-01",2016,"HD Class 3",{"$f":"IF(AND(B18=2016,C18=\"HD Class 2b\"),\"0.333\", IF(AND(B18=2017,C18=\"HD Class 2b\"),\"0.310\", IF(AND(B18=2018,C18=\"HD Class 2b\"),\"0.278\", IF(AND(B18=2019,C18=\"HD Class 2b\"),\"0.253\", IF(AND(B18=2020,C18=\"HD Class 2b\"),\"0.228\", IF(AND(B18=2021,C18=\"HD Class 2b\"),\"0.203\", IF(AND(B18>2021,C18=\"HD Class 2b\"),\"0.178\",IF(AND(B18=2016,C18=\"HD Class 3\"),\"0.548\", IF(AND(B18=2017,C18=\"HD Class 3\"),\"0.508\", IF(AND(B18=2018,C18=\"HD Class 3\"),\"0.451\", IF(AND(B18=2019,C18=\"HD Class 3\"),\"0.400\", IF(AND(B18=2020,C18=\"HD Class 3\"),\"0.349\", IF(AND(B18=2021,C18=\"HD Class 3\"),\"0.298\", IF(AND(B18>2021,C18=\"HD Class 3\"),\"0.247\", ERROR))))))))))))))","v":"0.548"},0.42099999999999999,1000,{"$f":"IF($D$8=\"Alternative---(Used for 2019-2021MYs)\", \"Not Allowed\", IF(E18= \"\", \"ERROR\", astm((astm(D18,3)-(astm(E18,3)))*F18,0)))","v":127},"2016-12-31",{"$f":"DATE(YEAR(H18)+5,MONTH(H18),DAY(H18))","v":"2021-12-31"},{"$f":"DATE(YEAR(H18)+5,MONTH(H18),DAY(H18))","v":"2021-12-31"},"2016 Early Tier 3 HD Class 3 FTP Credits earned per 40 CFR 86.1816-18(b)(11); see other spreadsheet. "]
["     4/1/2019",2016,"Transfer","-","-","-",-437,"2016-12-31","-","-","Transferred 437 Credits from 2016 model year to 2018 model year (earned on 12/31/2016)."]
[null,null,null,"Total 2016 Early Credits Remaining:",null,null,{"$f":"SUM(G17:G19)","v":0}]
["2017 Early Credits:"]
["2018-05-01",2017,"HD Class 2b",{"$f":"IF(AND(B22=2016,C22=\"HD Class 2b\"),\"0.333\", IF(AND(B22=2017,C22=\"HD Class 2b\"),\"0.310\", IF(AND(B22=2018,C22=\"HD Class 2b\"),\"0.278\", IF(AND(B22=2019,C22=\"HD Class 2b\"),\"0.253\", IF(AND(B22=2020,C22=\"HD Class 2b\"),\"0.228\", IF(AND(B22=2021,C22=\"HD Class 2b\"),\"0.203\", IF(AND(B22>2021,C22=\"HD Class 2b\"),\"0.178\",IF(AND(B22=2016,C22=\"HD Class 3\"),\"0.548\", IF(AND(B22=2017,C22=\"HD Class 3\"),\"0.508\", IF(AND(B22=2018,C22=\"HD Class 3\"),\"0.451\", IF(AND(B22=2019,C22=\"HD Class 3\"),\"0.400\", IF(AND(B22=2020,C22=\"HD Class 3\"),\"0.349\", IF(AND(B22=2021,C22=\"HD Class 3\"),\"0.298\", IF(AND(B22>2021,C22=\"HD Class 3\"),\"0.247\", ERROR))))))))))))))","v":"0.310"},0.29799999999999999,21784,{"$f":"IF($D$8=\"Alternative---(Used for 2019-2021MYs)\", \"Not Allowed\", IF(E22= \"\", \"ERROR\", astm((astm(D22,3)-(astm(E22,3)))*F22,0)))","v":261},"2017-12-31",{"$f":"DATE(YEAR(H22)+5,MONTH(H22),DAY(H22))","v":"2022-12-31"},{"$f":"DATE(YEAR(H22)+5,MONTH(H22),DAY(H22))","v":"2022-12-31"},"2017 Early Tier 3 HD Class 2b FTP Credits earned per 40 CFR 86.1816-18(b)(11); see other spreadsheet. "]
["2018-05-01",2017,"HD Class 3",{"$f":"IF(AND(B23=2016,C23=\"HD Class 2b\"),\"0.333\", IF(AND(B23=2017,C23=\"HD Class 2b\"),\"0.310\", IF(AND(B23=2018,C23=\"HD Class 2b\"),\"0.278\", IF(AND(B23=2019,C23=\"HD Class 2b\"),\"0.253\", IF(AND(B23=2020,C23=\"HD Class 2b\"),\"0.228\", IF(AND(B23=2021,C23=\"HD Class 2b\"),\"0.203\", IF(AND(B23>2021,C23=\"HD Class 2b\"),\"0.178\",IF(AND(B23=2016,C23=\"HD Class 3\"),\"0.548\", IF(AND(B23=2017,C23=\"HD Class 3\"),\"0.508\", IF(AND(B23=2018,C23=\"HD Class 3\"),\"0.451\", IF(AND(B23=2019,C23=\"HD Class 3\"),\"0.400\", IF(AND(B23=2020,C23=\"HD Class 3\"),\"0.349\", IF(AND(B23=2021,C23=\"HD Class 3\"),\"0.298\", IF(AND(B23>2021,C23=\"HD Class 3\"),\"0.247\", ERROR))))))))))))))","v":"0.508"},0.501,1000,{"$f":"IF($D$8=\"Alternative---(Used for 2019-2021MYs)\", \"Not Allowed\", IF(E23= \"\", \"ERROR\", astm((astm(D23,3)-(astm(E23,3)))*F23,0)))","v":7},"2017-12-31",{"$f":"DATE(YEAR(H23)+5,MONTH(H23),DAY(H23))","v":"2022-12-31"},{"$f":"DATE(YEAR(H23)+5,MONTH(H23),DAY(H23))","v":"2022-12-31"},"2017 Early Tier 3 HD Class 3 FTP Credits earned per 40 CFR 86.1816-18(b)(11); see other spreadsheet. "]
["     4/1/2019",2017,"Transfer","-","-","-",-268,"2017-12-31",null,null,"Transferred 268 Credits from 2017 model year to 2018 model year (earned on 12/31/2017)."]
[null,null,null,"Total 2017 Early Credits Remaining:",null,null,{"$f":"SUM(G22:G24)","v":0}]
[]
[null,null,"Total 2016-2017 Early Credits Remaining:",null,null,null,{"$f":"SUM(G20+G25)","v":0}]
["2018 Credits: "]
["2019-05-01",2018,"HD Class 2b",{"$f":"IF(AND(B29=2016,C29=\"HD Class 2b\"),\"0.333\", IF(AND(B29=2017,C29=\"HD Class 2b\"),\"0.310\", IF(AND(B29=2018,C29=\"HD Class 2b\"),\"0.278\", IF(AND(B29=2019,C29=\"HD Class 2b\"),\"0.253\", IF(AND(B29=2020,C29=\"HD Class 2b\"),\"0.228\", IF(AND(B29=2021,C29=\"HD Class 2b\"),\"0.203\", IF(AND(B29>2021,C29=\"HD Class 2b\"),\"0.178\",IF(AND(B29=2016,C29=\"HD Class 3\"),\"0.548\", IF(AND(B29=2017,C29=\"HD Class 3\"),\"0.508\", IF(AND(B29=2018,C29=\"HD Class 3\"),\"0.451\", IF(AND(B29=2019,C29=\"HD Class 3\"),\"0.400\", IF(AND(B29=2020,C29=\"HD Class 3\"),\"0.349\", IF(AND(B29=2021,C29=\"HD Class 3\"),\"0.298\", IF(AND(B29>2021,C29=\"HD Class 3\"),\"0.247\", ERROR))))))))))))))","v":"0.278"},0.29799999999999999,58471,{"$f":"IF($D$8=\"Alternative---(Used for 2019-2021MYs)\", \"Not Allowed\", IF(E29= \"\", \"ERROR\", astm((astm(D29,3)-(astm(E29,3)))*F29,0)))","v":-1169},"2018-12-31",{"$f":"DATE(YEAR(H29)+5,MONTH(H29),DAY(H29))","v":"2023-12-31"},{"$f":"DATE(YEAR(H29)+5,MONTH(H29),DAY(H29))","v":"2023-12-31"},"2018 Tier 3 HD Class 2b FTP Credits earned using Primary phase-in approach; see other spreadsheet. "]
["2019-05-01",2018,"HD Class 3",{"$f":"IF(AND(B30=2016,C30=\"HD Class 2b\"),\"0.333\", IF(AND(B30=2017,C30=\"HD Class 2b\"),\"0.310\", IF(AND(B30=2018,C30=\"HD Class 2b\"),\"0.278\", IF(AND(B30=2019,C30=\"HD Class 2b\"),\"0.253\", IF(AND(B30=2020,C30=\"HD Class 2b\"),\"0.228\", IF(AND(B30=2021,C30=\"HD Class 2b\"),\"0.203\", IF(AND(B30>2021,C30=\"HD Class 2b\"),\"0.178\",IF(AND(B30=2016,C30=\"HD Class 3\"),\"0.548\", IF(AND(B30=2017,C30=\"HD Class 3\"),\"0.508\", IF(AND(B30=2018,C30=\"HD Class 3\"),\"0.451\", IF(AND(B30=2019,C30=\"HD Class 3\"),\"0.400\", IF(AND(B30=2020,C30=\"HD Class 3\"),\"0.349\", IF(AND(B30=2021,C30=\"HD Class 3\"),\"0.298\", IF(AND(B30>2021,C30=\"HD Class 3\"),\"0.247\", ERROR))))))))))))))","v":"0.451"},0.46,10000,{"$f":"IF($D$8=\"Alternative---(Used for 2019-2021MYs)\", \"Not Allowed\", IF(E30= \"\", \"ERROR\", astm((astm(D30,3)-(astm(E30,3)))*F30,0)))","v":-90},"2018-12-31",{"$f":"DATE(YEAR(H30)+5,MONTH(H30),DAY(H30))","v":"2023-12-31"},{"$f":"DATE(YEAR(H30)+5,MONTH(H30),DAY(H30))","v":"2023-12-31"},"2018 Tier 3 HD Class 3 FTP Credits earnedusing Primary phase-in approach; ; see other spreadsheet. "]
["     4/1/2019",2016,"Transfer","-","-","-",437,"2016-12-31","-","-","Transferred 437 Credits from 2016 model year to 2018 model year (earned on 12/31/2016)."]
["     4/1/2019",2017,"Transfer","-","-","-",268,"2017-12-31",null,null,"Transferred 268 Credits from 2017 model year to 2018 model year (earned on 12/31/2017)."]
["2019-01-20",2018,"Transfer","-","-","-",500,"2016-12-31",{"$f":"DATE(YEAR(H33)+5,MONTH(H33),DAY(H33))","v":"2021-12-31"},{"$f":"DATE(YEAR(H33)+5,MONTH(H33),DAY(H33))","v":"2021-12-31"},"Purchased 500 HDV FTP credits from Manufacturer A (earned on 12/31/2016)"]
[null,null,null,"Total 2018 Credits Remaining:",null,null,{"$f":"SUM(G29:G33)","v":-54}]
[]
[null,null,"Total 2016-2018 Credits Remaining:",null,null,null,{"$f":"SUM(G27+G34)","v":-54}]
["2019 Credits: "]
["2020-05-01",2019,"HD Class 2b",{"$f":"IF(AND(B38=2016,C38=\"HD Class 2b\"),\"0.333\", IF(AND(B38=2017,C38=\"HD Class 2b\"),\"0.310\", IF(AND(B38=2018,C38=\"HD Class 2b\"),\"0.278\", IF(AND(B38=2019,C38=\"HD Class 2b\"),\"0.253\", IF(AND(B38=2020,C38=\"HD Class 2b\"),\"0.228\", IF(AND(B38=2021,C38=\"HD Class 2b\"),\"0.203\", IF(AND(B38>2021,C38=\"HD Class 2b\"),\"0.178\",IF(AND(B38=2016,C38=\"HD Class 3\"),\"0.548\", IF(AND(B38=2017,C38=\"HD Class 3\"),\"0.508\", IF(AND(B38=2018,C38=\"HD Class 3\"),\"0.451\", IF(AND(B38=2019,C38=\"HD Class 3\"),\"0.400\", IF(AND(B38=2020,C38=\"HD Class 3\"),\"0.349\", IF(AND(B38=2021,C38=\"HD Class 3\"),\"0.298\", IF(AND(B38>2021,C38=\"HD Class 3\"),\"0.247\", ERROR))))))))))))))","v":"0.253"},{"$f":"HDV!H10","v":0.224},{"$f":"HDV!G10","v":193840},{"$f":"IF(E38= \"\", \"ERROR\", astm((astm(D38,3)-(astm(E38,3)))*F38,0))","v":5621},"2019-12-31",{"$f":"DATE(YEAR(H38)+5,MONTH(H38),DAY(H38))","v":"2024-12-31"},{"$f":"DATE(YEAR(H38)+5,MONTH(H38),DAY(H38))","v":"2024-12-31"},"2019 Tier 3 HD Class 2b FTP Credits earned using Primary or Alternative phase-in approach; see other spreadsheet. "]
["2020-05-01",2019,"HD Class 3",{"$f":"IF(AND(B39=2016,C39=\"HD Class 2b\"),\"0.333\", IF(AND(B39=2017,C39=\"HD Class 2b\"),\"0.310\", IF(AND(B39=2018,C39=\"HD Class 2b\"),\"0.278\", IF(AND(B39=2019,C39=\"HD Class 2b\"),\"0.253\", IF(AND(B39=2020,C39=\"HD Class 2b\"),\"0.228\", IF(AND(B39=2021,C39=\"HD Class 2b\"),\"0.203\", IF(AND(B39>2021,C39=\"HD Class 2b\"),\"0.178\",IF(AND(B39=2016,C39=\"HD Class 3\"),\"0.548\", IF(AND(B39=2017,C39=\"HD Class 3\"),\"0.508\", IF(AND(B39=2018,C39=\"HD Class 3\"),\"0.451\", IF(AND(B39=2019,C39=\"HD Class 3\"),\"0.400\", IF(AND(B39=2020,C39=\"HD Class 3\"),\"0.349\", IF(AND(B39=2021,C39=\"HD Class 3\"),\"0.298\", IF(AND(B39>2021,C39=\"HD Class 3\"),\"0.247\", ERROR))))))))))))))","v":"0.400"},{"$f":"HDV!N10","v":0.42099999999999999},{"$f":"HDV!M10","v":340000},{"$f":"IF(E39= \"\", \"ERROR\", astm((astm(D39,3)-(astm(E39,3)))*F39,0))","v":-7140},"2019-12-31",{"$f":"DATE(YEAR(H39)+5,MONTH(H39),DAY(H39))","v":"2024-12-31"},{"$f":"DATE(YEAR(H39)+5,MONTH(H39),DAY(H39))","v":"2024-12-31"},"2019 Tier 3 HD Class 3 FTP Credits earned using Primary or Alternative phase-in approach; see other spreadsheet. "]
["2020-03-04",2019,"Transfer","-","-","-",1000,"2019-12-31","-","-","Purchased 1,000 2019 HDV FTP Credits  to Manufacturer B (earned on 12/31/2019)."]
[null,null,null,"Total 2019 Credits Remaining:",null,null,{"$f":"SUM(G38:G40)","v":-519}]
[]
[null,null,"Grand Total 2016-2019 Credits Remaining:",null,null,null,{"$f":"G36+G41","v":-573},null,null,null,"[Note: D.Good revised this formula on 8/24/2018]"]

{"sheet":"LDV LDT Cold NMHC","index":2,"n_rows":485,"n_cols":15,"rows_kept":485,"cut":false,"hidden":false,"merged":[[482,4,482,12],[483,4,483,12],[484,4,484,12],[473,4,473,12],[474,4,474,12],[475,4,475,12],[476,4,476,12],[477,4,477,12],[478,4,478,12],[479,4,479,12],[480,4,480,12],[481,4,481,12],[446,4,446,12],[447,4,447,12],[448,4,448,12],[425,4,425,12],[426,4,426,12],[427,4,427,12],[16,4,16,12],[17,4,17,12],[18,4,18,12],[19,4,19,12],[20,4,20,12],[21,4,21,12],[22,4,22,12],[23,4,23,12],[24,4,24,12],[437,4,437,12],[438,4,438,12],[439,4,439,12],[440,4,440,12],[441,4,441,12],[442,4,442,12],[443,4,443,12],[444,4,444,12],[445,4,445,12],[468,4,468,12],[469,4,469,12],[470,4,470,12],[471,4,471,12],[472,4,472,12],[449,4,449,12],[450,4,450,12],[451,4,451,12],[452,4,452,12],[453,4,453,12],[454,4,454,12],[455,4,455,12],[456,4,456,12],[457,4,457,12],[458,4,458,12],[459,4,459,12],[460,4,460,12],[461,4,461,12],[462,4,462,12],[463,4,463,12],[464,4,464,12],[465,4,465,12],[466,4,466,12],[467,4,467,12],[428,4,428,12],[429,4,429,12],[430,4,430,12],[431,4,431,12],[432,4,432,12],[433,4,433,12],[434,4,434,12],[435,4,435,12],[436,4,436,12],[422,4,422,12],[423,4,423,12],[424,4,424,12],[401,4,401,12],[402,4,402,12],[403,4,403,12],[404,4,404,12],[405,4,405,12],[406,4,406,12],[407,4,407,12],[408,4,408,12],[409,4,409,12],[410,4,410,12],[411,4,411,12],[412,4,412,12],[413,4,413,12],[414,4,414,12],[415,4,415,12],[416,4,416,12],[417,4,417,12],[418,4,418,12],[419,4,419,12],[420,4,420,12],[421,4,421,12],[398,4,398,12],[399,4,399,12],[400,4,400,12],[377,4,377,12],[378,4,378,12],[379,4,379,12],[380,4,380,12],[381,4,381,12],[382,4,382,12],[383,4,383,12],[384,4,384,12],[385,4,385,12],[386,4,386,12],[387,4,387,12],[388,4,388,12],[389,4,389,12],[390,4,390,12],[391,4,391,12],[392,4,392,12],[393,4,393,12],[394,4,394,12],[395,4,395,12],[396,4,396,12],[397,4,397,12],[374,4,374,12],[375,4,375,12],[376,4,376,12],[353,4,353,12],[354,4,354,12],[355,4,355,12],[356,4,356,12],[357,4,357,12],[358,4,358,12],[359,4,359,12],[360,4,360,12],[361,4,361,12],[362,4,362,12],[363,4,363,12],[364,4,364,12],[365,4,365,12],[366,4,366,12],[367,4,367,12],[368,4,368,12],[369,4,369,12],[370,4,370,12],[371,4,371,12],[372,4,372,12],[373,4,373,12],[350,4,350,12],[351,4,351,12],[352,4,352,12],[329,4,329,12],[330,4,330,12],[331,4,331,12],[332,4,332,12],[333,4,333,12],[334,4,334,12],[335,4,335,12],[336,4,336,12],[337,4,337,12],[338,4,338,12],[339,4,339,12],[340,4,340,12],[341,4,341,12],[342,4,342,12],[343,4,343,12],[344,4,344,12],[345,4,345,12],[346,4,346,12],[347,4,347,12],[348,4,348,12],[349,4,349,12],[326,4,326,12],[327,4,327,12],[328,4,328,12],[305,4,305,12],[306,4,306,12],[307,4,307,12],[308,4,308,12],[309,4,309,12],[310,4,310,12],[311,4,311,12],[312,4,312,12],[313,4,313,12],[314,4,314,12],[315,4,315,12],[316,4,316,12],[317,4,317,12],[318,4,318,12],[319,4,319,12],[320,4,320,12],[321,4,321,12],[322,4,322,12],[323,4,323,12],[324,4,324,12],[325,4,325,12],[302,4,302,12],[303,4,303,12],[304,4,304,12],[281,4,281,12],[282,4,282,12],[283,4,283,12],[284,4,284,12],[285,4,285,12],[286,4,286,12],[287,4,287,12],[288,4,288,12],[289,4,289,12],[290,4,290,12],[291,4,291,12],[292,4,292,12],[293,4,293,12],[294,4,294,12],[295,4,295,12],[296,4,296,12],[297,4,297,12],[298,4,298,12],[299,4,299,12],[300,4,300,12],[301,4,301,12],[278,4,278,12],[279,4,279,12],[280,4,280,12],[257,4,257,12],[258,4,258,12],[259,4,259,12],[260,4,260,12],[261,4,261,12],[262,4,262,12],[263,4,263,12],[264,4,264,12],[265,4,265,12],[266,4,266,12],[267,4,267,12],[268,4,268,12],[269,4,269,12],[270,4,270,12],[271,4,271,12],[272,4,272,12],[273,4,273,12],[274,4,274,12],[275,4,275,12],[276,4,276,12],[277,4,277,12],[254,4,254,12],[255,4,255,12],[256,4,256,12],[233,4,233,12],[234,4,234,12],[235,4,235,12],[236,4,236,12],[237,4,237,12],[238,4,238,12],[239,4,239,12],[240,4,240,12],[241,4,241,12],[242,4,242,12],[243,4,243,12],[244,4,244,12],[245,4,245,12],[246,4,246,12],[247,4,247,12],[248,4,248,12],[249,4,249,12],[250,4,250,12],[251,4,251,12],[252,4,252,12],[253,4,253,12],[230,4,230,12],[231,4,231,12],[232,4,232,12],[209,4,209,12],[210,4,210,12],[211,4,211,12],[212,4,212,12],[213,4,213,12],[214,4,214,12],[215,4,215,12],[216,4,216,12],[217,4,217,12],[218,4,218,12],[219,4,219,12],[220,4,220,12],[221,4,221,12],[222,4,222,12],[223,4,223,12],[224,4,224,12],[225,4,225,12],[226,4,226,12],[227,4,227,12],[228,4,228,12],[229,4,229,12],[206,4,206,12],[207,4,207,12],[208,4,208,12],[185,4,185,12],[186,4,186,12],[187,4,187,12],[188,4,188,12],[189,4,189,12],[190,4,190,12],[191,4,191,12],[192,4,192,12],[193,4,193,12],[194,4,194,12],[195,4,195,12],[196,4,196,12],[197,4,197,12],[198,4,198,12],[199,4,199,12],[200,4,200,12],[201,4,201,12],[202,4,202,12],[203,4,203,12],[204,4,204,12],[205,4,205,12],[182,4,182,12],[183,4,183,12],[184,4,184,12],[161,4,161,12],[162,4,162,12],[163,4,163,12],[164,4,164,12],[165,4,165,12],[166,4,166,12],[167,4,167,12],[168,4,168,12],[169,4,169,12],[170,4,170,12],[171,4,171,12],[172,4,172,12],[173,4,173,12],[174,4,174,12],[175,4,175,12],[176,4,176,12],[177,4,177,12],[178,4,178,12],[179,4,179,12],[180,4,180,12],[181,4,181,12],[158,4,158,12],[159,4,159,12],[160,4,160,12],[137,4,137,12],[138,4,138,12],[139,4,139,12],[140,4,140,12],[141,4,141,12],[142,4,142,12],[143,4,143,12],[144,4,144,12],[145,4,145,12],[146,4,146,12],[147,4,147,12],[148,4,148,12],[149,4,149,12],[150,4,150,12],[151,4,151,12],[152,4,152,12],[153,4,153,12],[154,4,154,12],[155,4,155,12],[156,4,156,12],[157,4,157,12],[134,4,134,12],[135,4,135,12],[136,4,136,12],[113,4,113,12],[114,4,114,12],[115,4,115,12],[116,4,116,12],[117,4,117,12],[118,4,118,12],[119,4,119,12],[120,4,120,12],[121,4,121,12],[122,4,122,12],[123,4,123,12],[124,4,124,12],[125,4,125,12],[126,4,126,12],[127,4,127,12],[128,4,128,12],[129,4,129,12],[130,4,130,12],[131,4,131,12],[132,4,132,12],[133,4,133,12],[110,4,110,12],[111,4,111,12],[112,4,112,12],[89,4,89,12],[90,4,90,12],[91,4,91,12],[92,4,92,12],[93,4,93,12],[94,4,94,12],[95,4,95,12],[96,4,96,12],[97,4,97,12],[98,4,98,12],[99,4,99,12],[100,4,100,12],[101,4,101,12],[102,4,102,12],[103,4,103,12],[104,4,104,12],[105,4,105,12],[106,4,106,12],[107,4,107,12],[108,4,108,12],[109,4,109,12],[86,4,86,12],[87,4,87,12],[88,4,88,12],[65,4,65,12],[66,4,66,12],[67,4,67,12],[68,4,68,12],[69,4,69,12],[70,4,70,12],[71,4,71,12],[72,4,72,12],[73,4,73,12],[74,4,74,12],[75,4,75,12],[76,4,76,12],[77,4,77,12],[78,4,78,12],[79,4,79,12],[80,4,80,12],[81,4,81,12],[82,4,82,12],[83,4,83,12],[84,4,84,12],[85,4,85,12],[64,4,64,12],[41,4,41,12],[42,4,42,12],[43,4,43,12],[44,4,44,12],[45,4,45,12],[46,4,46,12],[47,4,47,12],[48,4,48,12],[49,4,49,12],[50,4,50,12],[51,4,51,12],[52,4,52,12],[53,4,53,12],[54,4,54,12],[55,4,55,12],[56,4,56,12],[57,4,57,12],[58,4,58,12],[59,4,59,12],[60,4,60,12],[61,4,61,12],[26,4,26,12],[7,0,7,1],[9,0,9,2],[10,0,10,1],[11,0,11,1],[12,0,12,1],[14,4,15,12],[62,4,62,12],[63,4,63,12],[11,12,12,14],[1,1,1,7],[0,0,0,14],[1,9,1,12],[4,0,4,14],[3,0,3,14],[38,4,38,12],[39,4,39,12],[40,4,40,12],[27,4,27,12],[28,4,28,12],[14,0,15,0],[14,14,15,14],[6,4,6,8],[6,10,6,14],[29,4,29,12],[30,4,30,12],[31,4,31,12],[32,4,32,12],[33,4,33,12],[34,4,34,12],[35,4,35,12],[36,4,36,12],[37,4,37,12],[25,4,25,12]]}
["Example Template - Light-Duty Vehicle - Cold NMHC Fleet Average Calculations for One Model Year"]
[null,"Manufacturer: ___________________________",null,null,null,null,null,null,null,"Date: _____________"]
[]
["Purpose and Scope of this Guidance Document          "]
["    This document was prepared by EPA's Office of Transportation and Air Quality (OTAQ).  It is one of several intended to aid regulated parties in reporting Tier 3 and Cold NMHC Averaging, Banking and Trading (AB&T) information and calculating AB&T fleet average credits for light-duty vehicles and certain heavy-duty class 2b and 3 vehicles, ref. 40 CFR 86.1862-04(c).  It contains EPA's recommended format for manufacturers to report to EPA their end-of-year Tier 3 AB&T calculations, credits and other information with respect to the implementation of the AB&T provisions of the EPA Tier 3 final rule (79 FR 23414, April 28, 2014) as amended (80 FR 9078, February 19, 2015; 80 FR 26463, May 8, 2015);  ref. 40 CFR Parts 85, 86, 600, 1065, 1066.  Use of this document is purely optional.\n       This document does not in any way alter or waive the requirements in EPA regulations.  Although the calculations and formulas provided in this document are intended to assist manufacturers in the implementation of EPA regulations, this document does not establish or change the legal rights or obligations of manufacturers or others in complying with EPA regulations, including 40 CFR 86.1862-04(c). If an error or other discrepancy is found in this document, including the calculation formulas, please contact your EPA certification team member or Dave Good at (734) 214-4450 or by email at good.david@epa.gov.  The regulations take precedence."]
[]
["Instructions",null,null,null,"LDV & LLDT Averaging Set",null,null,null,null,null,"HLDT & MDPV Averaging Set"]
["Select Model Year:",null,2019,null,"Emission Standard","Total Production\n(Nationwide)","Fleet average compliance value (rounded to nearest 0.1 gpm)","Fleet average standard","Credits or Debits",null,"Emission Standard","Total Production\n(Nationwide)","Fleet average compliance value (rounded to nearest 0.1 gpm)","Fleet average standard","Credits or Debits"]
[null,null,null,null,null,null,"g/mi","g/mi","g/mi",null,null,null,"g/mi","g/mi","g/mi"]
["Enter \"X\" if all vehicles are certified at or below fleet average standard and you omit credit calculations per 40 CFR 86.18160-17(f):",null,null,null,"Cold FTP (NMHC)",{"$f":"SUMIF(B17:B485,\"LDV/LLDT\",D17:D485)","v":193840},{"$f":"IF(C12=\"X\", \"All vehicles certified at or below fleet average standard\", astm(SUMIF(B17:B485,\"LDV/LLDT\",O17:O485),1))","v":0.2},0.3,{"$f":"IF(C12=\"X\", 0,astm(((H10-G10)*$F$10),0))","v":19384},null,"Cold FTP (NMHC)",{"$f":"SUMIF(B17:B485,\"HLDT/MDPV\",D17:D485)","v":340000},{"$f":"IF(C13=\"X\", \"All vehicles certified at or below fleet average standard\",astm(SUMIF(B17:B485,\"HLDT/MDPV\",O17:O485),1))","v":0.5},0.5,{"$f":"IF(C13=\"X\", 0,astm(((N10-M10)*$L$10),0))","v":0}]
["Averaging Set",null,"Check if applicable:"]
["LDV & LLDT:",null,null,null,null,null,null,null,null,null,null,null,"OMB Control Number 2060-0104\nExpires 3-31-2020"]
["HLDT & MDPV:"]
[]
["Test Group\n\n(gasoline fueled test groups only)","Class of Test Group (and Class of Averaging Set)","Cold NMHC Standard or FEL (in increments of 0.1 gpm)","Production\n(50-States plus U.S. territories)","Comments",null,null,null,null,null,null,null,null,"Cold NMHC\nProduction\nx (FEL or Standard)","Cold NMHC\n Intermediate Calculation\n\n[(Prod'n x Cold NMHC FEL) / Total Prod'n]"]
[null,"LDV/LLDT or \nHLDT/MDPV","g/mi","# of Units",null,null,null,null,null,null,null,null,null,"g/mi"]
["A","LDV/LLDT",0.3,39458,null,null,null,null,null,null,null,null,null,{"$f":"  IF(AND(A17=\"\",D17=\"\"),\"\", IF(AND(A17=\"\",D17<>\"\"), \"FIX TEST GRP\", IF(B17=\"\",\"FIX CLASS\",IF(D17=\"\",\"FIX PROD'N\",astm(C17,1)*D17))))","v":11837.4},{"$f":"IF(A17=\"\",\"\",  IFERROR(N17/(IF(B17=\"LDV/LLDT\",$F$10,$L$10)),\"\"))","v":6.1067891044160133E-2}]
["B","LDV/LLDT",0.3,20382,null,null,null,null,null,null,null,null,null,6114.5999999999995,3.1544572843582336E-2]
["C","LDV/LLDT",0.2,45000,null,null,null,null,null,null,null,null,null,9000,4.643004539826661E-2]
["D","LDV/LLDT",0.2,79000,null,null,null,null,null,null,null,null,null,15800,8.1510524143623614E-2]
["E","LDV/LLDT",0.4,10000,null,null,null,null,null,null,null,null,null,4000,2.0635575732562937E-2]
["F","HLDT/MDPV",0.5,90000,null,null,null,null,null,null,null,null,null,45000,0.13235294117647059]
["G","HLDT/MDPV",0.5,120000,null,null,null,null,null,null,null,null,null,60000,0.17647058823529413]
["H","HLDT/MDPV",0.7,90000,null,null,null,null,null,null,null,null,null,62999.999999999993,0.1852941176470588]
["I","HLDT/MDPV",0.3,40000,null,null,null,null,null,null,null,null,null,12000,3.5294117647058823E-2]
[null,null,".",null,null,null,null,null,null,null,null,null,null,"",""]
[null,null,null,null,null,null,null,null,null,null,null,null,null,"",""]
[null,null,null,null,null,null,null,null,null,null,null,null,null,"",""]
[null,null,null,null,null,null,null,null,null,null,null,null,null,"",""]
[null,null,null,null,null,null,null,null,null,null,null,null,null,"",""]
[null,null,null,null,null,null,null,null,null,null,null,null,null,"",""]
[null,null,null,null,null,null,null,null,null,null,null,null,null,"",""]
[null,null,null,null,null,null,null,null,null,null,null,null,null,"",""]
[null,null,null,null,null,null,null,null,null,null,null,null,null,"",""]
[null,null,null,null,null,null,null,null,null,null,null,null,null,"",""]
[null,null,null,null,null,null,null,null,null,null,null,null,null,"",""]
[null,null,null,null,null,null,null,null,null,null,null,null,null,"",""]
[null,null,null,null,null,null,null,null,null,null,null,null,null,"",""]
[null,null,null,null,null,null,null,null,null,null,null,null,null,"",""]
[null,null,null,null,null,null,null,null,null,null,null,null,null,"",""]
[null,null,null,null,null,null,null,null,null,null,null,null,null,"",""]
[null,null,null,null,null,null,null,null,null,null,null,null,null,"",""]
[null,null,null,null,null,null,null,null,null,null,null,null,null,"",""]
[null,null,null,null,null,null,null,null,null,null,null,null,null,"",""]
[null,null,null,null,null,null,null,null,null,null,null,null,null,"",""]
[null,null,null,null,null,null,null,null,null,null,null,null,null,"",""]
[null,null,null,null,null,null,null,null,null,null,null,null,null,"",""]
[null,null,null,null,null,null,null,null,null,null,null,null,null,"",""]
[null,null,null,null,null,null,null,null,null,null,null,null,null,"",""]
[null,null,null,null,null,null,null,null,null,null,null,null,null,"",""]
[null,null,null,null,null,null,null,null,null,null,null,null,null,"",""]
[null,null,null,null,null,null,null,null,null,null,null,null,null,"",""]
[null,null,null,null,null,null,null,null,null,null,null,null,null,"",""]
[null,null,null,null,null,null,null,null,null,null,null,null,null,"",""]
[null,null,null,null,null,null,null,null,null,null,null,null,null,"",""]
[null,null,null,null,null,null,null,null,null,null,null,null,null,"",""]
[null,null,null,null,null,null,null,null,null,null,null,null,null,"",""]
[null,null,null,null,null,null,null,null,null,null,null,null,null,"",""]
[null,null,null,null,null,null,null,null,null,null,null,null,null,"",""]
[null,null,null,null,null,null,null,null,null,null,null,null,null,"",""]
[null,null,null,null,null,null,null,null,null,null,null,null,null,"",""]
[null,null,null,null,null,null,null,null,null,null,null,null,null,"",""]
[null,null,null,null,null,null,null,null,null,null,null,null,null,"",""]
[null,null,null,null,null,null,null,null,null,null,null,null,null,"",""]
[null,null,null,null,null,null,null,null,null,null,null,null,null,"",""]
[null,null,null,null,null,null,null,null,null,null,null,null,null,"",""]
[null,null,null,null,null,null,null,null,null,null,null,null,null,"",""]
[null,null,null,null,null,null,null,null,null,null,null,null,null,"",""]
[null,null,null,null,null,null,null,null,null,null,null,null,null,"",""]
[null,null,null,null,null,null,null,null,null,null,null,null,null,"",""]
[null,null,null,null,null,null,null,null,null,null,null,null,null,"",""]
[null,null,null,null,null,null,null,null,null,null,null,null,null,"",""]
[null,null,null,null,null,null,null,null,null,null,null,null,null,"",""]
[null,null,null,null,null,null,null,null,null,null,null,null,null,"",""]
[null,null,null,null,null,null,null,null,null,null,null,null,null,"",""]
[null,null,null,null,null,null,null,null,null,null,null,null,null,"",""]
[null,null,null,null,null,null,null,null,null,null,null,null,null,"",""]
[null,null,null,null,null,null,null,null,null,null,null,null,null,"",""]
[null,null,null,null,null,null,null,null,null,null,null,null,null,"",""]
[null,null,null,null,null,null,null,null,null,null,null,null,null,"",""]
[null,null,null,null,null,null,null,null,null,null,null,null,null,{"$f":"  IF(AND(A81=\"\",D81=\"\"),\"\", IF(AND(A81=\"\",D81<>\"\"), \"FIX TEST GRP\", IF(B81=\"\",\"FIX CLASS\",IF(D81=\"\",\"FIX PROD'N\",astm(C81,1)*D81))))","v":""},{"$f":"IF(A81=\"\",\"\",  IFERROR(N81/(IF(B81=\"LDV/LLDT\",$F$10,$L$10)),\"\"))","v":""}]
[null,null,null,null,null,null,null,null,null,null,null,null,null,"",""]
[null,null,null,null,null,null,null,null,null,null,null,null,null,"",""]
[null,null,null,null,null,null,null,null,null,null,null,null,null,"",""]
[null,null,null,null,null,null,null,null,null,null,null,null,null,"",""]
[null,null,null,null,null,null,null,null,null,null,null,null,null,"",""]
[null,null,null,null,null,null,null,null,null,null,null,null,null,"",""]
[null,null,null,null,null,null,null,null,null,null,null,null,null,"",""]
[null,null,null,null,null,null,null,null,null,null,null,null,null,"",""]
[null,null,null,null,null,null,null,null,null,null,null,null,null,"",""]
[null,null,null,null,null,null,null,null,null,null,null,null,null,"",""]
[null,null,null,null,null,null,null,null,null,null,null,null,null,"",""]
[null,null,null,null,null,null,null,null,null,null,null,null,null,"",""]
[null,null,null,null,null,null,null,null,null,null,null,null,null,"",""]
[null,null,null,null,null,null,null,null,null,null,null,null,null,"",""]
[null,null,null,null,null,null,null,null,null,null,null,null,null,"",""]
[null,null,null,null,null,null,null,null,null,null,null,null,null,"",""]
[null,null,null,null,null,null,null,null,null,null,null,null,null,"",""]
[null,null,null,null,null,null,null,null,null,null,null,null,null,"",""]
[null,null,null,null,null,null,null,null,null,null,null,null,null,"",""]
[null,null,null,null,null,null,null,null,null,null,null,null,null,"",""]
[null,null,null,null,null,null,null,null,null,null,null,null,null,"",""]
[null,null,null,null,null,null,null,null,null,null,null,null,null,"",""]
[null,null,null,null,null,null,null,null,null,null,null,null,null,"",""]
[null,null,null,null,null,null,null,null,null,null,null,null,null,"",""]
[null,null,null,null,null,null,null,null,null,null,null,null,null,"",""]
[null,null,null,null,null,null,null,null,null,null,null,null,null,"",""]
[null,null,null,null,null,null,null,null,null,null,null,null,null,"",""]
[null,null,null,null,null,null,null,null,null,null,null,null,null,"",""]
[null,null,null,null,null,null,null,null,null,null,null,null,null,"",""]
[null,null,null,null,null,null,null,null,null,null,null,null,null,"",""]
[null,null,null,null,null,null,null,null,null,null,null,null,null,"",""]
[null,null,null,null,null,null,null,null,null,null,null,null,null,"",""]
[null,null,null,null,null,null,null,null,null,null,null,null,null,"",""]
[null,null,null,null,null,null,null,null,null,null,null,null,null,"",""]
[null,null,null,null,null,null,null,null,null,null,null,null,null,"",""]
[null,null,null,null,null,null,null,null,null,null,null,null,null,"",""]
[null,null,null,null,null,null,null,null,null,null,null,null,null,"",""]
[null,null,null,null,null,null,null,null,null,null,null,null,null,"",""]
[null,null,null,null,null,null,null,null,null,null,null,null,null,"",""]
[null,null,null,null,null,null,null,null,null,null,null,null,null,"",""]
[null,null,null,null,null,null,null,null,null,null,null,null,null,"",""]
[null,null,null,null,null,null,null,null,null,null,null,null,null,"",""]
[null,null,null,null,null,null,null,null,null,null,null,null,null,"",""]
[null,null,null,null,null,null,null,null,null,null,null,null,null,"",""]
[null,null,null,null,null,null,null,null,null,null,null,null,null,"",""]
[null,null,null,null,null,null,null,null,null,null,null,null,null,"",""]
[null,null,null,null,null,null,null,null,null,null,null,null,null,"",""]
[null,null,null,null,null,null,null,null,null,null,null,null,null,"",""]
[null,null,null,null,null,null,null,null,null,null,null,null,null,"",""]
[null,null,null,null,null,null,null,null,null,null,null,null,null,"",""]
[null,null,null,null,null,null,null,null,null,null,null,null,null,"",""]
[null,null,null,null,null,null,null,null,null,null,null,null,null,"",""]
[null,null,null,null,null,null,null,null,null,null,null,null,null,"",""]
[null,null,null,null,null,null,null,null,null,null,null,null,null,"",""]
[null,null,null,null,null,null,null,null,null,null,null,null,null,"",""]
[null,null,null,null,null,null,null,null,null,null,null,null,null,"",""]
[null,null,null,null,null,null,null,null,null,null,null,null,null,"",""]
[null,null,null,null,null,null,null,null,null,null,null,null,null,"",""]
[null,null,null,null,null,null,null,null,null,null,null,null,null,"",""]
[null,null,null,null,null,null,null,null,null,null,null,null,null,"",""]
[null,null,null,null,null,null,null,null,null,null,null,null,null,"",""]
[null,null,null,null,null,null,null,null,null,null,null,null,null,"",""]
[null,null,null,null,null,null,null,null,null,null,null,null,null,"",""]
[null,null,null,null,null,null,null,null,null,null,null,null,null,{"$f":"  IF(AND(A145=\"\",D145=\"\"),\"\", IF(AND(A145=\"\",D145<>\"\"), \"FIX TEST GRP\", IF(B145=\"\",\"FIX CLASS\",IF(D145=\"\",\"FIX PROD'N\",astm(C145,1)*D145))))","v":""},{"$f":"IF(A145=\"\",\"\",  IFERROR(N145/(IF(B145=\"LDV/LLDT\",$F$10,$L$10)),\"\"))","v":""}]
[null,null,null,null,null,null,null,null,null,null,null,null,null,"",""]
[null,null,null,null,null,null,null,null,null,null,null,null,null,"",""]
[null,null,null,null,null,null,null,null,null,null,null,null,null,"",""]
[null,null,null,null,null,null,null,null,null,null,null,null,null,"",""]
[null,null,null,null,null,null,null,null,null,null,null,null,null,"",""]
[null,null,null,null,null,null,null,null,null,null,null,null,null,"",""]
[null,null,null,null,null,null,null,null,null,null,null,null,null,"",""]
[null,null,null,null,null,null,null,null,null,null,null,null,null,"",""]
[null,null,null,null,null,null,null,null,null,null,null,null,null,"",""]
[null,null,null,null,null,null,null,null,null,null,null,null,null,"",""]
[null,null,null,null,null,null,null,null,null,null,null,null,null,"",""]
[null,null,null,null,null,null,null,null,null,null,null,null,null,"",""]
[null,null,null,null,null,null,null,null,null,null,null,null,null,"",""]
[null,null,null,null,null,null,null,null,null,null,null,null,null,"",""]
[null,null,null,null,null,null,null,null,null,null,null,null,null,"",""]
[null,null,null,null,null,null,null,null,null,null,null,null,null,"",""]
[null,null,null,null,null,null,null,null,null,null,null,null,null,"",""]
[null,null,null,null,null,null,null,null,null,null,null,null,null,"",""]
[null,null,null,null,null,null,null,null,null,null,null,null,null,"",""]
[null,null,null,null,null,null,null,null,null,null,null,null,null,"",""]
[null,null,null,null,null,null,null,null,null,null,null,null,null,"",""]
[null,null,null,null,null,null,null,null,null,null,null,null,null,"",""]
[null,null,null,null,null,null,null,null,null,null,null,null,null,"",""]
[null,null,null,null,null,null,null,null,null,null,null,null,null,"",""]
[null,null,null,null,null,null,null,null,null,null,null,null,null,"",""]
[null,null,null,null,null,null,null,null,null,null,null,null,null,"",""]
[null,null,null,null,null,null,null,null,null,null,null,null,null,"",""]
[null,null,null,null,null,null,null,null,null,null,null,null,null,"",""]
[null,null,null,null,null,null,null,null,null,null,null,null,null,"",""]
[null,null,null,null,null,null,null,null,null,null,null,null,null,"",""]
[null,null,null,null,null,null,null,null,null,null,null,null,null,"",""]
[null,null,null,null,null,null,null,null,null,null,null,null,null,"",""]
[null,null,null,null,null,null,null,null,null,null,null,null,null,"",""]
[null,null,null,null,null,null,null,null,null,null,null,null,null,"",""]
[null,null,null,null,null,null,null,null,null,null,null,null,null,"",""]
[null,null,null,null,null,null,null,null,null,null,null,null,null,"",""]
[null,null,null,null,null,null,null,null,null,null,null,null,null,"",""]
[null,null,null,null,null,null,null,null,null,null,null,null,null,"",""]
[null,null,null,null,null,null,null,null,null,null,null,null,null,"",""]
[null,null,null,null,null,null,null,null,null,null,null,null,null,"",""]
[null,null,null,null,null,null,null,null,null,null,null,null,null,"",""]
[null,null,null,null,null,null,null,null,null,null,null,null,null,"",""]
[null,null,null,null,null,null,null,null,null,null,null,null,null,"",""]
[null,null,null,null,null,null,null,null,null,null,null,null,null,"",""]
[null,null,null,null,null,null,null,null,null,null,null,null,null,"",""]
[null,null,null,null,null,null,null,null,null,null,null,null,null,"",""]
[null,null,null,null,null,null,null,null,null,null,null,null,null,"",""]
[null,null,null,null,null,null,null,null,null,null,null,null,null,"",""]
[null,null,null,null,null,null,null,null,null,null,null,null,null,"",""]
[null,null,null,null,null,null,null,null,null,null,null,null,null,"",""]
[null,null,null,null,null,null,null,null,null,null,null,null,null,"",""]
[null,null,null,null,null,null,null,null,null,null,null,null,null,"",""]
[null,null,null,null,null,null,null,null,null,null,null,null,null,"",""]
[null,null,null,null,null,null,null,null,null,null,null,null,null,"",""]
[null,null,null,null,null,null,null,null,null,null,null,null,null,"",""]
[null,null,null,null,null,null,null,null,null,null,null,null,null,"",""]
[null,null,null,null,null,null,null,null,null,null,null,null,null,"",""]
[null,null,null,null,null,null,null,null,null,null,null,null,null,"",""]
[null,null,null,null,null,null,null,null,null,null,null,null,null,"",""]
[null,null,null,null,null,null,null,null,null,null,null,null,null,"",""]
[null,null,null,null,null,null,null,null,null,null,null,null,null,"",""]
[null,null,null,null,null,null,null,null,null,null,null,null,null,"",""]
[null,null,null,null,null,null,null,null,null,null,null,null,null,"",""]
[null,null,null,null,null,null,null,null,null,null,null,null,null,{"$f":"  IF(AND(A209=\"\",D209=\"\"),\"\", IF(AND(A209=\"\",D209<>\"\"), \"FIX TEST GRP\", IF(B209=\"\",\"FIX CLASS\",IF(D209=\"\",\"FIX PROD'N\",astm(C209,1)*D209))))","v":""},{"$f":"IF(A209=\"\",\"\",  IFERROR(N209/(IF(B209=\"LDV/LLDT\",$F$10,$L$10)),\"\"))","v":""}]
[null,null,null,null,null,null,null,null,null,null,null,null,null,"",""]
[null,null,null,null,null,null,null,null,null,null,null,null,null,"",""]
[null,null,null,null,null,null,null,null,null,null,null,null,null,"",""]
[null,null,null,null,null,null,null,null,null,null,null,null,null,"",""]
[null,null,null,null,null,null,null,null,null,null,null,null,null,"",""]
[null,null,null,null,null,null,null,null,null,null,null,null,null,"",""]
[null,null,null,null,null,null,null,null,null,null,null,null,null,"",""]
[null,null,null,null,null,null,null,null,null,null,null,null,null,"",""]
[null,null,null,null,null,null,null,null,null,null,null,null,null,"",""]
[null,null,null,null,null,null,null,null,null,null,null,null,null,"",""]
[null,null,null,null,null,null,null,null,null,null,null,null,null,"",""]
[null,null,null,null,null,null,null,null,null,null,null,null,null,"",""]
[null,null,null,null,null,null,null,null,null,null,null,null,null,"",""]
[null,null,null,null,null,null,null,null,null,null,null,null,null,"",""]
[null,null,null,null,null,null,null,null,null,null,null,null,null,"",""]
[null,null,null,null,null,null,null,null,null,null,null,null,null,"",""]
[null,null,null,null,null,null,null,null,null,null,null,null,null,"",""]
[null,null,null,null,null,null,null,null,null,null,null,null,null,"",""]
[null,null,null,null,null,null,null,null,null,null,null,null,null,"",""]
[null,null,null,null,null,null,null,null,null,null,null,null,null,"",""]
[null,null,null,null,null,null,null,null,null,null,null,null,null,"",""]
[null,null,null,null,null,null,null,null,null,null,null,null,null,"",""]
[null,null,null,null,null,null,null,null,null,null,null,null,null,"",""]
[null,null,null,null,null,null,null,null,null,null,null,null,null,"",""]
[null,null,null,null,null,null,null,null,null,null,null,null,null,"",""]
[null,null,null,null,null,null,null,null,null,null,null,null,null,"",""]
[null,null,null,null,null,null,null,null,null,null,null,null,null,"",""]
[null,null,null,null,null,null,null,null,null,null,null,null,null,"",""]
[null,null,null,null,null,null,null,null,null,null,null,null,null,"",""]
[null,null,null,null,null,null,null,null,null,null,null,null,null,"",""]
[null,null,null,null,null,null,null,null,null,null,null,null,null,"",""]
[null,null,null,null,null,null,null,null,null,null,null,null,null,"",""]
[null,null,null,null,null,null,null,null,null,null,null,null,null,"",""]
[null,null,null,null,null,null,null,null,null,null,null,null,null,"",""]
[null,null,null,null,null,null,null,null,null,null,null,null,null,"",""]
[null,null,null,null,null,null,null,null,null,null,null,null,null,"",""]
[null,null,null,null,null,null,null,null,null,null,null,null,null,"",""]
[null,null,null,null,null,null,null,null,null,null,null,null,null,"",""]
[null,null,null,null,null,null,null,null,null,null,null,null,null,"",""]
[null,null,null,null,null,null,null,null,null,null,null,null,null,"",""]
[null,null,null,null,null,null,null,null,null,null,null,null,null,"",""]
[null,null,null,null,null,null,null,null,null,null,null,null,null,"",""]
[null,null,null,null,null,null,null,null,null,null,null,null,null,"",""]
[null,null,null,null,null,null,null,null,null,null,null,null,null,"",""]
[null,null,null,null,null,null,null,null,null,null,null,null,null,"",""]
[null,null,null,null,null,null,null,null,null,null,null,null,null,"",""]
[null,null,null,null,null,null,null,null,null,null,null,null,null,"",""]
[null,null,null,null,null,null,null,null,null,null,null,null,null,"",""]
[null,null,null,null,null,null,null,null,null,null,null,null,null,"",""]
[null,null,null,null,null,null,null,null,null,null,null,null,null,"",""]
[null,null,null,null,null,null,null,null,null,null,null,null,null,"",""]
[null,null,null,null,null,null,null,null,null,null,null,null,null,"",""]
[null,null,null,null,null,null,null,null,null,null,null,null,null,"",""]
[null,null,null,null,null,null,null,null,null,null,null,null,null,"",""]
[null,null,null,null,null,null,null,null,null,null,null,null,null,"",""]
[null,null,null,null,null,null,null,null,null,null,null,null,null,"",""]
[null,null,null,null,null,null,null,null,null,null,null,null,null,"",""]
[null,null,null,null,null,null,null,null,null,null,null,null,null,"",""]
[null,null,null,null,null,null,null,null,null,null,null,null,null,"",""]
[null,null,null,null,null,null,null,null,null,null,null,null,null,"",""]
[null,null,null,null,null,null,null,null,null,null,null,null,null,"",""]
[null,null,null,null,null,null,null,null,null,null,null,null,null,"",""]
[null,null,null,null,null,null,null,null,null,null,null,null,null,"",""]
[null,null,null,null,null,null,null,null,null,null,null,null,null,{"$f":"  IF(AND(A273=\"\",D273=\"\"),\"\", IF(AND(A273=\"\",D273<>\"\"), \"FIX TEST GRP\", IF(B273=\"\",\"FIX CLASS\",IF(D273=\"\",\"FIX PROD'N\",astm(C273,1)*D273))))","v":""},{"$f":"IF(A273=\"\",\"\",  IFERROR(N273/(IF(B273=\"LDV/LLDT\",$F$10,$L$10)),\"\"))","v":""}]
[null,null,null,null,null,null,null,null,null,null,null,null,null,"",""]
[null,null,null,null,null,null,null,null,null,null,null,null,null,"",""]
[null,null,null,null,null,null,null,null,null,null,null,null,null,"",""]
[null,null,null,null,null,null,null,null,null,null,null,null,null,"",""]
[null,null,null,null,null,null,null,null,null,null,null,null,null,"",""]
[null,null,null,null,null,null,null,null,null,null,null,null,null,"",""]
[null,null,null,null,null,null,null,null,null,null,null,null,null,"",""]
[null,null,null,null,null,null,null,null,null,null,null,null,null,"",""]
[null,null,null,null,null,null,null,null,null,null,null,null,null,"",""]
[null,null,null,null,null,null,null,null,null,null,null,null,null,"",""]
[null,null,null,null,null,null,null,null,null,null,null,null,null,"",""]
[null,null,null,null,null,null,null,null,null,null,null,null,null,"",""]
[null,null,null,null,null,null,null,null,null,null,null,null,null,"",""]
[null,null,null,null,null,null,null,null,null,null,null,null,null,"",""]
[null,null,null,null,null,null,null,null,null,null,null,null,null,"",""]
[null,null,null,null,null,null,null,null,null,null,null,null,null,"",""]
[null,null,null,null,null,null,null,null,null,null,null,null,null,"",""]
[null,null,null,null,null,null,null,null,null,null,null,null,null,"",""]
[null,null,null,null,null,null,null,null,null,null,null,null,null,"",""]
[null,null,null,null,null,null,null,null,null,null,null,null,null,"",""]
[null,null,null,null,null,null,null,null,null,null,null,null,null,"",""]
[null,null,null,null,null,null,null,null,null,null,null,null,null,"",""]
[null,null,null,null,null,null,null,null,null,null,null,null,null,"",""]
[null,null,null,null,null,null,null,null,null,null,null,null,null,"",""]
[null,null,null,null,null,null,null,null,null,null,null,null,null,"",""]
[null,null,null,null,null,null,null,null,null,null,null,null,null,"",""]
[null,null,null,null,null,null,null,null,null,null,null,null,null,"",""]
[null,null,null,null,null,null,null,null,null,null,null,null,null,"",""]
[null,null,null,null,null,null,null,null,null,null,null,null,null,"",""]
[null,null,null,null,null,null,null,null,null,null,null,null,null,"",""]
[null,null,null,null,null,null,null,null,null,null,null,null,null,"",""]
[null,null,null,null,null,null,null,null,null,null,null,null,null,"",""]
[null,null,null,null,null,null,null,null,null,null,null,null,null,"",""]
[null,null,null,null,null,null,null,null,null,null,null,null,null,"",""]
[null,null,null,null,null,null,null,null,null,null,null,null,null,"",""]
[null,null,null,null,null,null,null,null,null,null,null,null,null,"",""]
[null,null,null,null,null,null,null,null,null,null,null,null,null,"",""]
[null,null,null,null,null,null,null,null,null,null,null,null,null,"",""]
[null,null,null,null,null,null,null,null,null,null,null,null,null,"",""]
[null,null,null,null,null,null,null,null,null,null,null,null,null,"",""]
[null,null,null,null,null,null,null,null,null,null,null,null,null,"",""]
[null,null,null,null,null,null,null,null,null,null,null,null,null,"",""]
[null,null,null,null,null,null,null,null,null,null,null,null,null,"",""]
[null,null,null,null,null,null,null,null,null,null,null,null,null,"",""]
[null,null,null,null,null,null,null,null,null,null,null,null,null,"",""]
[null,null,null,null,null,null,null,null,null,null,null,null,null,"",""]
[null,null,null,null,null,null,null,null,null,null,null,null,null,"",""]
[null,null,null,null,null,null,null,null,null,null,null,null,null,"",""]
[null,null,null,null,null,null,null,null,null,null,null,null,null,"",""]
[null,null,null,null,null,null,null,null,null,null,null,null,null,"",""]
[null,null,null,null,null,null,null,null,null,null,null,null,null,"",""]
[null,null,null,null,null,null,null,null,null,null,null,null,null,"",""]
[null,null,null,null,null,null,null,null,null,null,null,null,null,"",""]
[null,null,null,null,null,null,null,null,null,null,null,null,null,"",""]
[null,null,null,null,null,null,null,null,null,null,null,null,null,"",""]
[null,null,null,null,null,null,null,null,null,null,null,null,null,"",""]
[null,null,null,null,null,null,null,null,null,null,null,null,null,"",""]
[null,null,null,null,null,null,null,null,null,null,null,null,null,"",""]
[null,null,null,null,null,null,null,null,null,null,null,null,null,"",""]
[null,null,null,null,null,null,null,null,null,null,null,null,null,"",""]
[null,null,null,null,null,null,null,null,null,null,null,null,null,"",""]
[null,null,null,null,null,null,null,null,null,null,null,null,null,"",""]
[null,null,null,null,null,null,null,null,null,null,null,null,null,"",""]
[null,null,null,null,null,null,null,null,null,null,null,null,null,{"$f":"  IF(AND(A337=\"\",D337=\"\"),\"\", IF(AND(A337=\"\",D337<>\"\"), \"FIX TEST GRP\", IF(B337=\"\",\"FIX CLASS\",IF(D337=\"\",\"FIX PROD'N\",astm(C337,1)*D337))))","v":""},{"$f":"IF(A337=\"\",\"\",  IFERROR(N337/(IF(B337=\"LDV/LLDT\",$F$10,$L$10)),\"\"))","v":""}]
[null,null,null,null,null,null,null,null,null,null,null,null,null,"",""]
[null,null,null,null,null,null,null,null,null,null,null,null,null,"",""]
[null,null,null,null,null,null,null,null,null,null,null,null,null,"",""]
[null,null,null,null,null,null,null,null,null,null,null,null,null,"",""]
[null,null,null,null,null,null,null,null,null,null,null,null,null,"",""]
[null,null,null,null,null,null,null,null,null,null,null,null,null,"",""]
[null,null,null,null,null,null,null,null,null,null,null,null,null,"",""]
[null,null,null,null,null,null,null,null,null,null,null,null,null,"",""]
[null,null,null,null,null,null,null,null,null,null,null,null,null,"",""]
[null,null,null,null,null,null,null,null,null,null,null,null,null,"",""]
[null,null,null,null,null,null,null,null,null,null,null,null,null,"",""]
[null,null,null,null,null,null,null,null,null,null,null,null,null,"",""]
[null,null,null,null,null,null,null,null,null,null,null,null,null,"",""]
[null,null,null,null,null,null,null,null,null,null,null,null,null,"",""]
[null,null,null,null,null,null,null,null,null,null,null,null,null,"",""]
[null,null,null,null,null,null,null,null,null,null,null,null,null,"",""]
[null,null,null,null,null,null,null,null,null,null,null,null,null,"",""]
[null,null,null,null,null,null,null,null,null,null,null,null,null,"",""]
[null,null,null,null,null,null,null,null,null,null,null,null,null,"",""]
[null,null,null,null,null,null,null,null,null,null,null,null,null,"",""]
[null,null,null,null,null,null,null,null,null,null,null,null,null,"",""]
[null,null,null,null,null,null,null,null,null,null,null,null,null,"",""]
[null,null,null,null,null,null,null,null,null,null,null,null,null,"",""]
[null,null,null,null,null,null,null,null,null,null,null,null,null,"",""]
[null,null,null,null,null,null,null,null,null,null,null,null,null,"",""]
[null,null,null,null,null,null,null,null,null,null,null,null,null,"",""]
[null,null,null,null,null,null,null,null,null,null,null,null,null,"",""]
[null,null,null,null,null,null,null,null,null,null,null,null,null,"",""]
[null,null,null,null,null,null,null,null,null,null,null,null,null,"",""]
[null,null,null,null,null,null,null,null,null,null,null,null,null,"",""]
[null,null,null,null,null,null,null,null,null,null,null,null,null,"",""]
[null,null,null,null,null,null,null,null,null,null,null,null,null,"",""]
[null,null,null,null,null,null,null,null,null,null,null,null,null,"",""]
[null,null,null,null,null,null,null,null,null,null,null,null,null,"",""]
[null,null,null,null,null,null,null,null,null,null,null,null,null,"",""]
[null,null,null,null,null,null,null,null,null,null,null,null,null,"",""]
[null,null,null,null,null,null,null,null,null,null,null,null,null,"",""]
[null,null,null,null,null,null,null,null,null,null,null,null,null,"",""]
[null,null,null,null,null,null,null,null,null,null,null,null,null,"",""]
[null,null,null,null,null,null,null,null,null,null,null,null,null,"",""]
[null,null,null,null,null,null,null,null,null,null,null,null,null,"",""]
[null,null,null,null,null,null,null,null,null,null,null,null,null,"",""]
[null,null,null,null,null,null,null,null,null,null,null,null,null,"",""]
[null,null,null,null,null,null,null,null,null,null,null,null,null,"",""]
[null,null,null,null,null,null,null,null,null,null,null,null,null,"",""]
[null,null,null,null,null,null,null,null,null,null,null,null,null,"",""]
[null,null,null,null,null,null,null,null,null,null,null,null,null,"",""]
[null,null,null,null,null,null,null,null,null,null,null,null,null,"",""]
[null,null,null,null,null,null,null,null,null,null,null,null,null,"",""]
[null,null,null,null,null,null,null,null,null,null,null,null,null,"",""]
[null,null,null,null,null,null,null,null,null,null,null,null,null,"",""]
[null,null,null,null,null,null,null,null,null,null,null,null,null,"",""]
[null,null,null,null,null,null,null,null,null,null,null,null,null,"",""]
[null,null,null,null,null,null,null,null,null,null,null,null,null,"",""]
[null,null,null,null,null,null,null,null,null,null,null,null,null,"",""]
[null,null,null,null,null,null,null,null,null,null,null,null,null,"",""]
[null,null,null,null,null,null,null,null,null,null,null,null,null,"",""]
[null,null,null,null,null,null,null,null,null,null,null,null,null,"",""]
[null,null,null,null,null,null,null,null,null,null,null,null,null,"",""]
[null,null,null,null,null,null,null,null,null,null,null,null,null,"",""]
[null,null,null,null,null,null,null,null,null,null,null,null,null,"",""]
[null,null,null,null,null,null,null,null,null,null,null,null,null,"",""]
[null,null,null,null,null,null,null,null,null,null,null,null,null,"",""]
[null,null,null,null,null,null,null,null,null,null,null,null,null,{"$f":"  IF(AND(A401=\"\",D401=\"\"),\"\", IF(AND(A401=\"\",D401<>\"\"), \"FIX TEST GRP\", IF(B401=\"\",\"FIX CLASS\",IF(D401=\"\",\"FIX PROD'N\",astm(C401,1)*D401))))","v":""},{"$f":"IF(A401=\"\",\"\",  IFERROR(N401/(IF(B401=\"LDV/LLDT\",$F$10,$L$10)),\"\"))","v":""}]
[null,null,null,null,null,null,null,null,null,null,null,null,null,"",""]
[null,null,null,null,null,null,null,null,null,null,null,null,null,"",""]
[null,null,null,null,null,null,null,null,null,null,null,null,null,"",""]
[null,null,null,null,null,null,null,null,null,null,null,null,null,"",""]
[null,null,null,null,null,null,null,null,null,null,null,null,null,"",""]
[null,null,null,null,null,null,null,null,null,null,null,null,null,"",""]
[null,null,null,null,null,null,null,null,null,null,null,null,null,"",""]
[null,null,null,null,null,null,null,null,null,null,null,null,null,"",""]
[null,null,null,null,null,null,null,null,null,null,null,null,null,"",""]
[null,null,null,null,null,null,null,null,null,null,null,null,null,"",""]
[null,null,null,null,null,null,null,null,null,null,null,null,null,"",""]
[null,null,null,null,null,null,null,null,null,null,null,null,null,"",""]
[null,null,null,null,null,null,null,null,null,null,null,null,null,"",""]
[null,null,null,null,null,null,null,null,null,null,null,null,null,"",""]
[null,null,null,null,null,null,null,null,null,null,null,null,null,"",""]
[null,null,null,null,null,null,null,null,null,null,null,null,null,"",""]
[null,null,null,null,null,null,null,null,null,null,null,null,null,"",""]
[null,null,null,null,null,null,null,null,null,null,null,null,null,"",""]
[null,null,null,null,null,null,null,null,null,null,null,null,null,"",""]
[null,null,null,null,null,null,null,null,null,null,null,null,null,"",""]
[null,null,null,null,null,null,null,null,null,null,null,null,null,"",""]
[null,null,null,null,null,null,null,null,null,null,null,null,null,"",""]
[null,null,null,null,null,null,null,null,null,null,null,null,null,"",""]
[null,null,null,null,null,null,null,null,null,null,null,null,null,"",""]
[null,null,null,null,null,null,null,null,null,null,null,null,null,"",""]
[null,null,null,null,null,null,null,null,null,null,null,null,null,"",""]
[null,null,null,null,null,null,null,null,null,null,null,null,null,"",""]
[null,null,null,null,null,null,null,null,null,null,null,null,null,"",""]
[null,null,null,null,null,null,null,null,null,null,null,null,null,"",""]
[null,null,null,null,null,null,null,null,null,null,null,null,null,"",""]
[null,null,null,null,null,null,null,null,null,null,null,null,null,"",""]
[null,null,null,null,null,null,null,null,null,null,null,null,null,"",""]
[null,null,null,null,null,null,null,null,null,null,null,null,null,"",""]
[null,null,null,null,null,null,null,null,null,null,null,null,null,"",""]
[null,null,null,null,null,null,null,null,null,null,null,null,null,"",""]
[null,null,null,null,null,null,null,null,null,null,null,null,null,"",""]
[null,null,null,null,null,null,null,null,null,null,null,null,null,"",""]
[null,null,null,null,null,null,null,null,null,null,null,null,null,"",""]
[null,null,null,null,null,null,null,null,null,null,null,null,null,"",""]
[null,null,null,null,null,null,null,null,null,null,null,null,null,"",""]
[null,null,null,null,null,null,null,null,null,null,null,null,null,"",""]
[null,null,null,null,null,null,null,null,null,null,null,null,null,"",""]
[null,null,null,null,null,null,null,null,null,null,null,null,null,"",""]
[null,null,null,null,null,null,null,null,null,null,null,null,null,"",""]
[null,null,null,null,null,null,null,null,null,null,null,null,null,"",""]
[null,null,null,null,null,null,null,null,null,null,null,null,null,"",""]
[null,null,null,null,null,null,null,null,null,null,null,null,null,"",""]
[null,null,null,null,null,null,null,null,null,null,null,null,null,"",""]
[null,null,null,null,null,null,null,null,null,null,null,null,null,"",""]
[null,null,null,null,null,null,null,null,null,null,null,null,null,"",""]
[null,null,null,null,null,null,null,null,null,null,null,null,null,"",""]
[null,null,null,null,null,null,null,null,null,null,null,null,null,"",""]
[null,null,null,null,null,null,null,null,null,null,null,null,null,"",""]
[null,null,null,null,null,null,null,null,null,null,null,null,null,"",""]
[null,null,null,null,null,null,null,null,null,null,null,null,null,"",""]
[null,null,null,null,null,null,null,null,null,null,null,null,null,"",""]
[null,null,null,null,null,null,null,null,null,null,null,null,null,"",""]
[null,null,null,null,null,null,null,null,null,null,null,null,null,"",""]
[null,null,null,null,null,null,null,null,null,null,null,null,null,"",""]
[null,null,null,null,null,null,null,null,null,null,null,null,null,"",""]
[null,null,null,null,null,null,null,null,null,null,null,null,null,"",""]
[null,null,null,null,null,null,null,null,null,null,null,null,null,"",""]
[null,null,null,null,null,null,null,null,null,null,null,null,null,"",""]
[null,null,null,null,null,null,null,null,null,null,null,null,null,{"$f":"  IF(AND(A465=\"\",D465=\"\"),\"\", IF(AND(A465=\"\",D465<>\"\"), \"FIX TEST GRP\", IF(B465=\"\",\"FIX CLASS\",IF(D465=\"\",\"FIX PROD'N\",astm(C465,1)*D465))))","v":""},{"$f":"IF(A465=\"\",\"\",  IFERROR(N465/(IF(B465=\"LDV/LLDT\",$F$10,$L$10)),\"\"))","v":""}]
[null,null,null,null,null,null,null,null,null,null,null,null,null,"",""]
[null,null,null,null,null,null,null,null,null,null,null,null,null,"",""]
[null,null,null,null,null,null,null,null,null,null,null,null,null,"",""]
[null,null,null,null,null,null,null,null,null,null,null,null,null,"",""]
[null,null,null,null,null,null,null,null,null,null,null,null,null,"",""]
[null,null,null,null,null,null,null,null,null,null,null,null,null,"",""]
[null,null,null,null,null,null,null,null,null,null,null,null,null,"",""]
[null,null,null,null,null,null,null,null,null,null,null,null,null,"",""]
[null,null,null,null,null,null,null,null,null,null,null,null,null,"",""]
[null,null,null,null,null,null,null,null,null,null,null,null,null,"",""]
[null,null,null,null,null,null,null,null,null,null,null,null,null,"",""]
[null,null,null,null,null,null,null,null,null,null,null,null,null,"",""]
[null,null,null,null,null,null,null,null,null,null,null,null,null,"",""]
[null,null,null,null,null,null,null,null,null,null,null,null,null,"",""]
[null,null,null,null,null,null,null,null,null,null,null,null,null,"",""]
[null,null,null,null,null,null,null,null,null,null,null,null,null,"",""]
[null,null,null,null,null,null,null,null,null,null,null,null,null,"",""]
[null,null,null,null,null,null,null,null,null,null,null,null,null,"",""]
[null,null,null,null,null,null,null,null,null,null,null,null,null,"",""]
[null,null,null,null,null,null,null,null,null,null,null,null,null,"",""]

{"sheet":"LDV LDT Cold NMHC AB&T MYSum'ry","index":3,"n_rows":77,"n_cols":11,"rows_kept":77,"cut":false,"hidden":false,"merged":[[8,3,8,5],[8,6,9,6],[0,0,0,10],[1,0,1,8],[6,0,6,2],[6,3,6,4],[8,7,10,7],[8,8,10,8],[8,9,10,9],[8,10,10,10],[9,0,10,0],[9,1,10,1],[9,2,10,2],[4,0,4,10],[3,0,3,10],[68,2,68,5],[74,3,74,5],[76,2,76,5],[52,3,52,5],[58,3,58,5],[60,2,60,5],[62,0,62,2],[66,3,66,5],[46,3,46,5],[16,3,16,5],[22,3,22,5],[28,3,28,5],[34,3,34,5],[40,3,40,5]]}
["Example Template - LDV/LDT/MDPV Fleet Average Cold NMHC Credits - AB&T Model Year Summary Table"]
["Manufacturer: _______________________",null,null,null,null,null,null,null,null,null,"Date:_______________"]
[]
["Purpose and Scope of this Guidance Document          "]
["      This document was prepared by EPA's Office of Transportation and Air Quality (OTAQ).  It is one of several intended to aid regulated parties in reporting Tier 3 and Cold NMHC Averaging, Banking and Trading (AB&T) information and calculating AB&T fleet average credits for light-duty vehicles and certain heavy-duty class 2b and 3 vehicles, ref. 40 CFR 86.1862-04(c).  It contains EPA's recommended format for manufacturers to report to EPA their end-of-year Tier 3 AB&T calculations, credits and other information with respect to the implementation of the AB&T provisions of the EPA Tier 3 final rule (79 FR 23414, April 28, 2014) as amended (80 FR 9078, February 19, 2015; 80 FR 26463, May 8, 2015);  ref. 40 CFR Parts 85, 86, 600, 1065, 1066.  Use of this document is purely optional.\n       This document does not in any way alter or waive the requirements in EPA regulations.  Although the calculations and formulas provided in this document are intended to assist manufacturers in the implementation of EPA regulations, this document does not establish or change the legal rights or obligations of manufacturers or others in complying with EPA regulations, including 40 CFR 86.1862-04(c). If an error or other discrepancy is found in this document, including the calculation formulas, please contact your EPA certification team member or Dave Good at (734) 214-4450 or by email at good.david@epa.gov.  The regulations take precedence."]
[]
["Select Model Year:",null,null,2019,null,null,null,null,null,null,"OMB Control Number 2060-0104\nExpires 3-31-2020"]
[]
[null,null,null,"Fleet Average Compliance Level",null,null,"G.  Credit (Debit) \n[Calc from D,E,F]","Date Credits/ Debits were earned","Date Credits will expire","Last Date When Credits can be Traded","Comments"]
["A.  Date of Transaction","B.  Model Year","C. Category","D. Applicable Cold NMHC Fleet Average Standard","E. Fleet Ave Cold NMHC Compliance Level","F. Production Volume (Nationwide)"]
[null,null,null,"gram/mi","gram/mi","units","gram/mi"]
[]
[]
["2010 Credits:"]
["2011-05-01",2010,"LDV/LLDT",{"$f":"IF(AND(B15<2008,C15=\"LDV/LLDT\"),\"Not Allowed\", IF(AND(B15<2010,C15=\"HLDT/MDPV\"),\"Not Allowed\", IF(AND(B15>2007,C15=\"LDV/LLDT\"),\"0.3\", IF(AND(B15>2009,C15=\"HLDT/MDPV\"),\"0.5\",  ERROR))))","v":"0.3"},0.3,10002,{"$f":"IF(D15=\"\",\"ERROR\",IF(E15=\"\",\"ERROR\",astm((astm(D15,1)-(astm(E15,1)))*F15,0)))","v":0},"2010-12-31","No expiration date","Not Limited","2010 LDV/LDT Cold NMHC Credits earned per 40 CFR 86.1864-10; see other spreadsheet. "]
[null,2010,"Transfer","-","-","-",null,"-","-","-"]
[null,null,null,"Total 2010 Credits Remaining:",null,null,{"$f":"SUM(G15:G16)","v":0}]
[]
["2011 Credits:"]
["2012-05-01",2011,"LDV/LLDT",{"$f":"IF(AND(B20<2008,C20=\"LDV/LLDT\"),\"Not Allowed\", IF(AND(B20<2010,C20=\"HLDT/MDPV\"),\"Not Allowed\", IF(AND(B20>2007,C20=\"LDV/LLDT\"),\"0.3\", IF(AND(B20>2009,C20=\"HLDT/MDPV\"),\"0.5\",  ERROR))))","v":"0.3"},0.3,10002,{"$f":"IF(D20=\"\",\"ERROR\",IF(E20=\"\",\"ERROR\",astm((astm(D20,1)-(astm(E20,1)))*F20,0)))","v":0},"2011-12-31","No expiration date","Not Limited","2011 LDV/LDT Cold NMHC Credits earned per 40 CFR 86.1864-10; see other spreadsheet. "]
["2012-05-01",2011,"HLDT/MDPV",{"$f":"IF(AND(B21<2008,C21=\"LDV/LLDT\"),\"Not Allowed\", IF(AND(B21<2010,C21=\"HLDT/MDPV\"),\"Not Allowed\", IF(AND(B21>2007,C21=\"LDV/LLDT\"),\"0.3\", IF(AND(B21>2009,C21=\"HLDT/MDPV\"),\"0.5\",  ERROR))))","v":"0.5"},0.4,1000,{"$f":"IF(D21=\"\",\"ERROR\",IF(E21=\"\",\"ERROR\",astm((astm(D21,1)-(astm(E21,1)))*F21,0)))","v":100},"2012-12-31","No expiration date","Not Limited","Early 2011 HLDT/MDPV Cold NMHC Credits earned per 40 CFR 86.1811-10(g)(2)(iv) & 86.1864-10(o)(5); see other spreadsheet. "]
[null,2011,"Transfer","-","-","-",null,"-","-","-"]
[null,null,null,"Total 2011 Credits Remaining:",null,null,{"$f":"SUM(G20:G22)","v":100}]
[]
["2012 Credits:"]
["2013-05-01",2012,"LDV/LLDT",{"$f":"IF(AND(B26<2008,C26=\"LDV/LLDT\"),\"Not Allowed\", IF(AND(B26<2010,C26=\"HLDT/MDPV\"),\"Not Allowed\", IF(AND(B26>2007,C26=\"LDV/LLDT\"),\"0.3\", IF(AND(B26>2009,C26=\"HLDT/MDPV\"),\"0.5\",  ERROR))))","v":"0.3"},0.3,10002,{"$f":"IF(D26=\"\",\"ERROR\",IF(E26=\"\",\"ERROR\",astm((astm(D26,1)-(astm(E26,1)))*F26,0)))","v":0},"2012-12-31","No expiration date","Not Limited","2012 LDV/LDT Cold NMHC Credits earned per 40 CFR 86.1864-10; see other spreadsheet. "]
["2013-05-01",2012,"HLDT/MDPV",{"$f":"IF(AND(B27<2008,C27=\"LDV/LLDT\"),\"Not Allowed\", IF(AND(B27<2010,C27=\"HLDT/MDPV\"),\"Not Allowed\", IF(AND(B27>2007,C27=\"LDV/LLDT\"),\"0.3\", IF(AND(B27>2009,C27=\"HLDT/MDPV\"),\"0.5\",  ERROR))))","v":"0.5"},0.5,1000,{"$f":"IF(E27= \"\", \"ERROR\", astm((astm(D27,1)-(astm(E27,1)))*F27,0))","v":0},"2012-12-31","No expiration date","Not Limited","2012 HLDT/MDPV Cold NMHC Credits earned per 40 CFR 86.1864-10; see other spreadsheet. "]
[null,2012,"Transfer","-","-","-",null,"-","-","-"]
[null,null,null,"Total 2012 Credits Remaining:",null,null,{"$f":"SUM(G26:G28)","v":0}]
[]
["2013 Credits:"]
["2014-05-01",2013,"LDV/LLDT",{"$f":"IF(AND(B32<2008,C32=\"LDV/LLDT\"),\"Not Allowed\", IF(AND(B32<2010,C32=\"HLDT/MDPV\"),\"Not Allowed\", IF(AND(B32>2007,C32=\"LDV/LLDT\"),\"0.3\", IF(AND(B32>2009,C32=\"HLDT/MDPV\"),\"0.5\",  ERROR))))","v":"0.3"},0.3,10002,{"$f":"IF(D32=\"\",\"ERROR\",IF(E32=\"\",\"ERROR\",astm((astm(D32,1)-(astm(E32,1)))*F32,0)))","v":0},"2013-12-31","No expiration date","Not Limited","2013 LDV/LDT Cold NMHC Credits earned per 40 CFR 86.1864-10; see other spreadsheet. "]
["2014-05-01",2013,"HLDT/MDPV",{"$f":"IF(AND(B33<2008,C33=\"LDV/LLDT\"),\"Not Allowed\", IF(AND(B33<2010,C33=\"HLDT/MDPV\"),\"Not Allowed\", IF(AND(B33>2007,C33=\"LDV/LLDT\"),\"0.3\", IF(AND(B33>2009,C33=\"HLDT/MDPV\"),\"0.5\",  ERROR))))","v":"0.5"},0.5,1000,{"$f":"IF(E33= \"\", \"ERROR\", astm((astm(D33,1)-(astm(E33,1)))*F33,0))","v":0},"2013-12-31","No expiration date","Not Limited","2013 HLDT/MDPV Cold NMHC Credits earned per 40 CFR 86.1864-10; see other spreadsheet. "]
[null,2013,"Transfer","-","-","-",null,"-","-","-"]
[null,null,null,"Total 2013 Credits Remaining:",null,null,{"$f":"SUM(G32:G34)","v":0}]
[]
["2014 Credits:"]
["2015-05-01",2014,"LDV/LLDT",{"$f":"IF(AND(B38<2008,C38=\"LDV/LLDT\"),\"Not Allowed\", IF(AND(B38<2010,C38=\"HLDT/MDPV\"),\"Not Allowed\", IF(AND(B38>2007,C38=\"LDV/LLDT\"),\"0.3\", IF(AND(B38>2009,C38=\"HLDT/MDPV\"),\"0.5\",  ERROR))))","v":"0.3"},0.3,10002,{"$f":"IF(D38=\"\",\"ERROR\",IF(E38=\"\",\"ERROR\",astm((astm(D38,1)-(astm(E38,1)))*F38,0)))","v":0},"2014-12-31","No expiration date","Not Limited","2014 LDV/LDT Cold NMHC Credits earned per 40 CFR 86.1864-10; see other spreadsheet. "]
["2015-05-01",2014,"HLDT/MDPV",{"$f":"IF(AND(B39<2008,C39=\"LDV/LLDT\"),\"Not Allowed\", IF(AND(B39<2010,C39=\"HLDT/MDPV\"),\"Not Allowed\", IF(AND(B39>2007,C39=\"LDV/LLDT\"),\"0.3\", IF(AND(B39>2009,C39=\"HLDT/MDPV\"),\"0.5\",  ERROR))))","v":"0.5"},0.5,1000,{"$f":"IF(E39= \"\", \"ERROR\", astm((astm(D39,1)-(astm(E39,1)))*F39,0))","v":0},"2014-12-31","No expiration date","Not Limited","2014 HLDT/MDPV Cold NMHC Credits earned per 40 CFR 86.1864-10; see other spreadsheet. "]
[null,2014,"Transfer","-","-","-",null,"-","-","-"]
[null,null,null,"Total 2014 Credits Remaining:",null,null,{"$f":"SUM(G38:G40)","v":0}]
[]
["2015 Credits:"]
["2016-05-01",2015,"LDV/LLDT",{"$f":"IF(AND(B44<2008,C44=\"LDV/LLDT\"),\"Not Allowed\", IF(AND(B44<2010,C44=\"HLDT/MDPV\"),\"Not Allowed\", IF(AND(B44>2007,C44=\"LDV/LLDT\"),\"0.3\", IF(AND(B44>2009,C44=\"HLDT/MDPV\"),\"0.5\",  ERROR))))","v":"0.3"},0.3,10002,{"$f":"IF(D44=\"\",\"ERROR\",IF(E44=\"\",\"ERROR\",astm((astm(D44,1)-(astm(E44,1)))*F44,0)))","v":0},"2015-12-31","No expiration date","Not Limited","2015 LDV/LDT Cold NMHC Credits earned per 40 CFR 86.1864-10; see other spreadsheet. "]
["2016-05-01",2014,"HLDT/MDPV",{"$f":"IF(AND(B45<2008,C45=\"LDV/LLDT\"),\"Not Allowed\", IF(AND(B45<2010,C45=\"HLDT/MDPV\"),\"Not Allowed\", IF(AND(B45>2007,C45=\"LDV/LLDT\"),\"0.3\", IF(AND(B45>2009,C45=\"HLDT/MDPV\"),\"0.5\",  ERROR))))","v":"0.5"},0.5,1000,{"$f":"IF(E45= \"\", \"ERROR\", astm((astm(D45,1)-(astm(E45,1)))*F45,0))","v":0},"2015-12-31","No expiration date","Not Limited","2015 HLDT/MDPV Cold NMHC Credits earned per 40 CFR 86.1864-10; see other spreadsheet. "]
[null,2015,"Transfer","-","-","-",null,"-","-","-"]
[null,null,null,"Total 2015 Credits Remaining:",null,null,{"$f":"SUM(G44:G46)","v":0}]
[]
["2016 Credits:"]
["2017-05-01",2016,"LDV/LLDT",{"$f":"IF(AND(B50<2008,C50=\"LDV/LLDT\"),\"Not Allowed\", IF(AND(B50<2010,C50=\"HLDT/MDPV\"),\"Not Allowed\", IF(AND(B50>2007,C50=\"LDV/LLDT\"),\"0.3\", IF(AND(B50>2009,C50=\"HLDT/MDPV\"),\"0.5\",  ERROR))))","v":"0.3"},0.2,10002,{"$f":"IF(D50=\"\",\"ERROR\",IF(E50=\"\",\"ERROR\",astm((astm(D50,1)-(astm(E50,1)))*F50,0)))","v":1000},"2016-12-31","No expiration date","Not Limited","2016 LDV/LDT Cold NMHC Credits earned per 40 CFR 86.1864-10; see other spreadsheet. "]
["2017-05-01",2016,"HLDT/MDPV",{"$f":"IF(AND(B51<2008,C51=\"LDV/LLDT\"),\"Not Allowed\", IF(AND(B51<2010,C51=\"HLDT/MDPV\"),\"Not Allowed\", IF(AND(B51>2007,C51=\"LDV/LLDT\"),\"0.3\", IF(AND(B51>2009,C51=\"HLDT/MDPV\"),\"0.5\",  ERROR))))","v":"0.5"},0.5,1000,{"$f":"IF(E51= \"\", \"ERROR\", astm((astm(D51,1)-(astm(E51,1)))*F51,0))","v":0},"2016-12-31","No expiration date","Not Limited","2016 HLDT/MDPV Cold NMHC Credits earned per 40 CFR 86.1864-10; see other spreadsheet. "]
[null,2016,"Transfer","-","-","-",null,"-","-","-"]
[null,null,null,"Total 2016 Credits Remaining:",null,null,{"$f":"SUM(G50:G52)","v":1000}]
[]
["2017 Credits:"]
["2018-05-01",2017,"LDV/LLDT",{"$f":"IF(AND(B56<2008,C56=\"LDV/LLDT\"),\"Not Allowed\", IF(AND(B56<2010,C56=\"HLDT/MDPV\"),\"Not Allowed\", IF(AND(B56>2007,C56=\"LDV/LLDT\"),\"0.3\", IF(AND(B56>2009,C56=\"HLDT/MDPV\"),\"0.5\",  ERROR))))","v":"0.3"},0.3,21784,{"$f":"IF(D56=\"\",\"ERROR\",IF(E56=\"\",\"ERROR\",astm((astm(D56,1)-(astm(E56,1)))*F56,0)))","v":0},"2017-12-31","No expiration date","Not Limited","2017 LDV/LDT Cold NMHC Credits earned per 40 CFR 86.1864-10; see other spreadsheet. "]
["2018-05-01",2017,"HLDT/MDPV",{"$f":"IF(AND(B57<2008,C57=\"LDV/LLDT\"),\"Not Allowed\", IF(AND(B57<2010,C57=\"HLDT/MDPV\"),\"Not Allowed\", IF(AND(B57>2007,C57=\"LDV/LLDT\"),\"0.3\", IF(AND(B57>2009,C57=\"HLDT/MDPV\"),\"0.5\",  ERROR))))","v":"0.5"},0.5,1000,{"$f":"IF(E57= \"\", \"ERROR\", astm((astm(D57,1)-(astm(E57,1)))*F57,0))","v":0},"2017-12-31","No expiration date","Not Limited","2017 HLDT/MDPV Cold NMHC Credits earned per 40 CFR 86.1864-10; see other spreadsheet. "]
[null,2017,"Transfer","-","-","-",null,"-","-","-"]
[null,null,null,"Total 2017 Credits Remaining:",null,null,{"$f":"SUM(G56:G58)","v":0}]
[]
[null,null,"Total 2010-2017 Credits Remaining:",null,null,null,{"$f":"SUM(G17+G23+G29+G35+G41+G47+G53+G59)","v":1100}]
[]
["2018 Credits:"]
["2019-05-01",2018,"LDV/LLDT",{"$f":"IF(AND(B64<2008,C64=\"LDV/LLDT\"),\"Not Allowed\", IF(AND(B64<2010,C64=\"HLDT/MDPV\"),\"Not Allowed\", IF(AND(B64>2007,C64=\"LDV/LLDT\"),\"0.3\", IF(AND(B64>2009,C64=\"HLDT/MDPV\"),\"0.5\",  ERROR))))","v":"0.3"},0.4,28471,{"$f":"IF(D64=\"\",\"ERROR\",IF(E64=\"\",\"ERROR\",astm((astm(D64,1)-(astm(E64,1)))*F64,0)))","v":-2847},"2018-12-31","No expiration date","Not Limited","2018 LDV/LDT Cold NMHC Credits earned per 40 CFR 86.1864-10; see other spreadsheet. "]
["2019-05-01",2018,"HLDT/MDPV",{"$f":"IF(AND(B65<2008,C65=\"LDV/LLDT\"),\"Not Allowed\", IF(AND(B65<2010,C65=\"HLDT/MDPV\"),\"Not Allowed\", IF(AND(B65>2007,C65=\"LDV/LLDT\"),\"0.3\", IF(AND(B65>2009,C65=\"HLDT/MDPV\"),\"0.5\",  ERROR))))","v":"0.5"},0.5,1000,{"$f":"IF(E65= \"\", \"ERROR\", astm((astm(D65,1)-(astm(E65,1)))*F65,0))","v":0},"2018-12-31","No expiration date","Not Limited","2018 HLDT/MDPV Cold NMHC Credits earned per 40 CFR 86.1864-10; see other spreadsheet. "]
["2019-01-20",2018,"Transfer","-","-","-",2000,"2016-12-31","No expiration date","Not Limited","Purchased 2000 Cold NMHC credits from Manufacturer A (earned on 12/31/2016)"]
[null,null,null,"Total 2018 Early Credits Remaining:",null,null,{"$f":"SUM(G64:G66)","v":-847}]
[]
[null,null,"Total 2010-2018 Credits Remaining:",null,null,null,{"$f":"SUM(G61+G67)","v":253}]
[]
["2019 Credits: "]
["2020-05-01",2019,"LDV/LLDT",{"$f":"IF(AND(B72<2008,C72=\"LDV/LLDT\"),\"Not Allowed\", IF(AND(B72<2010,C72=\"HLDT/MDPV\"),\"Not Allowed\", IF(AND(B72>2007,C72=\"LDV/LLDT\"),\"0.3\", IF(AND(B72>2009,C72=\"HLDT/MDPV\"),\"0.5\",  ERROR))))","v":"0.3"},0.3,53458,{"$f":"IF(D72=\"\",\"ERROR\",IF(E72=\"\",\"ERROR\",astm((astm(D72,1)-(astm(E72,1)))*F72,0)))","v":0},"2019-12-31","No expiration date","Not Limited","2019 LDV/LDT Cold NMHC Credits earned per 40 CFR 86.1864-10; see attached spreadsheet. "]
["2020-05-01",2019,"HLDT/MDPV",{"$f":"IF(AND(B73<2008,C73=\"LDV/LLDT\"),\"Not Allowed\", IF(AND(B73<2010,C73=\"HLDT/MDPV\"),\"Not Allowed\", IF(AND(B73>2007,C73=\"LDV/LLDT\"),\"0.3\", IF(AND(B73>2009,C73=\"HLDT/MDPV\"),\"0.5\",  ERROR))))","v":"0.5"},0.5,1000,{"$f":"IF(E73= \"\", \"ERROR\", astm((astm(D73,1)-(astm(E73,1)))*F73,0))","v":0},"2019-12-31","No expiration date","Not Limited","2019 HLDT/MDPV Cold NMHC Credits earned per 40 CFR 86.1864-10; see attached spreadsheet. "]
[null,2019,"Transfer","-","-","-",null,"-","-","-"]
[null,null,null,"Total 2019 Credits Remaining:",null,null,{"$f":"SUM(G72:G74)","v":0}]
[]
[null,null,"Grand Total 2010-2019 Credits Remaining:",null,null,null,{"$f":"G69+G75","v":253}]

{"sheet":"Evap","index":4,"n_rows":490,"n_cols":28,"rows_kept":490,"cut":false,"hidden":false,"merged":[[463,15,463,21],[464,15,464,21],[465,15,465,21],[454,15,454,21],[455,15,455,21],[456,15,456,21],[457,15,457,21],[458,15,458,21],[459,15,459,21],[460,15,460,21],[461,15,461,21],[462,15,462,21],[472,15,472,21],[473,15,473,21],[474,15,474,21],[475,15,475,21],[476,15,476,21],[477,15,477,21],[466,15,466,21],[467,15,467,21],[468,15,468,21],[469,15,469,21],[470,15,470,21],[471,15,471,21],[485,15,485,21],[486,15,486,21],[487,15,487,21],[488,15,488,21],[489,15,489,21],[478,15,478,21],[479,15,479,21],[480,15,480,21],[481,15,481,21],[482,15,482,21],[483,15,483,21],[484,15,484,21],[448,15,448,21],[449,15,449,21],[450,15,450,21],[451,15,451,21],[452,15,452,21],[453,15,453,21],[442,15,442,21],[443,15,443,21],[444,15,444,21],[445,15,445,21],[446,15,446,21],[447,15,447,21],[436,15,436,21],[437,15,437,21],[438,15,438,21],[439,15,439,21],[440,15,440,21],[441,15,441,21],[430,15,430,21],[431,15,431,21],[432,15,432,21],[433,15,433,21],[434,15,434,21],[435,15,435,21],[424,15,424,21],[425,15,425,21],[426,15,426,21],[427,15,427,21],[428,15,428,21],[429,15,429,21],[418,15,418,21],[419,15,419,21],[420,15,420,21],[421,15,421,21],[422,15,422,21],[423,15,423,21],[412,15,412,21],[413,15,413,21],[414,15,414,21],[415,15,415,21],[416,15,416,21],[417,15,417,21],[406,15,406,21],[407,15,407,21],[408,15,408,21],[409,15,409,21],[410,15,410,21],[411,15,411,21],[400,15,400,21],[401,15,401,21],[402,15,402,21],[403,15,403,21],[404,15,404,21],[405,15,405,21],[394,15,394,21],[395,15,395,21],[396,15,396,21],[397,15,397,21],[398,15,398,21],[399,15,399,21],[388,15,388,21],[389,15,389,21],[390,15,390,21],[391,15,391,21],[392,15,392,21],[393,15,393,21],[382,15,382,21],[383,15,383,21],[384,15,384,21],[385,15,385,21],[386,15,386,21],[387,15,387,21],[376,15,376,21],[377,15,377,21],[378,15,378,21],[379,15,379,21],[380,15,380,21],[381,15,381,21],[370,15,370,21],[371,15,371,21],[372,15,372,21],[373,15,373,21],[374,15,374,21],[375,15,375,21],[364,15,364,21],[365,15,365,21],[366,15,366,21],[367,15,367,21],[368,15,368,21],[369,15,369,21],[358,15,358,21],[359,15,359,21],[360,15,360,21],[361,15,361,21],[362,15,362,21],[363,15,363,21],[352,15,352,21],[353,15,353,21],[354,15,354,21],[355,15,355,21],[356,15,356,21],[357,15,357,21],[346,15,346,21],[347,15,347,21],[348,15,348,21],[349,15,349,21],[350,15,350,21],[351,15,351,21],[340,15,340,21],[341,15,341,21],[342,15,342,21],[343,15,343,21],[344,15,344,21],[345,15,345,21],[334,15,334,21],[335,15,335,21],[336,15,336,21],[337,15,337,21],[338,15,338,21],[339,15,339,21],[328,15,328,21],[329,15,329,21],[330,15,330,21],[331,15,331,21],[332,15,332,21],[333,15,333,21],[322,15,322,21],[323,15,323,21],[324,15,324,21],[325,15,325,21],[326,15,326,21],[327,15,327,21],[316,15,316,21],[317,15,317,21],[318,15,318,21],[319,15,319,21],[320,15,320,21],[321,15,321,21],[310,15,310,21],[311,15,311,21],[312,15,312,21],[313,15,313,21],[314,15,314,21],[315,15,315,21],[304,15,304,21],[305,15,305,21],[306,15,306,21],[307,15,307,21],[308,15,308,21],[309,15,309,21],[298,15,298,21],[299,15,299,21],[300,15,300,21],[301,15,301,21],[302,15,302,21],[303,15,303,21],[292,15,292,21],[293,15,293,21],[294,15,294,21],[295,15,295,21],[296,15,296,21],[297,15,297,21],[286,15,286,21],[287,15,287,21],[288,15,288,21],[289,15,289,21],[290,15,290,21],[291,15,291,21],[280,15,280,21],[281,15,281,21],[282,15,282,21],[283,15,283,21],[284,15,284,21],[285,15,285,21],[274,15,274,21],[275,15,275,21],[276,15,276,21],[277,15,277,21],[278,15,278,21],[279,15,279,21],[268,15,268,21],[269,15,269,21],[270,15,270,21],[271,15,271,21],[272,15,272,21],[273,15,273,21],[262,15,262,21],[263,15,263,21],[264,15,264,21],[265,15,265,21],[266,15,266,21],[267,15,267,21],[256,15,256,21],[257,15,257,21],[258,15,258,21],[259,15,259,21],[260,15,260,21],[261,15,261,21],[250,15,250,21],[251,15,251,21],[252,15,252,21],[253,15,253,21],[254,15,254,21],[255,15,255,21],[244,15,244,21],[245,15,245,21],[246,15,246,21],[247,15,247,21],[248,15,248,21],[249,15,249,21],[238,15,238,21],[239,15,239,21],[240,15,240,21],[241,15,241,21],[242,15,242,21],[243,15,243,21],[232,15,232,21],[233,15,233,21],[234,15,234,21],[235,15,235,21],[236,15,236,21],[237,15,237,21],[226,15,226,21],[227,15,227,21],[228,15,228,21],[229,15,229,21],[230,15,230,21],[231,15,231,21],[220,15,220,21],[221,15,221,21],[222,15,222,21],[223,15,223,21],[224,15,224,21],[225,15,225,21],[214,15,214,21],[215,15,215,21],[216,15,216,21],[217,15,217,21],[218,15,218,21],[219,15,219,21],[208,15,208,21],[209,15,209,21],[210,15,210,21],[211,15,211,21],[212,15,212,21],[213,15,213,21],[202,15,202,21],[203,15,203,21],[204,15,204,21],[205,15,205,21],[206,15,206,21],[207,15,207,21],[196,15,196,21],[197,15,197,21],[198,15,198,21],[199,15,199,21],[200,15,200,21],[201,15,201,21],[190,15,190,21],[191,15,191,21],[192,15,192,21],[193,15,193,21],[194,15,194,21],[195,15,195,21],[184,15,184,21],[185,15,185,21],[186,15,186,21],[187,15,187,21],[188,15,188,21],[189,15,189,21],[178,15,178,21],[179,15,179,21],[180,15,180,21],[181,15,181,21],[182,15,182,21],[183,15,183,21],[172,15,172,21],[173,15,173,21],[174,15,174,21],[175,15,175,21],[176,15,176,21],[177,15,177,21],[166,15,166,21],[167,15,167,21],[168,15,168,21],[169,15,169,21],[170,15,170,21],[171,15,171,21],[160,15,160,21],[161,15,161,21],[162,15,162,21],[163,15,163,21],[164,15,164,21],[165,15,165,21],[154,15,154,21],[155,15,155,21],[156,15,156,21],[157,15,157,21],[158,15,158,21],[159,15,159,21],[148,15,148,21],[149,15,149,21],[150,15,150,21],[151,15,151,21],[152,15,152,21],[153,15,153,21],[142,15,142,21],[143,15,143,21],[144,15,144,21],[145,15,145,21],[146,15,146,21],[147,15,147,21],[136,15,136,21],[137,15,137,21],[138,15,138,21],[139,15,139,21],[140,15,140,21],[141,15,141,21],[130,15,130,21],[131,15,131,21],[132,15,132,21],[133,15,133,21],[134,15,134,21],[135,15,135,21],[124,15,124,21],[125,15,125,21],[126,15,126,21],[127,15,127,21],[128,15,128,21],[129,15,129,21],[118,15,118,21],[119,15,119,21],[120,15,120,21],[121,15,121,21],[122,15,122,21],[123,15,123,21],[112,15,112,21],[113,15,113,21],[114,15,114,21],[115,15,115,21],[116,15,116,21],[117,15,117,21],[106,15,106,21],[107,15,107,21],[108,15,108,21],[109,15,109,21],[110,15,110,21],[111,15,111,21],[100,15,100,21],[101,15,101,21],[102,15,102,21],[103,15,103,21],[104,15,104,21],[105,15,105,21],[94,15,94,21],[95,15,95,21],[96,15,96,21],[97,15,97,21],[98,15,98,21],[99,15,99,21],[90,15,90,21],[91,15,91,21],[92,15,92,21],[93,15,93,21],[82,15,82,21],[83,15,83,21],[84,15,84,21],[85,15,85,21],[86,15,86,21],[87,15,87,21],[63,15,63,21],[80,15,80,21],[81,15,81,21],[72,15,72,21],[73,15,73,21],[74,15,74,21],[75,15,75,21],[88,15,88,21],[89,15,89,21],[76,15,76,21],[77,15,77,21],[78,15,78,21],[79,15,79,21],[70,15,70,21],[71,15,71,21],[64,15,64,21],[65,15,65,21],[66,15,66,21],[67,15,67,21],[68,15,68,21],[69,15,69,21],[51,15,51,21],[43,15,43,21],[44,15,44,21],[45,15,45,21],[58,15,58,21],[59,15,59,21],[60,15,60,21],[61,15,61,21],[62,15,62,21],[46,15,46,21],[47,15,47,21],[48,15,48,21],[49,15,49,21],[50,15,50,21],[52,15,52,21],[53,15,53,21],[54,15,54,21],[55,15,55,21],[56,15,56,21],[57,15,57,21],[40,15,40,21],[41,15,41,21],[42,15,42,21],[30,15,30,21],[36,15,36,21],[0,0,0,21],[18,27,19,27],[7,0,7,1],[18,0,19,0],[18,15,19,21],[18,26,19,26],[6,8,6,12],[6,14,6,18],[7,14,8,14],[7,15,8,15],[11,8,11,12],[11,14,11,18],[12,14,13,14],[12,15,13,15],[7,8,8,8],[12,8,13,8],[7,9,8,9],[12,9,13,9],[13,1,13,2],[14,1,14,2],[1,12,1,15],[4,0,4,18],[17,26,17,27],[3,0,3,14],[9,1,9,3],[10,1,10,2],[11,1,11,2],[12,1,12,2],[6,4,6,6],[1,3,1,11],[37,15,37,21],[38,15,38,21],[39,15,39,21],[35,15,35,21],[32,15,32,21],[34,15,34,21],[31,15,31,21],[33,15,33,21],[20,15,20,21],[21,15,21,21],[23,15,23,21],[24,15,24,21],[26,15,26,21],[27,15,27,21],[22,15,22,21],[28,15,28,21],[29,15,29,21],[25,15,25,21]]}
["Example Template    -    LDV/LDT/HDV Federal Tier 3 Evaporative (Hot Soak + Diurnal) Emissions    -    Fleet Average Calculations for One Model Year "]
[null,null,null,"Manufacturer: ___________________________",null,null,null,null,null,null,null,null,"Date: _____________"]
[]
["Purpose and Scope of this Guidance Document          "]
["     This document was prepared by EPA's Office of Transportation and Air Quality (OTAQ).  It is one of several intended to aid regulated parties in reporting Tier 3 and Cold NMHC Averaging, Banking and Trading (AB&T) information and calculating AB&T fleet average credits for light-duty vehicles and certain heavy-duty class 2b and 3 vehicles, ref. 40 CFR 86.1862-04(c).  It contains EPA's recommended format for manufacturers to report to EPA their end-of-year Tier 3 AB&T calculations, credits and other information with respect to the implementation of the AB&T provisions of the EPA Tier 3 final rule (79 FR 23414, April 28, 2014) as amended (80 FR 9078, February 19, 2015; 80 FR 26463, May 8, 2015);  ref. 40 CFR Parts 85, 86, 600, 1065, 1066.  Use of this document is purely optional.\n       This document does not in any way alter or waive the requirements in EPA regulations.  Although the calculations and formulas provided in this document are intended to assist manufacturers in the implementation of EPA regulations, this document does not establish or change the legal rights or obligations of manufacturers or others in complying with EPA regulations, including 40 CFR 86.1862-04(c). If an error or other discrepancy is found in this document, including the calculation formulas, please contact your EPA certification team member or Dave Good at (734) 214-4450 or by email at good.david@epa.gov.  The regulations take precedence."]
[]
["Instructions",null,null,null,"OMB Control Number 2060-0104\nExpires 3-31-2020",null,null,null,"Tier 3 Evaporative LDV/LDT1 Averaging Set",null,null,null,null,null,"Tier 3 Evaporative LDT2 Averaging Set"]
["Select Model Year:",null,2019,null,null,null,null,null,"Evaporative Emissions","Total Production of Averaging Set","Fleet average compliance value","Fleet average standard","Credits or Debits",null,"Evaporative Emissions","Total Production of Averaging Set","Fleet average compliance value","Fleet average standard","Credits or Debits"]
[null,null,null,null,null,null,null,null,null,null,"grams/test","grams/test","vehicle-grams/test",null,null,null,"grams/test","grams/test","vehicle-gr/test"]
[null,"Enter \"X\" if all vehicles are certified at or below fleet average standard and you omit credit calculations per 40 CFR 86.18160-17(f):",null,null,null,null,null,null,"E10 \nTotal HC Equivalent",{"$f":"SUMIF(B21:B490,\"LDV/LDT1\",Y21:Y490)","v":79840},{"$f":"IF(D12=\"X\", \"All vehicles certified at or below fleet average standard\",astm(SUMIF(B21:B490,\"LDV/LDT1\",Z21:Z490)/J10,3))","v":0.188},0.3,{"$f":"IF(D12=\"X\", 0,astm(((L10-K10)*J10),0))","v":8942},null,"E10 \nTotal HC Equivalent",{"$f":"SUMIF(B21:B490,\"LDT2\",Y21:Y490)","v":134000},{"$f":"IF(D13=\"X\",\"All vehicles certified at or below fleet average standard\",astm(SUMIF(B21:B490,\"LDT2\",Z21:IP490)/P10,3))","v":0.33700000000000002},0.4,{"$f":"IF(D13=\"X\",0,astm(((R10-Q10)*P10),0))","v":8442}]
[null,"Averaging Set",null,"Check if applicable:"]
[null,"LDV/LDT1:",null,null,null,null,null,null,"Tier 3 Evaporative HLDT/MDPV Averaging Set",null,null,null,null,null,"Tier 3 Evaporative HDV Averaging Set"]
[null,"LDT2:",null,null,null,null,null,null,"Evaporative Emissions","Total Production of Averaging Set","Fleet average compliance value","Fleet average standard","Credits or Debits",null,"Evaporative Emissions","Total Production of Averaging Set","Fleet average compliance value","Fleet average standard","Credits or Debits"]
[null,"HLDT/MDPV:",null,null,null,null,null,null,null,null,"grams/test","grams/test","vehicle-grams/test",null,null,null,"grams/test","grams/test","vehicle-gr/test"]
[null,"HDV:",null,null,null,null,null,null,"E10 \nTotal HC Equivalent",{"$f":"SUMIF(B21:B490,\"HLDT/MDPV\",Y21:Y490) + SUMIF(B21:B490,\"HLDT Allowance only\",Y21:Y490) + SUMIF(B21:B490,\"MDPV Allowance only\",Y21:Y490)","v":120049},{"$f":"IF(D14=\"X\", \"All vehicles certified at or below fleet average standard\",astm((SUMIF(B21:B490,\"HLDT/MDPV\",Z21:Z490)+ SUMIF(B21:B490,\"HLDT Allowance only\",Z21:Z490) + SUMIF(B21:B490,\"MDPV Allowance only\",Z21:Z490))/J15,3))","v":0.48099999999999998},0.5,{"$f":"IF(D14=\"X\", 0,astm(((L15-K15)*J15),0))","v":2281},null,"E10 \nTotal HC Equivalent",{"$f":"SUMIF(B21:B490,\"HDV\",Y21:Y490)","v":116000},{"$f":"IF(D15=\"X\",\"All vehicles certified at or below fleet average standard\",astm(SUMIF(B21:B490,\"HDV\",Z21:Z490)/P15,3))","v":0.60099999999999998},0.6,{"$f":"IF(D15=\"X\",0,astm(((R15-Q15)*P15),0))","v":-116}]
[]
[]
[null,null,null,null,null,null,null,null,null,null,null,null,null,null,null,null,null,null,null,null,null,null,null,null,null,null,"Error Checks"]
["Evaporative Family (including Early Allowance Evap Families)","Vehicle Class of Evap Family (and Averaging Set)","FEL\n of Evap Family (low altitude)","Class of HDV\n[Needed only if Column B is HDV]","HDV Class    4-8 Certification Basis [If Statement, Can't Earn Credits]","HDV also meets ORVR Standards [Needed for Allowances for Class 3 and above HDVs]","Evap Family Useful Life Miles","Evap Family\nUseful Life of Averaging Set\n(must be 150K)","Test Fuel (used for HS + Diurnal test)","2015 or 2016 \nCarryover PZEV Option 1 (Rig Test) Using Phase 2 test fuel?","2015 or 2016 CARB LEV3 Option 1 \n(Rig Test) Carryover?","Early Allowance Evap Family (Not used to meet Phase-in Requirements; Not used for 2017 Nationwide PZEV \nPhase-in Option)? \n[Can be 2015-2016 Carryover CARB Option1, CARB Option2 or Tier3 Evap Family]","Model Year Early Allowance Was Earned","Production\n(Federal only)\n[Needed for 2017MY & LDV/ LLDT/HLDT Allowances]","Production\n(50-State)","Manufacturer Comments",null,null,null,null,null,null,"Fleet Ave Standard for Vehicle Class\n\n[derived from class in Column B]\n","FEL \nUsed for Fleet Average Calculations\n\n[Derived from Columns \nB, C, E, J, K, W]","Production used in Calcs\n\n[Derived from Columns \nP & Q]","Evap\nIntermediate Calculation\n[Unrounded Production x FEL]","Error Check: \n\nDoes FEL Exceed the CAP for the Vehicle Class?","Error Message from Column Y\n(if any)"]
[null,"LDV/LDT1; LDT2; HLDT/MDPV, HDV, HLDT Allowance only or MDPV Allowance only","gr/test; (HS + Diurnal)","[Class 2b, 3, 4, 5, 6, 7 or 8]","Test Data or Statement","Yes or No\n\n[Uses 2:1 Production Multiplier]","(x 1000 Miles)","(x 1000 \nMiles)","Ph 2, LEV3 or Tier3","Yes or No","(And Using LEV 3\n test fuel); \nYes or No","(Note: Early Allowances Expire after 2021 MY); \nYes or No","2015,  2016, 2017 (>6000 GVWR only), \nor NA","# of Units","# of Units",null,null,null,null,null,null,null,"gr/test; (HS + Diurnal)","[PZEVs, CARB Opt 1 Vehs, Allowances & some HDVs can't earn credits]","# of Units","Unrounded units x g/test"]
["A","LDV/LDT1",0.15,null,null,null,150,150,"LEV 3","No","No","No","NA",null,39458,null,null,null,null,null,null,null,{"$f":"IF(A21=\"\",\"\", IF(B21=\"LDV/LDT1\", 0.3,  IF(B21=\"LDT2\", 0.4, IF(OR(B21=\"HLDT/MDPV\",B21=\"HLDT Allowance only\", B21=\"MDPV Allowance only\"), 0.5, IF(B21=\"HDV\", 0.6,   ERROR)))))","v":0.3},{"$f":"IF(A21=\"\", \"\", IF(J21 = \"Yes\", W21, IF(K21=\"Yes\", W21, IF(AND(A21<>\"\",B21=\"HDV\",E21=\"Statement\"), MAX(C21, W21),C21))))","v":0.15},{"$f":"IF(A21=\"\",\"\",IF(AND(A21<>\"\",L21=\"Yes\",$C$8>2021),\"ERROR--Can't Use Early Allowances after 2021MY\",\nIF(AND(A21<>\"\",B21=\"HLDT Allowance only\",$C$8=2017),\"Can't Use HLDT Allowance before 2018MY\",IF(AND(A21<>\"\",B21=\"MDPV Allowance only\",$C$8=2017),\"Can't Use MDPV Allowance before 2018MY\",IF(AND(A21<>\"\",B21=\"HLDT/MDPV\",$C$8=2017),\"Can't Use HLDT/MDPV Allowance before 2018MY\",IF(AND(A21<>\"\",B21=\"HDV\",$C$8=2017),\"Can't Use HDV Allowance before 2018MY\",IF(AND(A21<>\"\",L21=\"Yes\",J21<>\"Yes\",K21<>\"Yes\",C21>W21),\"ERROR--Early Allowance evaporative family does not comply with Tier 3 standards and is not a 2015 or 2016 Carryover PZEV or Carryover LEV3 Option 1 (Rig Test) Evap family\",IF(AND(A21<>\"\",L21=\"Yes\",B21=\"HDV\",O21=\"\"),\"FIX 50-St Prod'n--needed for HDV Allowances\",IF(AND(A21<>\"\",B21=\"MDPV Allowance only\",O21=\"\"),\"FIX 50-St Prod'n--needed for MDPV early allowances\",IF(AND(A21<>\"\",L21=\"Yes\",B21=\"LDV/LDT1\",N21=\"\"),\"FIX Fed Prod'n--needed for LDV/LDT1 early allowances\",IF(AND(A21<>\"\",L21=\"Yes\",B21=\"LDT2\",N21=\"\"),\"FIX Fed Prod'n--needed for LDT2 early allowances\",IF(AND(A21<>\"\",L21=\"Yes\",B21=\"HLDT Allowance only\",N21=\"\"),\"FIX Fed Prod'n--needed for HLDT early allowances\",IF(AND(A21<>\"\",L21=\"Yes\",B21=\"HLDT/MDPV\"),\"ERROR in Col B--must use HLDT Allowance only or MDPV Allowance only value from Column B menu and corresponding production values for HLDT Allowances or MDPV Allowances as applicable\",IF(AND(A21<>\"\",B21=\"HDV\",D21=\"\"),\"ERROR--Column B is HDV but HDV Class in Column E is Blank\",IF(AND(A21<>\"\",B21<>\"\",B21<>\"HDV\",D21<>\"\"),\"ERROR--Column B is not HDV but you entered a HDV Class in Column E\",IF(AND(A21<>\"\",B21=\"HDV\",D21=4,E21=\"\"),\"ERROR--Column E indicates HDV Class 4-8 but Certification Basis in Column F is Blank\",IF(AND(A21<>\"\",B21=\"HDV\",D21=5,E21=\"\"),\"ERROR--Column E indicates HDV Class 4-8 but Certification Basis in Column F is Blank\",IF(AND(A21<>\"\",B21=\"HDV\",D21=6,E21=\"\"),\"ERROR--Column E indicates HDV Class 4-8 but Certification Basis in Column F is Blank\",IF(AND(A21<>\"\",B21=\"HDV\",D21=7,E21=\"\"),\"ERROR--Column E indicates HDV Class 4-8 but Certification Basis in Column F is Blank\",IF(AND(A21<>\"\",B21=\"HDV\",D21=8,E21=\"\"),\"ERROR--Column E indicates HDV Class 4-8 but Certification Basis in Column F is Blank\",IF(AND(A21<>\"\",D21=\"2b\",E21=\"Statement\"),\"ERROR in Columns E & F---Can't use Statement for Certification Basis of Class 2b HDVs\",IF(AND(A21<>\"\",D21=3,E21=\"Statement\"),\"ERROR in Columns E & F---Can't use Statement for Certification Basis of Class 3 HDVs\",IF(AND(A21<>\"\",B21<>\"HDV\",E21=\"Statement\"),\"ERROR in Columns B & F---Can only use Statement as the Certification Basis of Class 4 and above HDVs\",IF(AND(A21<>\"\",I21=\"Phase 2\",J21=\"No\"),\"ERROR--Can only use Phase 2 test fuel for 2015-2016 Carryover PZEV Option 1 (Rig Test) Evaporative Families\",IF(AND(A21<>\"\",I21=\"NA\",E21<>\"Statement\"),\"ERROR in Columns F & J---Can only use NA for Test Fuel if Certification is based on a Statement\",IF(AND(A21<>\"\",J21=\"Yes\",I21<>\"Phase 2\"),\"ERROR--Test fuel must be Phase 2 for 2015-2016 Carryover PZEV Option 1 (Rig test) evaporative families\",IF(AND(A21<>\"\",J21=\"Yes\",C21<>0.35,C21<>0.5,C21<>0.75),\"ERROR--FEL must be 0.350, 0.500 or 0.750 for 2015-2016 Carryover PZEV Option 1 (Rig test) evaporative families\",IF(AND(A21<>\"\",J21=\"Yes\",B21<>\"LDV/LDT1\",B21<>\"LDT2\",B21<>\"HLDT/MDPV\"),\"ERROR--Vehicle class must be LDV/LDT1 or LDT2 or HLDT/MDPV for 2015-2016 Carryover PZEV Option 1 (Rig test) evaporative families\",IF(AND(A21<>\"\",$C$8>2019,J21=\"Yes\",L21<>\"Yes\"),\"ERROR--Can't use Carryover data from 2015-2016 PZEV Option 1 (Rig test) using Phase 2 test fuel after 2019MY (or after 2021MY if used as an Early Allowance)\",IF(AND(A21<>\"\",K21=\"Yes\",I21<>\"LEV 3\"),\"ERROR--Test fuel must be LEV 3 for 2015-2016 Carryover LEV3 Option 1 (Rig test) evaporative families\",IF(AND(A21<>\"\",K21=\"Yes\",C21<>0.35,C21<>0.5,C21<>0.75),\"ERROR--FEL must be 0.350, 0.500 or 0.750 for 2015-2016 Carryover LEV3 Option 1 (Rig test) evaporative families\",IF(AND(A21<>\"\",$C$8>2021,K21=\"Yes\"),\"ERROR--Can't use Carryover data from 2015-2016 CARB LEV3 Option 1 (Rig test) using LEV 3 test fuel after 2021MY\",IF(AND(A21<>\"\",B21<>\"LDV/LDT1\",G21=120),\"ERROR--Useful Life must be 150,000 miles for this Tier 3 Evaporative Family\",IF(AND(A21<>\"\",L21=\"Yes\",M21<>2015,M21<>2016,M21<>2017),\"FIX Model Year Early Allowance was earned\",IF(AND(A21<>\"\",L21=\"No\",M21<>\"\",M21<>\"NA\"),\"Error in cols M & N---column M indicates No Allowance but Column N indicates an allowance was earned\",IF(AND(A21<>\"\",L21=\"Yes\",B21<>\"HDV\",B21<>\"HLDT Allowance only\",B21<>\"MDPV Allowance only\",M21=2017),\"ERROR--Early allowances can't be earned in 2017MY for LDV/LDT1 and LDT2 Evaporative Families\",IF(AND(A21<>\"\",$C$8=2017,N21=\"\"),\"FIX Federal Prod'n--needed for 2017MY compliance\",IF(AND(A21<>\"\",$C$8<>2017,L21=\"No\",O21=\"\"),\"FIX 50-St Prod'n\",IF(AND(A21<>\"\",B21=\"HLDT Allowance only\",L21<>\"Yes\"),\"ERROR - Cols B & M--Column B indicates an Allowance is being used but Column M indicates No Allowance\",IF(AND(A21<>\"\",B21=\"MDPV Allowance only\",L21<>\"Yes\"),\"ERROR - Cols B & M--Column B indicates an Allowance is being use but Column M indicates No Allowance\",IF(AND(A21<>\"\",B21=\"HDV\",D21<> \"2b\", L21=\"Yes\",F21 =\"\"),\"FIX Column G 'HDV also meets ORVR Standards'---needed for HDV Class 3 and above Allowances\",IF(AND(A21<>\"\",B21=\"HDV\",D21<> \"2b\", L21=\"Yes\",F21 =\"Yes\"), 2*O21,IF(AND(A21<>\"\",L21=\"Yes\",B21=\"LDV/LDT1\"),N21,IF(AND(A21<>\"\",L21=\"Yes\",B21=\"LDT2\"),N21,IF(AND(A21<>\"\",L21=\"Yes\",B21=\"HLDT Allowance only\"),N21,IF(AND(A21<>\"\",L21=\"No\",$C$8=2017),N21,O21))))))))))))))))))))))))))))))))))))))))))))))","v":39458},{"$f":"IF(AND(A21=\"\",N21<>\"\"),\"FIX TEST GROUP\",IF(AND(A21=\"\",O21<>\"\"),\"FIX TEST GROUP\",IF(A21=\"\",\"\", IF(B21=\"\",\"FIX CLASS\",IF(C21=\"\",\"FIX FEL\",IF(G21=\"\",\"FIX U/L Miles\",IF(I21=\"\",\"FIX Test Fuel\",IF(J21=\"\",\"FIX PZEV Carryover\",IF(K21=\"\",\"FIX CARB Opt 1 Carryover\",IF(L21=\"\",\"FIX Allowance Y/N\",IF(M21=\"\",\"FIX Allowance MY\",IF(Y21=\"\",\"FIX PROD'N in Column Q\",Y21*X21))))))))))))","v":5918.7},{"$f":"IF(A21=\"\",\"\",IF(AND(A21<>\"\",B21=\"LDV/LDT1\",C21<=0.5),\"OK\",IF(AND(A21<>\"\",B21=\"LDT2\",C21<=0.65),\"OK\",IF(AND(A21<>\"\",B21=\"HLDT/MDPV\",C21<=0.9),\"OK\",IF(AND(A21<>\"\",B21=\"HLDT/MDPV\",C21>0.9,C21<=1),\"OK if HLDTs < 0.9\",IF(AND(A21<>\"\",B21=\"HDV\",D21=\"2b\",C21<=1.4),\"OK\",IF(AND(A21<>\"\",B21=\"HDV\",D21=3,C21<=1.4),\"OK\",IF(AND(A21<>\"\",B21=\"HDV\",C21<=1.9, D21>=4),\"OK\",IF(AND(A21<>\"\",B21=\"HLDT Allowance only\"),\"OK\",IF(AND(A21<>\"\",B21=\"MDPV Allowance only\"),\"OK\",\"FEL exceeds CAP\"))))))))))","v":"OK"},{"$f":"IF(ISNUMBER(Y21)=TRUE, \"\", Y21)","v":""}]
["B","LDV/LDT1",0.15,null,null,null,120,150,"Tier 3","No","No","No","NA",null,20382,null,null,null,null,null,null,null,{"$f":"IF(A22=\"\",\"\", IF(B22=\"LDV/LDT1\", 0.3,  IF(B22=\"LDT2\", 0.4, IF(OR(B22=\"HLDT/MDPV\",B22=\"HLDT Allowance only\", B22=\"MDPV Allowance only\"), 0.5, IF(B22=\"HDV\", 0.6,   ERROR)))))","v":0.3},0.15,{"$f":"IF(A22=\"\",\"\",IF(AND(A22<>\"\",L22=\"Yes\",$C$8>2021),\"ERROR--Can't Use Early Allowances after 2021MY\",\nIF(AND(A22<>\"\",B22=\"HLDT Allowance only\",$C$8=2017),\"Can't Use HLDT Allowance before 2018MY\",IF(AND(A22<>\"\",B22=\"MDPV Allowance only\",$C$8=2017),\"Can't Use MDPV Allowance before 2018MY\",IF(AND(A22<>\"\",B22=\"HLDT/MDPV\",$C$8=2017),\"Can't Use HLDT/MDPV Allowance before 2018MY\",IF(AND(A22<>\"\",B22=\"HDV\",$C$8=2017),\"Can't Use HDV Allowance before 2018MY\",IF(AND(A22<>\"\",L22=\"Yes\",J22<>\"Yes\",K22<>\"Yes\",C22>W22),\"ERROR--Early Allowance evaporative family does not comply with Tier 3 standards and is not a 2015 or 2016 Carryover PZEV or Carryover LEV3 Option 1 (Rig Test) Evap family\",IF(AND(A22<>\"\",L22=\"Yes\",B22=\"HDV\",O22=\"\"),\"FIX 50-St Prod'n--needed for HDV Allowances\",IF(AND(A22<>\"\",B22=\"MDPV Allowance only\",O22=\"\"),\"FIX 50-St Prod'n--needed for MDPV early allowances\",IF(AND(A22<>\"\",L22=\"Yes\",B22=\"LDV/LDT1\",N22=\"\"),\"FIX Fed Prod'n--needed for LDV/LDT1 early allowances\",IF(AND(A22<>\"\",L22=\"Yes\",B22=\"LDT2\",N22=\"\"),\"FIX Fed Prod'n--needed for LDT2 early allowances\",IF(AND(A22<>\"\",L22=\"Yes\",B22=\"HLDT Allowance only\",N22=\"\"),\"FIX Fed Prod'n--needed for HLDT early allowances\",IF(AND(A22<>\"\",L22=\"Yes\",B22=\"HLDT/MDPV\"),\"ERROR in Col B--must use HLDT Allowance only or MDPV Allowance only value from Column B menu and corresponding production values for HLDT Allowances or MDPV Allowances as applicable\",IF(AND(A22<>\"\",B22=\"HDV\",D22=\"\"),\"ERROR--Column B is HDV but HDV Class in Column E is Blank\",IF(AND(A22<>\"\",B22<>\"\",B22<>\"HDV\",D22<>\"\"),\"ERROR--Column B is not HDV but you entered a HDV Class in Column E\",IF(AND(A22<>\"\",B22=\"HDV\",D22=4,E22=\"\"),\"ERROR--Column E indicates HDV Class 4-8 but Certification Basis in Column F is Blank\",IF(AND(A22<>\"\",B22=\"HDV\",D22=5,E22=\"\"),\"ERROR--Column E indicates HDV Class 4-8 but Certification Basis in Column F is Blank\",IF(AND(A22<>\"\",B22=\"HDV\",D22=6,E22=\"\"),\"ERROR--Column E indicates HDV Class 4-8 but Certification Basis in Column F is Blank\",IF(AND(A22<>\"\",B22=\"HDV\",D22=7,E22=\"\"),\"ERROR--Column E indicates HDV Class 4-8 but Certification Basis in Column F is Blank\",IF(AND(A22<>\"\",B22=\"HDV\",D22=8,E22=\"\"),\"ERROR--Column E indicates HDV Class 4-8 but Certification Basis in Column F is Blank\",IF(AND(A22<>\"\",D22=\"2b\",E22=\"Statement\"),\"ERROR in Columns E & F---Can't use Statement for Certification Basis of Class 2b HDVs\",IF(AND(A22<>\"\",D22=3,E22=\"Statement\"),\"ERROR in Columns E & F---Can't use Statement for Certification Basis of Class 3 HDVs\",IF(AND(A22<>\"\",B22<>\"HDV\",E22=\"Statement\"),\"ERROR in Columns B & F---Can only use Statement as the Certification Basis of Class 4 and above HDVs\",IF(AND(A22<>\"\",I22=\"Phase 2\",J22=\"No\"),\"ERROR--Can only use Phase 2 test fuel for 2015-2016 Carryover PZEV Option 1 (Rig Test) Evaporative Families\",IF(AND(A22<>\"\",I22=\"NA\",E22<>\"Statement\"),\"ERROR in Columns F & J---Can only use NA for Test Fuel if Certification is based on a Statement\",IF(AND(A22<>\"\",J22=\"Yes\",I22<>\"Phase 2\"),\"ERROR--Test fuel must be Phase 2 for 2015-2016 Carryover PZEV Option 1 (Rig test) evaporative families\",IF(AND(A22<>\"\",J22=\"Yes\",C22<>0.35,C22<>0.5,C22<>0.75),\"ERROR--FEL must be 0.350, 0.500 or 0.750 for 2015-2016 Carryover PZEV Option 1 (Rig test) evaporative families\",IF(AND(A22<>\"\",J22=\"Yes\",B22<>\"LDV/LDT1\",B22<>\"LDT2\",B22<>\"HLDT/MDPV\"),\"ERROR--Vehicle class must be LDV/LDT1 or LDT2 or HLDT/MDPV for 2015-2016 Carryover PZEV Option 1 (Rig test) evaporative families\",IF(AND(A22<>\"\",$C$8>2019,J22=\"Yes\",L22<>\"Yes\"),\"ERROR--Can't use Carryover data from 2015-2016 PZEV Option 1 (Rig test) using Phase 2 test fuel after 2019MY (or after 2021MY if used as an Early Allowance)\",IF(AND(A22<>\"\",K22=\"Yes\",I22<>\"LEV 3\"),\"ERROR--Test fuel must be LEV 3 for 2015-2016 Carryover LEV3 Option 1 (Rig test) evaporative families\",IF(AND(A22<>\"\",K22=\"Yes\",C22<>0.35,C22<>0.5,C22<>0.75),\"ERROR--FEL must be 0.350, 0.500 or 0.750 for 2015-2016 Carryover LEV3 Option 1 (Rig test) evaporative families\",IF(AND(A22<>\"\",$C$8>2021,K22=\"Yes\"),\"ERROR--Can't use Carryover data from 2015-2016 CARB LEV3 Option 1 (Rig test) using LEV 3 test fuel after 2021MY\",IF(AND(A22<>\"\",B22<>\"LDV/LDT1\",G22=120),\"ERROR--Useful Life must be 150,000 miles for this Tier 3 Evaporative Family\",IF(AND(A22<>\"\",L22=\"Yes\",M22<>2015,M22<>2016,M22<>2017),\"FIX Model Year Early Allowance was earned\",IF(AND(A22<>\"\",L22=\"No\",M22<>\"\",M22<>\"NA\"),\"Error in cols M & N---column M indicates No Allowance but Column N indicates an allowance was earned\",IF(AND(A22<>\"\",L22=\"Yes\",B22<>\"HDV\",B22<>\"HLDT Allowance only\",B22<>\"MDPV Allowance only\",M22=2017),\"ERROR--Early allowances can't be earned in 2017MY for LDV/LDT1 and LDT2 Evaporative Families\",IF(AND(A22<>\"\",$C$8=2017,N22=\"\"),\"FIX Federal Prod'n--needed for 2017MY compliance\",IF(AND(A22<>\"\",$C$8<>2017,L22=\"No\",O22=\"\"),\"FIX 50-St Prod'n\",IF(AND(A22<>\"\",B22=\"HLDT Allowance only\",L22<>\"Yes\"),\"ERROR - Cols B & M--Column B indicates an Allowance is being used but Column M indicates No Allowance\",IF(AND(A22<>\"\",B22=\"MDPV Allowance only\",L22<>\"Yes\"),\"ERROR - Cols B & M--Column B indicates an Allowance is being use but Column M indicates No Allowance\",IF(AND(A22<>\"\",B22=\"HDV\",D22<> \"2b\", L22=\"Yes\",F22 =\"\"),\"FIX Column G 'HDV also meets ORVR Standards'---needed for HDV Class 3 and above Allowances\",IF(AND(A22<>\"\",B22=\"HDV\",D22<> \"2b\", L22=\"Yes\",F22 =\"Yes\"), 2*O22,IF(AND(A22<>\"\",L22=\"Yes\",B22=\"LDV/LDT1\"),N22,IF(AND(A22<>\"\",L22=\"Yes\",B22=\"LDT2\"),N22,IF(AND(A22<>\"\",L22=\"Yes\",B22=\"HLDT Allowance only\"),N22,IF(AND(A22<>\"\",L22=\"No\",$C$8=2017),N22,O22))))))))))))))))))))))))))))))))))))))))))))))","v":20382},{"$f":"IF(AND(A22=\"\",N22<>\"\"),\"FIX TEST GROUP\",IF(AND(A22=\"\",O22<>\"\"),\"FIX TEST GROUP\",IF(A22=\"\",\"\", IF(B22=\"\",\"FIX CLASS\",IF(C22=\"\",\"FIX FEL\",IF(G22=\"\",\"FIX U/L Miles\",IF(I22=\"\",\"FIX Test Fuel\",IF(J22=\"\",\"FIX PZEV Carryover\",IF(K22=\"\",\"FIX CARB Opt 1 Carryover\",IF(L22=\"\",\"FIX Allowance Y/N\",IF(M22=\"\",\"FIX Allowance MY\",IF(Y22=\"\",\"FIX PROD'N in Column Q\",Y22*X22))))))))))))","v":3057.2999999999997},"OK",""]
["C   (2015 PZEV)","LDV/LDT1",0.35,null,null,null,150,150,"Phase 2","Yes","No","Yes",2015,20000,null,"2015 PZEV Carryover & 2015 Early Allowance; [Allowance vehs not used  in Evap Phase-in calcs.]  [Formatted comments field cells to \"wrap text\" as shown in example comments for this cell.]",null,null,null,null,null,null,{"$f":"IF(A23=\"\",\"\", IF(B23=\"LDV/LDT1\", 0.3,  IF(B23=\"LDT2\", 0.4, IF(OR(B23=\"HLDT/MDPV\",B23=\"HLDT Allowance only\", B23=\"MDPV Allowance only\"), 0.5, IF(B23=\"HDV\", 0.6,   ERROR)))))","v":0.3},0.3,20000,6000,"OK",""]
["D","LDT2",0.3,null,null,null,150,150,"Tier 3","No","No","No","NA",null,45000,null,null,null,null,null,null,null,{"$f":"IF(A24=\"\",\"\", IF(B24=\"LDV/LDT1\", 0.3,  IF(B24=\"LDT2\", 0.4, IF(OR(B24=\"HLDT/MDPV\",B24=\"HLDT Allowance only\", B24=\"MDPV Allowance only\"), 0.5, IF(B24=\"HDV\", 0.6,   ERROR)))))","v":0.4},0.3,45000,13500,"OK",""]
["E","LDT2",0.35,null,null,null,150,150,"LEV 3","No","No","No","NA",null,79000,null,null,null,null,null,null,null,{"$f":"IF(A25=\"\",\"\", IF(B25=\"LDV/LDT1\", 0.3,  IF(B25=\"LDT2\", 0.4, IF(OR(B25=\"HLDT/MDPV\",B25=\"HLDT Allowance only\", B25=\"MDPV Allowance only\"), 0.5, IF(B25=\"HDV\", 0.6,   ERROR)))))","v":0.4},0.35,79000,27650,"OK",""]
["F   (2015 PZEV)","LDT2",0.5,null,null,null,150,150,"Phase 2","Yes","No","No","NA",null,10000,"2015 LDT2  PZEV Carryover",null,null,null,null,null,null,{"$f":"IF(A26=\"\",\"\", IF(B26=\"LDV/LDT1\", 0.3,  IF(B26=\"LDT2\", 0.4, IF(OR(B26=\"HLDT/MDPV\",B26=\"HLDT Allowance only\", B26=\"MDPV Allowance only\"), 0.5, IF(B26=\"HDV\", 0.6,   ERROR)))))","v":0.4},0.4,10000,4000,"OK",""]
["G","HLDT/MDPV",0.4,null,null,null,150,150,"Tier 3","No","No","No","NA",null,10000,null,null,null,null,null,null,null,{"$f":"IF(A27=\"\",\"\", IF(B27=\"LDV/LDT1\", 0.3,  IF(B27=\"LDT2\", 0.4, IF(OR(B27=\"HLDT/MDPV\",B27=\"HLDT Allowance only\", B27=\"MDPV Allowance only\"), 0.5, IF(B27=\"HDV\", 0.6,   ERROR)))))","v":0.5},0.4,10000,4000,"OK",""]
["H","HLDT/MDPV",0.5,null,null,null,150,150,"Tier 3","No","No","No","NA",null,90000,null,null,null,null,null,null,null,{"$f":"IF(A28=\"\",\"\", IF(B28=\"LDV/LDT1\", 0.3,  IF(B28=\"LDT2\", 0.4, IF(OR(B28=\"HLDT/MDPV\",B28=\"HLDT Allowance only\", B28=\"MDPV Allowance only\"), 0.5, IF(B28=\"HDV\", 0.6,   ERROR)))))","v":0.5},0.5,90000,45000,"OK",""]
["I (LEV3 Opt 1 HLDT Carryover)","HLDT/MDPV",0.75,null,null,null,150,150,"LEV 3","No","Yes","No","NA",null,3000,"2015 HLDT Carryover LEV3 Option 1 (Rig test) tested on LEV3 test fuel;",null,null,null,null,null,null,{"$f":"IF(A29=\"\",\"\", IF(B29=\"LDV/LDT1\", 0.3,  IF(B29=\"LDT2\", 0.4, IF(OR(B29=\"HLDT/MDPV\",B29=\"HLDT Allowance only\", B29=\"MDPV Allowance only\"), 0.5, IF(B29=\"HDV\", 0.6,   ERROR)))))","v":0.5},0.5,3000,1500,"OK",""]
["J   ","HLDT Allowance only",0.35,null,null,null,150,150,"LEV 3","No","No","Yes",2015,2049,null,"2015 Early Allowance (HLDT);  [Allowance vehs not used  in Evap Phase-in calcs]",null,null,null,null,null,null,{"$f":"IF(A30=\"\",\"\", IF(B30=\"LDV/LDT1\", 0.3,  IF(B30=\"LDT2\", 0.4, IF(OR(B30=\"HLDT/MDPV\",B30=\"HLDT Allowance only\", B30=\"MDPV Allowance only\"), 0.5, IF(B30=\"HDV\", 0.6,   ERROR)))))","v":0.5},0.35,2049,717.15,"OK",""]
["K","HLDT Allowance only",0.5,null,null,null,150,150,"LEV 3","No","No","Yes",2016,5000,null,"2016 Early Allowance (HLDT);  [Allowance vehs not used  in Evap Phase-in calcs]",null,null,null,null,null,null,{"$f":"IF(A31=\"\",\"\", IF(B31=\"LDV/LDT1\", 0.3,  IF(B31=\"LDT2\", 0.4, IF(OR(B31=\"HLDT/MDPV\",B31=\"HLDT Allowance only\", B31=\"MDPV Allowance only\"), 0.5, IF(B31=\"HDV\", 0.6,   ERROR)))))","v":0.5},0.5,5000,2500,"OK",""]
["L","MDPV Allowance only",0.4,null,null,null,150,150,"Tier 3","No","No","Yes",2017,null,10000,"2017 Early Allowance (MDPV);  [Allowance vehs not used  in Evap Phase-in calcs]",null,null,null,null,null,null,{"$f":"IF(A32=\"\",\"\", IF(B32=\"LDV/LDT1\", 0.3,  IF(B32=\"LDT2\", 0.4, IF(OR(B32=\"HLDT/MDPV\",B32=\"HLDT Allowance only\", B32=\"MDPV Allowance only\"), 0.5, IF(B32=\"HDV\", 0.6,   ERROR)))))","v":0.5},0.4,10000,4000,"OK",""]
["M  ","HDV",0.15,"2b",null,null,150,150,"Tier 3","No","No","No","NA",null,60000,null,null,null,null,null,null,null,{"$f":"IF(A33=\"\",\"\", IF(B33=\"LDV/LDT1\", 0.3,  IF(B33=\"LDT2\", 0.4, IF(OR(B33=\"HLDT/MDPV\",B33=\"HLDT Allowance only\", B33=\"MDPV Allowance only\"), 0.5, IF(B33=\"HDV\", 0.6,   ERROR)))))","v":0.6},0.15,60000,9000,"OK",""]
["N   (2017 Allowance)","HDV",0.35,"2b",null,null,150,150,"LEV 3","No","No","Yes",2017,null,2500,"2017 Early Allowance (HDV); certified to LEV3 Option 2 stds; not used in Evap Phase-in calcs",null,null,null,null,null,null,{"$f":"IF(A34=\"\",\"\", IF(B34=\"LDV/LDT1\", 0.3,  IF(B34=\"LDT2\", 0.4, IF(OR(B34=\"HLDT/MDPV\",B34=\"HLDT Allowance only\", B34=\"MDPV Allowance only\"), 0.5, IF(B34=\"HDV\", 0.6,   ERROR)))))","v":0.6},0.35,2500,875,"OK",""]
["O","HDV",1.2,3,null,null,150,150,"Tier 3","No","No","No","NA",null,45000,null,null,null,null,null,null,null,{"$f":"IF(A35=\"\",\"\", IF(B35=\"LDV/LDT1\", 0.3,  IF(B35=\"LDT2\", 0.4, IF(OR(B35=\"HLDT/MDPV\",B35=\"HLDT Allowance only\", B35=\"MDPV Allowance only\"), 0.5, IF(B35=\"HDV\", 0.6,   ERROR)))))","v":0.6},1.2,45000,54000,"OK",""]
["P (2016 Allowance which also meets ORVR standard)","HDV",0.55000000000000004,3,null,"Yes",150,150,"Tier 3","No","No","Yes",2016,null,2500,"2016 Early 2 for 1 Allowance (HDV class 3 & above veh certified to Evap&ORVR; not used in phase-in calcs)",null,null,null,null,null,null,{"$f":"IF(A36=\"\",\"\", IF(B36=\"LDV/LDT1\", 0.3,  IF(B36=\"LDT2\", 0.4, IF(OR(B36=\"HLDT/MDPV\",B36=\"HLDT Allowance only\", B36=\"MDPV Allowance only\"), 0.5, IF(B36=\"HDV\", 0.6,   ERROR)))))","v":0.6},0.55000000000000004,5000,2750,"OK",""]
["Q","HDV",0.5,4,"Statement",null,150,150,"NA","No","No","No","NA",null,2500,null,null,null,null,null,null,null,{"$f":"IF(A37=\"\",\"\", IF(B37=\"LDV/LDT1\", 0.3,  IF(B37=\"LDT2\", 0.4, IF(OR(B37=\"HLDT/MDPV\",B37=\"HLDT Allowance only\", B37=\"MDPV Allowance only\"), 0.5, IF(B37=\"HDV\", 0.6,   ERROR)))))","v":0.6},0.6,2500,1500,"OK",""]
["R","HDV",1.6,6,"Statement",null,150,150,"NA","No","No","No","NA",null,1000,null,null,null,null,null,null,null,{"$f":"IF(A38=\"\",\"\", IF(B38=\"LDV/LDT1\", 0.3,  IF(B38=\"LDT2\", 0.4, IF(OR(B38=\"HLDT/MDPV\",B38=\"HLDT Allowance only\", B38=\"MDPV Allowance only\"), 0.5, IF(B38=\"HDV\", 0.6,   ERROR)))))","v":0.6},1.6,1000,1600,"OK",""]
[null,null,null,null,null,null,null,null,null,null,null,null,null,null,null,null,null,null,null,null,null,null,{"$f":"IF(A39=\"\",\"\", IF(B39=\"LDV/LDT1\", 0.3,  IF(B39=\"LDT2\", 0.4, IF(OR(B39=\"HLDT/MDPV\",B39=\"HLDT Allowance only\", B39=\"MDPV Allowance only\"), 0.5, IF(B39=\"HDV\", 0.6,   ERROR)))))","v":""},"","","","",""]
[null,null,null,null,null,null,null,null,null,null,null,null,null,null,null,null,null,null,null,null,null,null,{"$f":"IF(A40=\"\",\"\", IF(B40=\"LDV/LDT1\", 0.3,  IF(B40=\"LDT2\", 0.4, IF(OR(B40=\"HLDT/MDPV\",B40=\"HLDT Allowance only\", B40=\"MDPV Allowance only\"), 0.5, IF(B40=\"HDV\", 0.6,   ERROR)))))","v":""},"","","","",""]
[null,null,null,null,null,null,null,null,null,null,null,null,null,null,null,null,null,null,null,null,null,null,{"$f":"IF(A41=\"\",\"\", IF(B41=\"LDV/LDT1\", 0.3,  IF(B41=\"LDT2\", 0.4, IF(OR(B41=\"HLDT/MDPV\",B41=\"HLDT Allowance only\", B41=\"MDPV Allowance only\"), 0.5, IF(B41=\"HDV\", 0.6,   ERROR)))))","v":""},"","","","",""]
[null,null,null,null,null,null,null,null,null,null,null,null,null,null,null,null,null,null,null,null,null,null,{"$f":"IF(A42=\"\",\"\", IF(B42=\"LDV/LDT1\", 0.3,  IF(B42=\"LDT2\", 0.4, IF(OR(B42=\"HLDT/MDPV\",B42=\"HLDT Allowance only\", B42=\"MDPV Allowance only\"), 0.5, IF(B42=\"HDV\", 0.6,   ERROR)))))","v":""},"","","","",""]
[null,null,null,null,null,null,null,null,null,null,null,null,null,null,null,null,null,null,null,null,null,null,{"$f":"IF(A43=\"\",\"\", IF(B43=\"LDV/LDT1\", 0.3,  IF(B43=\"LDT2\", 0.4, IF(OR(B43=\"HLDT/MDPV\",B43=\"HLDT Allowance only\", B43=\"MDPV Allowance only\"), 0.5, IF(B43=\"HDV\", 0.6,   ERROR)))))","v":""},"","","","",""]
[null,null,null,null,null,null,null,null,null,null,null,null,null,null,null,null,null,null,null,null,null,null,{"$f":"IF(A44=\"\",\"\", IF(B44=\"LDV/LDT1\", 0.3,  IF(B44=\"LDT2\", 0.4, IF(OR(B44=\"HLDT/MDPV\",B44=\"HLDT Allowance only\", B44=\"MDPV Allowance only\"), 0.5, IF(B44=\"HDV\", 0.6,   ERROR)))))","v":""},"","","","",""]
[null,null,null,null,null,null,null,null,null,null,null,null,null,null,null,null,null,null,null,null,null,null,{"$f":"IF(A45=\"\",\"\", IF(B45=\"LDV/LDT1\", 0.3,  IF(B45=\"LDT2\", 0.4, IF(OR(B45=\"HLDT/MDPV\",B45=\"HLDT Allowance only\", B45=\"MDPV Allowance only\"), 0.5, IF(B45=\"HDV\", 0.6,   ERROR)))))","v":""},"","","","",""]
[null,null,null,null,null,null,null,null,null,null,null,null,null,null,null,null,null,null,null,null,null,null,{"$f":"IF(A46=\"\",\"\", IF(B46=\"LDV/LDT1\", 0.3,  IF(B46=\"LDT2\", 0.4, IF(OR(B46=\"HLDT/MDPV\",B46=\"HLDT Allowance only\", B46=\"MDPV Allowance only\"), 0.5, IF(B46=\"HDV\", 0.6,   ERROR)))))","v":""},"","","","",""]
[null,null,null,null,null,null,null,null,null,null,null,null,null,null,null,null,null,null,null,null,null,null,{"$f":"IF(A47=\"\",\"\", IF(B47=\"LDV/LDT1\", 0.3,  IF(B47=\"LDT2\", 0.4, IF(OR(B47=\"HLDT/MDPV\",B47=\"HLDT Allowance only\", B47=\"MDPV Allowance only\"), 0.5, IF(B47=\"HDV\", 0.6,   ERROR)))))","v":""},"","","","",""]
[null,null,null,null,null,null,null,null,null,null,null,null,null,null,null,null,null,null,null,null,null,null,{"$f":"IF(A48=\"\",\"\", IF(B48=\"LDV/LDT1\", 0.3,  IF(B48=\"LDT2\", 0.4, IF(OR(B48=\"HLDT/MDPV\",B48=\"HLDT Allowance only\", B48=\"MDPV Allowance only\"), 0.5, IF(B48=\"HDV\", 0.6,   ERROR)))))","v":""},"","","","",""]
[null,null,null,null,null,null,null,null,null,null,null,null,null,null,null,null,null,null,null,null,null,null,{"$f":"IF(A49=\"\",\"\", IF(B49=\"LDV/LDT1\", 0.3,  IF(B49=\"LDT2\", 0.4, IF(OR(B49=\"HLDT/MDPV\",B49=\"HLDT Allowance only\", B49=\"MDPV Allowance only\"), 0.5, IF(B49=\"HDV\", 0.6,   ERROR)))))","v":""},"","","","",""]
[null,null,null,null,null,null,null,null,null,null,null,null,null,null,null,null,null,null,null,null,null,null,{"$f":"IF(A50=\"\",\"\", IF(B50=\"LDV/LDT1\", 0.3,  IF(B50=\"LDT2\", 0.4, IF(OR(B50=\"HLDT/MDPV\",B50=\"HLDT Allowance only\", B50=\"MDPV Allowance only\"), 0.5, IF(B50=\"HDV\", 0.6,   ERROR)))))","v":""},"","","","",""]
[null,null,null,null,null,null,null,null,null,null,null,null,null,null,null,null,null,null,null,null,null,null,{"$f":"IF(A51=\"\",\"\", IF(B51=\"LDV/LDT1\", 0.3,  IF(B51=\"LDT2\", 0.4, IF(OR(B51=\"HLDT/MDPV\",B51=\"HLDT Allowance only\", B51=\"MDPV Allowance only\"), 0.5, IF(B51=\"HDV\", 0.6,   ERROR)))))","v":""},"","","","",""]
[null,null,null,null,null,null,null,null,null,null,null,null,null,null,null,null,null,null,null,null,null,null,{"$f":"IF(A52=\"\",\"\", IF(B52=\"LDV/LDT1\", 0.3,  IF(B52=\"LDT2\", 0.4, IF(OR(B52=\"HLDT/MDPV\",B52=\"HLDT Allowance only\", B52=\"MDPV Allowance only\"), 0.5, IF(B52=\"HDV\", 0.6,   ERROR)))))","v":""},"","","","",""]
[null,null,null,null,null,null,null,null,null,null,null,null,null,null,null,null,null,null,null,null,null,null,{"$f":"IF(A53=\"\",\"\", IF(B53=\"LDV/LDT1\", 0.3,  IF(B53=\"LDT2\", 0.4, IF(OR(B53=\"HLDT/MDPV\",B53=\"HLDT Allowance only\", B53=\"MDPV Allowance only\"), 0.5, IF(B53=\"HDV\", 0.6,   ERROR)))))","v":""},"","","","",""]
[null,null,null,null,null,null,null,null,null,null,null,null,null,null,null,null,null,null,null,null,null,null,{"$f":"IF(A54=\"\",\"\", IF(B54=\"LDV/LDT1\", 0.3,  IF(B54=\"LDT2\", 0.4, IF(OR(B54=\"HLDT/MDPV\",B54=\"HLDT Allowance only\", B54=\"MDPV Allowance only\"), 0.5, IF(B54=\"HDV\", 0.6,   ERROR)))))","v":""},"","","","",""]
[null,null,null,null,null,null,null,null,null,null,null,null,null,null,null,null,null,null,null,null,null,null,{"$f":"IF(A55=\"\",\"\", IF(B55=\"LDV/LDT1\", 0.3,  IF(B55=\"LDT2\", 0.4, IF(OR(B55=\"HLDT/MDPV\",B55=\"HLDT Allowance only\", B55=\"MDPV Allowance only\"), 0.5, IF(B55=\"HDV\", 0.6,   ERROR)))))","v":""},"","","","",""]
[null,null,null,null,null,null,null,null,null,null,null,null,null,null,null,null,null,null,null,null,null,null,{"$f":"IF(A56=\"\",\"\", IF(B56=\"LDV/LDT1\", 0.3,  IF(B56=\"LDT2\", 0.4, IF(OR(B56=\"HLDT/MDPV\",B56=\"HLDT Allowance only\", B56=\"MDPV Allowance only\"), 0.5, IF(B56=\"HDV\", 0.6,   ERROR)))))","v":""},"","","","",""]
[null,null,null,null,null,null,null,null,null,null,null,null,null,null,null,null,null,null,null,null,null,null,{"$f":"IF(A57=\"\",\"\", IF(B57=\"LDV/LDT1\", 0.3,  IF(B57=\"LDT2\", 0.4, IF(OR(B57=\"HLDT/MDPV\",B57=\"HLDT Allowance only\", B57=\"MDPV Allowance only\"), 0.5, IF(B57=\"HDV\", 0.6,   ERROR)))))","v":""},"","","","",""]
[null,null,null,null,null,null,null,null,null,null,null,null,null,null,null,null,null,null,null,null,null,null,{"$f":"IF(A58=\"\",\"\", IF(B58=\"LDV/LDT1\", 0.3,  IF(B58=\"LDT2\", 0.4, IF(OR(B58=\"HLDT/MDPV\",B58=\"HLDT Allowance only\", B58=\"MDPV Allowance only\"), 0.5, IF(B58=\"HDV\", 0.6,   ERROR)))))","v":""},"","","","",""]
[null,null,null,null,null,null,null,null,null,null,null,null,null,null,null,null,null,null,null,null,null,null,{"$f":"IF(A59=\"\",\"\", IF(B59=\"LDV/LDT1\", 0.3,  IF(B59=\"LDT2\", 0.4, IF(OR(B59=\"HLDT/MDPV\",B59=\"HLDT Allowance only\", B59=\"MDPV Allowance only\"), 0.5, IF(B59=\"HDV\", 0.6,   ERROR)))))","v":""},"","","","",""]
[null,null,null,null,null,null,null,null,null,null,null,null,null,null,null,null,null,null,null,null,null,null,{"$f":"IF(A60=\"\",\"\", IF(B60=\"LDV/LDT1\", 0.3,  IF(B60=\"LDT2\", 0.4, IF(OR(B60=\"HLDT/MDPV\",B60=\"HLDT Allowance only\", B60=\"MDPV Allowance only\"), 0.5, IF(B60=\"HDV\", 0.6,   ERROR)))))","v":""},"","","","",""]
[null,null,null,null,null,null,null,null,null,null,null,null,null,null,null,null,null,null,null,null,null,null,{"$f":"IF(A61=\"\",\"\", IF(B61=\"LDV/LDT1\", 0.3,  IF(B61=\"LDT2\", 0.4, IF(OR(B61=\"HLDT/MDPV\",B61=\"HLDT Allowance only\", B61=\"MDPV Allowance only\"), 0.5, IF(B61=\"HDV\", 0.6,   ERROR)))))","v":""},"","","","",""]
[null,null,null,null,null,null,null,null,null,null,null,null,null,null,null,null,null,null,null,null,null,null,{"$f":"IF(A62=\"\",\"\", IF(B62=\"LDV/LDT1\", 0.3,  IF(B62=\"LDT2\", 0.4, IF(OR(B62=\"HLDT/MDPV\",B62=\"HLDT Allowance only\", B62=\"MDPV Allowance only\"), 0.5, IF(B62=\"HDV\", 0.6,   ERROR)))))","v":""},"","","","",""]
[null,null,null,null,null,null,null,null,null,null,null,null,null,null,null,null,null,null,null,null,null,null,{"$f":"IF(A63=\"\",\"\", IF(B63=\"LDV/LDT1\", 0.3,  IF(B63=\"LDT2\", 0.4, IF(OR(B63=\"HLDT/MDPV\",B63=\"HLDT Allowance only\", B63=\"MDPV Allowance only\"), 0.5, IF(B63=\"HDV\", 0.6,   ERROR)))))","v":""},"","","","",""]
[null,null,null,null,null,null,null,null,null,null,null,null,null,null,null,null,null,null,null,null,null,null,{"$f":"IF(A64=\"\",\"\", IF(B64=\"LDV/LDT1\", 0.3,  IF(B64=\"LDT2\", 0.4, IF(OR(B64=\"HLDT/MDPV\",B64=\"HLDT Allowance only\", B64=\"MDPV Allowance only\"), 0.5, IF(B64=\"HDV\", 0.6,   ERROR)))))","v":""},"","","","",""]
[null,null,null,null,null,null,null,null,null,null,null,null,null,null,null,null,null,null,null,null,null,null,{"$f":"IF(A65=\"\",\"\", IF(B65=\"LDV/LDT1\", 0.3,  IF(B65=\"LDT2\", 0.4, IF(OR(B65=\"HLDT/MDPV\",B65=\"HLDT Allowance only\", B65=\"MDPV Allowance only\"), 0.5, IF(B65=\"HDV\", 0.6,   ERROR)))))","v":""},"","","","",""]
[null,null,null,null,null,null,null,null,null,null,null,null,null,null,null,null,null,null,null,null,null,null,{"$f":"IF(A66=\"\",\"\", IF(B66=\"LDV/LDT1\", 0.3,  IF(B66=\"LDT2\", 0.4, IF(OR(B66=\"HLDT/MDPV\",B66=\"HLDT Allowance only\", B66=\"MDPV Allowance only\"), 0.5, IF(B66=\"HDV\", 0.6,   ERROR)))))","v":""},"","","","",""]
[null,null,null,null,null,null,null,null,null,null,null,null,null,null,null,null,null,null,null,null,null,null,{"$f":"IF(A67=\"\",\"\", IF(B67=\"LDV/LDT1\", 0.3,  IF(B67=\"LDT2\", 0.4, IF(OR(B67=\"HLDT/MDPV\",B67=\"HLDT Allowance only\", B67=\"MDPV Allowance only\"), 0.5, IF(B67=\"HDV\", 0.6,   ERROR)))))","v":""},"","","","",""]
[null,null,null,null,null,null,null,null,null,null,null,null,null,null,null,null,null,null,null,null,null,null,{"$f":"IF(A68=\"\",\"\", IF(B68=\"LDV/LDT1\", 0.3,  IF(B68=\"LDT2\", 0.4, IF(OR(B68=\"HLDT/MDPV\",B68=\"HLDT Allowance only\", B68=\"MDPV Allowance only\"), 0.5, IF(B68=\"HDV\", 0.6,   ERROR)))))","v":""},"","","","",""]
[null,null,null,null,null,null,null,null,null,null,null,null,null,null,null,null,null,null,null,null,null,null,{"$f":"IF(A69=\"\",\"\", IF(B69=\"LDV/LDT1\", 0.3,  IF(B69=\"LDT2\", 0.4, IF(OR(B69=\"HLDT/MDPV\",B69=\"HLDT Allowance only\", B69=\"MDPV Allowance only\"), 0.5, IF(B69=\"HDV\", 0.6,   ERROR)))))","v":""},"","","","",""]
[null,null,null,null,null,null,null,null,null,null,null,null,null,null,null,null,null,null,null,null,null,null,{"$f":"IF(A70=\"\",\"\", IF(B70=\"LDV/LDT1\", 0.3,  IF(B70=\"LDT2\", 0.4, IF(OR(B70=\"HLDT/MDPV\",B70=\"HLDT Allowance only\", B70=\"MDPV Allowance only\"), 0.5, IF(B70=\"HDV\", 0.6,   ERROR)))))","v":""},"","","","",""]
[null,null,null,null,null,null,null,null,null,null,null,null,null,null,null,null,null,null,null,null,null,null,{"$f":"IF(A71=\"\",\"\", IF(B71=\"LDV/LDT1\", 0.3,  IF(B71=\"LDT2\", 0.4, IF(OR(B71=\"HLDT/MDPV\",B71=\"HLDT Allowance only\", B71=\"MDPV Allowance only\"), 0.5, IF(B71=\"HDV\", 0.6,   ERROR)))))","v":""},"","","","",""]
[null,null,null,null,null,null,null,null,null,null,null,null,null,null,null,null,null,null,null,null,null,null,{"$f":"IF(A72=\"\",\"\", IF(B72=\"LDV/LDT1\", 0.3,  IF(B72=\"LDT2\", 0.4, IF(OR(B72=\"HLDT/MDPV\",B72=\"HLDT Allowance only\", B72=\"MDPV Allowance only\"), 0.5, IF(B72=\"HDV\", 0.6,   ERROR)))))","v":""},"","","","",""]
[null,null,null,null,null,null,null,null,null,null,null,null,null,null,null,null,null,null,null,null,null,null,{"$f":"IF(A73=\"\",\"\", IF(B73=\"LDV/LDT1\", 0.3,  IF(B73=\"LDT2\", 0.4, IF(OR(B73=\"HLDT/MDPV\",B73=\"HLDT Allowance only\", B73=\"MDPV Allowance only\"), 0.5, IF(B73=\"HDV\", 0.6,   ERROR)))))","v":""},"","","","",""]
[null,null,null,null,null,null,null,null,null,null,null,null,null,null,null,null,null,null,null,null,null,null,{"$f":"IF(A74=\"\",\"\", IF(B74=\"LDV/LDT1\", 0.3,  IF(B74=\"LDT2\", 0.4, IF(OR(B74=\"HLDT/MDPV\",B74=\"HLDT Allowance only\", B74=\"MDPV Allowance only\"), 0.5, IF(B74=\"HDV\", 0.6,   ERROR)))))","v":""},"","","","",""]
[null,null,null,null,null,null,null,null,null,null,null,null,null,null,null,null,null,null,null,null,null,null,{"$f":"IF(A75=\"\",\"\", IF(B75=\"LDV/LDT1\", 0.3,  IF(B75=\"LDT2\", 0.4, IF(OR(B75=\"HLDT/MDPV\",B75=\"HLDT Allowance only\", B75=\"MDPV Allowance only\"), 0.5, IF(B75=\"HDV\", 0.6,   ERROR)))))","v":""},"","","","",""]
[null,null,null,null,null,null,null,null,null,null,null,null,null,null,null,null,null,null,null,null,null,null,{"$f":"IF(A76=\"\",\"\", IF(B76=\"LDV/LDT1\", 0.3,  IF(B76=\"LDT2\", 0.4, IF(OR(B76=\"HLDT/MDPV\",B76=\"HLDT Allowance only\", B76=\"MDPV Allowance only\"), 0.5, IF(B76=\"HDV\", 0.6,   ERROR)))))","v":""},"","","","",""]
[null,null,null,null,null,null,null,null,null,null,null,null,null,null,null,null,null,null,null,null,null,null,{"$f":"IF(A77=\"\",\"\", IF(B77=\"LDV/LDT1\", 0.3,  IF(B77=\"LDT2\", 0.4, IF(OR(B77=\"HLDT/MDPV\",B77=\"HLDT Allowance only\", B77=\"MDPV Allowance only\"), 0.5, IF(B77=\"HDV\", 0.6,   ERROR)))))","v":""},"","","","",""]
[null,null,null,null,null,null,null,null,null,null,null,null,null,null,null,null,null,null,null,null,null,null,{"$f":"IF(A78=\"\",\"\", IF(B78=\"LDV/LDT1\", 0.3,  IF(B78=\"LDT2\", 0.4, IF(OR(B78=\"HLDT/MDPV\",B78=\"HLDT Allowance only\", B78=\"MDPV Allowance only\"), 0.5, IF(B78=\"HDV\", 0.6,   ERROR)))))","v":""},"","","","",""]
[null,null,null,null,null,null,null,null,null,null,null,null,null,null,null,null,null,null,null,null,null,null,{"$f":"IF(A79=\"\",\"\", IF(B79=\"LDV/LDT1\", 0.3,  IF(B79=\"LDT2\", 0.4, IF(OR(B79=\"HLDT/MDPV\",B79=\"HLDT Allowance only\", B79=\"MDPV Allowance only\"), 0.5, IF(B79=\"HDV\", 0.6,   ERROR)))))","v":""},"","","","",""]
[null,null,null,null,null,null,null,null,null,null,null,null,null,null,null,null,null,null,null,null,null,null,{"$f":"IF(A80=\"\",\"\", IF(B80=\"LDV/LDT1\", 0.3,  IF(B80=\"LDT2\", 0.4, IF(OR(B80=\"HLDT/MDPV\",B80=\"HLDT Allowance only\", B80=\"MDPV Allowance only\"), 0.5, IF(B80=\"HDV\", 0.6,   ERROR)))))","v":""},"","","","",""]
[null,null,null,null,null,null,null,null,null,null,null,null,null,null,null,null,null,null,null,null,null,null,{"$f":"IF(A81=\"\",\"\", IF(B81=\"LDV/LDT1\", 0.3,  IF(B81=\"LDT2\", 0.4, IF(OR(B81=\"HLDT/MDPV\",B81=\"HLDT Allowance only\", B81=\"MDPV Allowance only\"), 0.5, IF(B81=\"HDV\", 0.6,   ERROR)))))","v":""},"","","","",""]
[null,null,null,null,null,null,null,null,null,null,null,null,null,null,null,null,null,null,null,null,null,null,{"$f":"IF(A82=\"\",\"\", IF(B82=\"LDV/LDT1\", 0.3,  IF(B82=\"LDT2\", 0.4, IF(OR(B82=\"HLDT/MDPV\",B82=\"HLDT Allowance only\", B82=\"MDPV Allowance only\"), 0.5, IF(B82=\"HDV\", 0.6,   ERROR)))))","v":""},"","","","",""]
[null,null,null,null,null,null,null,null,null,null,null,null,null,null,null,null,null,null,null,null,null,null,{"$f":"IF(A83=\"\",\"\", IF(B83=\"LDV/LDT1\", 0.3,  IF(B83=\"LDT2\", 0.4, IF(OR(B83=\"HLDT/MDPV\",B83=\"HLDT Allowance only\", B83=\"MDPV Allowance only\"), 0.5, IF(B83=\"HDV\", 0.6,   ERROR)))))","v":""},"","","","",""]
[null,null,null,null,null,null,null,null,null,null,null,null,null,null,null,null,null,null,null,null,null,null,{"$f":"IF(A84=\"\",\"\", IF(B84=\"LDV/LDT1\", 0.3,  IF(B84=\"LDT2\", 0.4, IF(OR(B84=\"HLDT/MDPV\",B84=\"HLDT Allowance only\", B84=\"MDPV Allowance only\"), 0.5, IF(B84=\"HDV\", 0.6,   ERROR)))))","v":""},"","","","",""]
[null,null,null,null,null,null,null,null,null,null,null,null,null,null,null,null,null,null,null,null,null,null,{"$f":"IF(A85=\"\",\"\", IF(B85=\"LDV/LDT1\", 0.3,  IF(B85=\"LDT2\", 0.4, IF(OR(B85=\"HLDT/MDPV\",B85=\"HLDT Allowance only\", B85=\"MDPV Allowance only\"), 0.5, IF(B85=\"HDV\", 0.6,   ERROR)))))","v":""},{"$f":"IF(A85=\"\", \"\", IF(J85 = \"Yes\", W85, IF(K85=\"Yes\", W85, IF(AND(A85<>\"\",B85=\"HDV\",E85=\"Statement\"), MAX(C85, W85),C85))))","v":""},{"$f":"IF(A85=\"\",\"\",IF(AND(A85<>\"\",L85=\"Yes\",$C$8>2021),\"ERROR--Can't Use Early Allowances after 2021MY\",\nIF(AND(A85<>\"\",B85=\"HLDT Allowance only\",$C$8=2017),\"Can't Use HLDT Allowance before 2018MY\",IF(AND(A85<>\"\",B85=\"MDPV Allowance only\",$C$8=2017),\"Can't Use MDPV Allowance before 2018MY\",IF(AND(A85<>\"\",B85=\"HLDT/MDPV\",$C$8=2017),\"Can't Use HLDT/MDPV Allowance before 2018MY\",IF(AND(A85<>\"\",B85=\"HDV\",$C$8=2017),\"Can't Use HDV Allowance before 2018MY\",IF(AND(A85<>\"\",L85=\"Yes\",J85<>\"Yes\",K85<>\"Yes\",C85>W85),\"ERROR--Early Allowance evaporative family does not comply with Tier 3 standards and is not a 2015 or 2016 Carryover PZEV or Carryover LEV3 Option 1 (Rig Test) Evap family\",IF(AND(A85<>\"\",L85=\"Yes\",B85=\"HDV\",O85=\"\"),\"FIX 50-St Prod'n--needed for HDV Allowances\",IF(AND(A85<>\"\",B85=\"MDPV Allowance only\",O85=\"\"),\"FIX 50-St Prod'n--needed for MDPV early allowances\",IF(AND(A85<>\"\",L85=\"Yes\",B85=\"LDV/LDT1\",N85=\"\"),\"FIX Fed Prod'n--needed for LDV/LDT1 early allowances\",IF(AND(A85<>\"\",L85=\"Yes\",B85=\"LDT2\",N85=\"\"),\"FIX Fed Prod'n--needed for LDT2 early allowances\",IF(AND(A85<>\"\",L85=\"Yes\",B85=\"HLDT Allowance only\",N85=\"\"),\"FIX Fed Prod'n--needed for HLDT early allowances\",IF(AND(A85<>\"\",L85=\"Yes\",B85=\"HLDT/MDPV\"),\"ERROR in Col B--must use HLDT Allowance only or MDPV Allowance only value from Column B menu and corresponding production values for HLDT Allowances or MDPV Allowances as applicable\",IF(AND(A85<>\"\",B85=\"HDV\",D85=\"\"),\"ERROR--Column B is HDV but HDV Class in Column E is Blank\",IF(AND(A85<>\"\",B85<>\"\",B85<>\"HDV\",D85<>\"\"),\"ERROR--Column B is not HDV but you entered a HDV Class in Column E\",IF(AND(A85<>\"\",B85=\"HDV\",D85=4,E85=\"\"),\"ERROR--Column E indicates HDV Class 4-8 but Certification Basis in Column F is Blank\",IF(AND(A85<>\"\",B85=\"HDV\",D85=5,E85=\"\"),\"ERROR--Column E indicates HDV Class 4-8 but Certification Basis in Column F is Blank\",IF(AND(A85<>\"\",B85=\"HDV\",D85=6,E85=\"\"),\"ERROR--Column E indicates HDV Class 4-8 but Certification Basis in Column F is Blank\",IF(AND(A85<>\"\",B85=\"HDV\",D85=7,E85=\"\"),\"ERROR--Column E indicates HDV Class 4-8 but Certification Basis in Column F is Blank\",IF(AND(A85<>\"\",B85=\"HDV\",D85=8,E85=\"\"),\"ERROR--Column E indicates HDV Class 4-8 but Certification Basis in Column F is Blank\",IF(AND(A85<>\"\",D85=\"2b\",E85=\"Statement\"),\"ERROR in Columns E & F---Can't use Statement for Certification Basis of Class 2b HDVs\",IF(AND(A85<>\"\",D85=3,E85=\"Statement\"),\"ERROR in Columns E & F---Can't use Statement for Certification Basis of Class 3 HDVs\",IF(AND(A85<>\"\",B85<>\"HDV\",E85=\"Statement\"),\"ERROR in Columns B & F---Can only use Statement as the Certification Basis of Class 4 and above HDVs\",IF(AND(A85<>\"\",I85=\"Phase 2\",J85=\"No\"),\"ERROR--Can only use Phase 2 test fuel for 2015-2016 Carryover PZEV Option 1 (Rig Test) Evaporative Families\",IF(AND(A85<>\"\",I85=\"NA\",E85<>\"Statement\"),\"ERROR in Columns F & J---Can only use NA for Test Fuel if Certification is based on a Statement\",IF(AND(A85<>\"\",J85=\"Yes\",I85<>\"Phase 2\"),\"ERROR--Test fuel must be Phase 2 for 2015-2016 Carryover PZEV Option 1 (Rig test) evaporative families\",IF(AND(A85<>\"\",J85=\"Yes\",C85<>0.35,C85<>0.5,C85<>0.75),\"ERROR--FEL must be 0.350, 0.500 or 0.750 for 2015-2016 Carryover PZEV Option 1 (Rig test) evaporative families\",IF(AND(A85<>\"\",J85=\"Yes\",B85<>\"LDV/LDT1\",B85<>\"LDT2\",B85<>\"HLDT/MDPV\"),\"ERROR--Vehicle class must be LDV/LDT1 or LDT2 or HLDT/MDPV for 2015-2016 Carryover PZEV Option 1 (Rig test) evaporative families\",IF(AND(A85<>\"\",$C$8>2019,J85=\"Yes\",L85<>\"Yes\"),\"ERROR--Can't use Carryover data from 2015-2016 PZEV Option 1 (Rig test) using Phase 2 test fuel after 2019MY (or after 2021MY if used as an Early Allowance)\",IF(AND(A85<>\"\",K85=\"Yes\",I85<>\"LEV 3\"),\"ERROR--Test fuel must be LEV 3 for 2015-2016 Carryover LEV3 Option 1 (Rig test) evaporative families\",IF(AND(A85<>\"\",K85=\"Yes\",C85<>0.35,C85<>0.5,C85<>0.75),\"ERROR--FEL must be 0.350, 0.500 or 0.750 for 2015-2016 Carryover LEV3 Option 1 (Rig test) evaporative families\",IF(AND(A85<>\"\",$C$8>2021,K85=\"Yes\"),\"ERROR--Can't use Carryover data from 2015-2016 CARB LEV3 Option 1 (Rig test) using LEV 3 test fuel after 2021MY\",IF(AND(A85<>\"\",B85<>\"LDV/LDT1\",G85=120),\"ERROR--Useful Life must be 150,000 miles for this Tier 3 Evaporative Family\",IF(AND(A85<>\"\",L85=\"Yes\",M85<>2015,M85<>2016,M85<>2017),\"FIX Model Year Early Allowance was earned\",IF(AND(A85<>\"\",L85=\"No\",M85<>\"\",M85<>\"NA\"),\"Error in cols M & N---column M indicates No Allowance but Column N indicates an allowance was earned\",IF(AND(A85<>\"\",L85=\"Yes\",B85<>\"HDV\",B85<>\"HLDT Allowance only\",B85<>\"MDPV Allowance only\",M85=2017),\"ERROR--Early allowances can't be earned in 2017MY for LDV/LDT1 and LDT2 Evaporative Families\",IF(AND(A85<>\"\",$C$8=2017,N85=\"\"),\"FIX Federal Prod'n--needed for 2017MY compliance\",IF(AND(A85<>\"\",$C$8<>2017,L85=\"No\",O85=\"\"),\"FIX 50-St Prod'n\",IF(AND(A85<>\"\",B85=\"HLDT Allowance only\",L85<>\"Yes\"),\"ERROR - Cols B & M--Column B indicates an Allowance is being used but Column M indicates No Allowance\",IF(AND(A85<>\"\",B85=\"MDPV Allowance only\",L85<>\"Yes\"),\"ERROR - Cols B & M--Column B indicates an Allowance is being use but Column M indicates No Allowance\",IF(AND(A85<>\"\",B85=\"HDV\",D85<> \"2b\", L85=\"Yes\",F85 =\"\"),\"FIX Column G 'HDV also meets ORVR Standards'---needed for HDV Class 3 and above Allowances\",IF(AND(A85<>\"\",B85=\"HDV\",D85<> \"2b\", L85=\"Yes\",F85 =\"Yes\"), 2*O85,IF(AND(A85<>\"\",L85=\"Yes\",B85=\"LDV/LDT1\"),N85,IF(AND(A85<>\"\",L85=\"Yes\",B85=\"LDT2\"),N85,IF(AND(A85<>\"\",L85=\"Yes\",B85=\"HLDT Allowance only\"),N85,IF(AND(A85<>\"\",L85=\"No\",$C$8=2017),N85,O85))))))))))))))))))))))))))))))))))))))))))))))","v":""},{"$f":"IF(AND(A85=\"\",N85<>\"\"),\"FIX TEST GROUP\",IF(AND(A85=\"\",O85<>\"\"),\"FIX TEST GROUP\",IF(A85=\"\",\"\", IF(B85=\"\",\"FIX CLASS\",IF(C85=\"\",\"FIX FEL\",IF(G85=\"\",\"FIX U/L Miles\",IF(I85=\"\",\"FIX Test Fuel\",IF(J85=\"\",\"FIX PZEV Carryover\",IF(K85=\"\",\"FIX CARB Opt 1 Carryover\",IF(L85=\"\",\"FIX Allowance Y/N\",IF(M85=\"\",\"FIX Allowance MY\",IF(Y85=\"\",\"FIX PROD'N in Column Q\",Y85*X85))))))))))))","v":""},{"$f":"IF(A85=\"\",\"\",IF(AND(A85<>\"\",B85=\"LDV/LDT1\",C85<=0.5),\"OK\",IF(AND(A85<>\"\",B85=\"LDT2\",C85<=0.65),\"OK\",IF(AND(A85<>\"\",B85=\"HLDT/MDPV\",C85<=0.9),\"OK\",IF(AND(A85<>\"\",B85=\"HLDT/MDPV\",C85>0.9,C85<=1),\"OK if HLDTs < 0.9\",IF(AND(A85<>\"\",B85=\"HDV\",D85=\"2b\",C85<=1.4),\"OK\",IF(AND(A85<>\"\",B85=\"HDV\",D85=3,C85<=1.4),\"OK\",IF(AND(A85<>\"\",B85=\"HDV\",C85<=1.9, D85>=4),\"OK\",IF(AND(A85<>\"\",B85=\"HLDT Allowance only\"),\"OK\",IF(AND(A85<>\"\",B85=\"MDPV Allowance only\"),\"OK\",\"FEL exceeds CAP\"))))))))))","v":""},{"$f":"IF(ISNUMBER(Y85)=TRUE, \"\", Y85)","v":""}]
[null,null,null,null,null,null,null,null,null,null,null,null,null,null,null,null,null,null,null,null,null,null,{"$f":"IF(A86=\"\",\"\", IF(B86=\"LDV/LDT1\", 0.3,  IF(B86=\"LDT2\", 0.4, IF(OR(B86=\"HLDT/MDPV\",B86=\"HLDT Allowance only\", B86=\"MDPV Allowance only\"), 0.5, IF(B86=\"HDV\", 0.6,   ERROR)))))","v":""},"","","","",""]
[null,null,null,null,null,null,null,null,null,null,null,null,null,null,null,null,null,null,null,null,null,null,{"$f":"IF(A87=\"\",\"\", IF(B87=\"LDV/LDT1\", 0.3,  IF(B87=\"LDT2\", 0.4, IF(OR(B87=\"HLDT/MDPV\",B87=\"HLDT Allowance only\", B87=\"MDPV Allowance only\"), 0.5, IF(B87=\"HDV\", 0.6,   ERROR)))))","v":""},"","","","",""]
[null,null,null,null,null,null,null,null,null,null,null,null,null,null,null,null,null,null,null,null,null,null,{"$f":"IF(A88=\"\",\"\", IF(B88=\"LDV/LDT1\", 0.3,  IF(B88=\"LDT2\", 0.4, IF(OR(B88=\"HLDT/MDPV\",B88=\"HLDT Allowance only\", B88=\"MDPV Allowance only\"), 0.5, IF(B88=\"HDV\", 0.6,   ERROR)))))","v":""},"","","","",""]
[null,null,null,null,null,null,null,null,null,null,null,null,null,null,null,null,null,null,null,null,null,null,{"$f":"IF(A89=\"\",\"\", IF(B89=\"LDV/LDT1\", 0.3,  IF(B89=\"LDT2\", 0.4, IF(OR(B89=\"HLDT/MDPV\",B89=\"HLDT Allowance only\", B89=\"MDPV Allowance only\"), 0.5, IF(B89=\"HDV\", 0.6,   ERROR)))))","v":""},"","","","",""]
[null,null,null,null,null,null,null,null,null,null,null,null,null,null,null,null,null,null,null,null,null,null,{"$f":"IF(A90=\"\",\"\", IF(B90=\"LDV/LDT1\", 0.3,  IF(B90=\"LDT2\", 0.4, IF(OR(B90=\"HLDT/MDPV\",B90=\"HLDT Allowance only\", B90=\"MDPV Allowance only\"), 0.5, IF(B90=\"HDV\", 0.6,   ERROR)))))","v":""},"","","","",""]
[null,null,null,null,null,null,null,null,null,null,null,null,null,null,null,null,null,null,null,null,null,null,{"$f":"IF(A91=\"\",\"\", IF(B91=\"LDV/LDT1\", 0.3,  IF(B91=\"LDT2\", 0.4, IF(OR(B91=\"HLDT/MDPV\",B91=\"HLDT Allowance only\", B91=\"MDPV Allowance only\"), 0.5, IF(B91=\"HDV\", 0.6,   ERROR)))))","v":""},"","","","",""]
[null,null,null,null,null,null,null,null,null,null,null,null,null,null,null,null,null,null,null,null,null,null,{"$f":"IF(A92=\"\",\"\", IF(B92=\"LDV/LDT1\", 0.3,  IF(B92=\"LDT2\", 0.4, IF(OR(B92=\"HLDT/MDPV\",B92=\"HLDT Allowance only\", B92=\"MDPV Allowance only\"), 0.5, IF(B92=\"HDV\", 0.6,   ERROR)))))","v":""},"","","","",""]
[null,null,null,null,null,null,null,null,null,null,null,null,null,null,null,null,null,null,null,null,null,null,{"$f":"IF(A93=\"\",\"\", IF(B93=\"LDV/LDT1\", 0.3,  IF(B93=\"LDT2\", 0.4, IF(OR(B93=\"HLDT/MDPV\",B93=\"HLDT Allowance only\", B93=\"MDPV Allowance only\"), 0.5, IF(B93=\"HDV\", 0.6,   ERROR)))))","v":""},"","","","",""]
[null,null,null,null,null,null,null,null,null,null,null,null,null,null,null,null,null,null,null,null,null,null,{"$f":"IF(A94=\"\",\"\", IF(B94=\"LDV/LDT1\", 0.3,  IF(B94=\"LDT2\", 0.4, IF(OR(B94=\"HLDT/MDPV\",B94=\"HLDT Allowance only\", B94=\"MDPV Allowance only\"), 0.5, IF(B94=\"HDV\", 0.6,   ERROR)))))","v":""},"","","","",""]
[null,null,null,null,null,null,null,null,null,null,null,null,null,null,null,null,null,null,null,null,null,null,{"$f":"IF(A95=\"\",\"\", IF(B95=\"LDV/LDT1\", 0.3,  IF(B95=\"LDT2\", 0.4, IF(OR(B95=\"HLDT/MDPV\",B95=\"HLDT Allowance only\", B95=\"MDPV Allowance only\"), 0.5, IF(B95=\"HDV\", 0.6,   ERROR)))))","v":""},"","","","",""]
[null,null,null,null,null,null,null,null,null,null,null,null,null,null,null,null,null,null,null,null,null,null,{"$f":"IF(A96=\"\",\"\", IF(B96=\"LDV/LDT1\", 0.3,  IF(B96=\"LDT2\", 0.4, IF(OR(B96=\"HLDT/MDPV\",B96=\"HLDT Allowance only\", B96=\"MDPV Allowance only\"), 0.5, IF(B96=\"HDV\", 0.6,   ERROR)))))","v":""},"","","","",""]
[null,null,null,null,null,null,null,null,null,null,null,null,null,null,null,null,null,null,null,null,null,null,{"$f":"IF(A97=\"\",\"\", IF(B97=\"LDV/LDT1\", 0.3,  IF(B97=\"LDT2\", 0.4, IF(OR(B97=\"HLDT/MDPV\",B97=\"HLDT Allowance only\", B97=\"MDPV Allowance only\"), 0.5, IF(B97=\"HDV\", 0.6,   ERROR)))))","v":""},"","","","",""]
[null,null,null,null,null,null,null,null,null,null,null,null,null,null,null,null,null,null,null,null,null,null,{"$f":"IF(A98=\"\",\"\", IF(B98=\"LDV/LDT1\", 0.3,  IF(B98=\"LDT2\", 0.4, IF(OR(B98=\"HLDT/MDPV\",B98=\"HLDT Allowance only\", B98=\"MDPV Allowance only\"), 0.5, IF(B98=\"HDV\", 0.6,   ERROR)))))","v":""},"","","","",""]
[null,null,null,null,null,null,null,null,null,null,null,null,null,null,null,null,null,null,null,null,null,null,{"$f":"IF(A99=\"\",\"\", IF(B99=\"LDV/LDT1\", 0.3,  IF(B99=\"LDT2\", 0.4, IF(OR(B99=\"HLDT/MDPV\",B99=\"HLDT Allowance only\", B99=\"MDPV Allowance only\"), 0.5, IF(B99=\"HDV\", 0.6,   ERROR)))))","v":""},"","","","",""]
[null,null,null,null,null,null,null,null,null,null,null,null,null,null,null,null,null,null,null,null,null,null,{"$f":"IF(A100=\"\",\"\", IF(B100=\"LDV/LDT1\", 0.3,  IF(B100=\"LDT2\", 0.4, IF(OR(B100=\"HLDT/MDPV\",B100=\"HLDT Allowance only\", B100=\"MDPV Allowance only\"), 0.5, IF(B100=\"HDV\", 0.6,   ERROR)))))","v":""},"","","","",""]
[null,null,null,null,null,null,null,null,null,null,null,null,null,null,null,null,null,null,null,null,null,null,{"$f":"IF(A101=\"\",\"\", IF(B101=\"LDV/LDT1\", 0.3,  IF(B101=\"LDT2\", 0.4, IF(OR(B101=\"HLDT/MDPV\",B101=\"HLDT Allowance only\", B101=\"MDPV Allowance only\"), 0.5, IF(B101=\"HDV\", 0.6,   ERROR)))))","v":""},"","","","",""]
[null,null,null,null,null,null,null,null,null,null,null,null,null,null,null,null,null,null,null,null,null,null,{"$f":"IF(A102=\"\",\"\", IF(B102=\"LDV/LDT1\", 0.3,  IF(B102=\"LDT2\", 0.4, IF(OR(B102=\"HLDT/MDPV\",B102=\"HLDT Allowance only\", B102=\"MDPV Allowance only\"), 0.5, IF(B102=\"HDV\", 0.6,   ERROR)))))","v":""},"","","","",""]
[null,null,null,null,null,null,null,null,null,null,null,null,null,null,null,null,null,null,null,null,null,null,{"$f":"IF(A103=\"\",\"\", IF(B103=\"LDV/LDT1\", 0.3,  IF(B103=\"LDT2\", 0.4, IF(OR(B103=\"HLDT/MDPV\",B103=\"HLDT Allowance only\", B103=\"MDPV Allowance only\"), 0.5, IF(B103=\"HDV\", 0.6,   ERROR)))))","v":""},"","","","",""]
[null,null,null,null,null,null,null,null,null,null,null,null,null,null,null,null,null,null,null,null,null,null,{"$f":"IF(A104=\"\",\"\", IF(B104=\"LDV/LDT1\", 0.3,  IF(B104=\"LDT2\", 0.4, IF(OR(B104=\"HLDT/MDPV\",B104=\"HLDT Allowance only\", B104=\"MDPV Allowance only\"), 0.5, IF(B104=\"HDV\", 0.6,   ERROR)))))","v":""},"","","","",""]
[null,null,null,null,null,null,null,null,null,null,null,null,null,null,null,null,null,null,null,null,null,null,{"$f":"IF(A105=\"\",\"\", IF(B105=\"LDV/LDT1\", 0.3,  IF(B105=\"LDT2\", 0.4, IF(OR(B105=\"HLDT/MDPV\",B105=\"HLDT Allowance only\", B105=\"MDPV Allowance only\"), 0.5, IF(B105=\"HDV\", 0.6,   ERROR)))))","v":""},"","","","",""]
[null,null,null,null,null,null,null,null,null,null,null,null,null,null,null,null,null,null,null,null,null,null,{"$f":"IF(A106=\"\",\"\", IF(B106=\"LDV/LDT1\", 0.3,  IF(B106=\"LDT2\", 0.4, IF(OR(B106=\"HLDT/MDPV\",B106=\"HLDT Allowance only\", B106=\"MDPV Allowance only\"), 0.5, IF(B106=\"HDV\", 0.6,   ERROR)))))","v":""},"","","","",""]
[null,null,null,null,null,null,null,null,null,null,null,null,null,null,null,null,null,null,null,null,null,null,{"$f":"IF(A107=\"\",\"\", IF(B107=\"LDV/LDT1\", 0.3,  IF(B107=\"LDT2\", 0.4, IF(OR(B107=\"HLDT/MDPV\",B107=\"HLDT Allowance only\", B107=\"MDPV Allowance only\"), 0.5, IF(B107=\"HDV\", 0.6,   ERROR)))))","v":""},"","","","",""]
[null,null,null,null,null,null,null,null,null,null,null,null,null,null,null,null,null,null,null,null,null,null,{"$f":"IF(A108=\"\",\"\", IF(B108=\"LDV/LDT1\", 0.3,  IF(B108=\"LDT2\", 0.4, IF(OR(B108=\"HLDT/MDPV\",B108=\"HLDT Allowance only\", B108=\"MDPV Allowance only\"), 0.5, IF(B108=\"HDV\", 0.6,   ERROR)))))","v":""},"","","","",""]
[null,null,null,null,null,null,null,null,null,null,null,null,null,null,null,null,null,null,null,null,null,null,{"$f":"IF(A109=\"\",\"\", IF(B109=\"LDV/LDT1\", 0.3,  IF(B109=\"LDT2\", 0.4, IF(OR(B109=\"HLDT/MDPV\",B109=\"HLDT Allowance only\", B109=\"MDPV Allowance only\"), 0.5, IF(B109=\"HDV\", 0.6,   ERROR)))))","v":""},"","","","",""]
[null,null,null,null,null,null,null,null,null,null,null,null,null,null,null,null,null,null,null,null,null,null,{"$f":"IF(A110=\"\",\"\", IF(B110=\"LDV/LDT1\", 0.3,  IF(B110=\"LDT2\", 0.4, IF(OR(B110=\"HLDT/MDPV\",B110=\"HLDT Allowance only\", B110=\"MDPV Allowance only\"), 0.5, IF(B110=\"HDV\", 0.6,   ERROR)))))","v":""},"","","","",""]
[null,null,null,null,null,null,null,null,null,null,null,null,null,null,null,null,null,null,null,null,null,null,{"$f":"IF(A111=\"\",\"\", IF(B111=\"LDV/LDT1\", 0.3,  IF(B111=\"LDT2\", 0.4, IF(OR(B111=\"HLDT/MDPV\",B111=\"HLDT Allowance only\", B111=\"MDPV Allowance only\"), 0.5, IF(B111=\"HDV\", 0.6,   ERROR)))))","v":""},"","","","",""]
[null,null,null,null,null,null,null,null,null,null,null,null,null,null,null,null,null,null,null,null,null,null,{"$f":"IF(A112=\"\",\"\", IF(B112=\"LDV/LDT1\", 0.3,  IF(B112=\"LDT2\", 0.4, IF(OR(B112=\"HLDT/MDPV\",B112=\"HLDT Allowance only\", B112=\"MDPV Allowance only\"), 0.5, IF(B112=\"HDV\", 0.6,   ERROR)))))","v":""},"","","","",""]
[null,null,null,null,null,null,null,null,null,null,null,null,null,null,null,null,null,null,null,null,null,null,{"$f":"IF(A113=\"\",\"\", IF(B113=\"LDV/LDT1\", 0.3,  IF(B113=\"LDT2\", 0.4, IF(OR(B113=\"HLDT/MDPV\",B113=\"HLDT Allowance only\", B113=\"MDPV Allowance only\"), 0.5, IF(B113=\"HDV\", 0.6,   ERROR)))))","v":""},"","","","",""]
[null,null,null,null,null,null,null,null,null,null,null,null,null,null,null,null,null,null,null,null,null,null,{"$f":"IF(A114=\"\",\"\", IF(B114=\"LDV/LDT1\", 0.3,  IF(B114=\"LDT2\", 0.4, IF(OR(B114=\"HLDT/MDPV\",B114=\"HLDT Allowance only\", B114=\"MDPV Allowance only\"), 0.5, IF(B114=\"HDV\", 0.6,   ERROR)))))","v":""},"","","","",""]
[null,null,null,null,null,null,null,null,null,null,null,null,null,null,null,null,null,null,null,null,null,null,{"$f":"IF(A115=\"\",\"\", IF(B115=\"LDV/LDT1\", 0.3,  IF(B115=\"LDT2\", 0.4, IF(OR(B115=\"HLDT/MDPV\",B115=\"HLDT Allowance only\", B115=\"MDPV Allowance only\"), 0.5, IF(B115=\"HDV\", 0.6,   ERROR)))))","v":""},"","","","",""]
[null,null,null,null,null,null,null,null,null,null,null,null,null,null,null,null,null,null,null,null,null,null,{"$f":"IF(A116=\"\",\"\", IF(B116=\"LDV/LDT1\", 0.3,  IF(B116=\"LDT2\", 0.4, IF(OR(B116=\"HLDT/MDPV\",B116=\"HLDT Allowance only\", B116=\"MDPV Allowance only\"), 0.5, IF(B116=\"HDV\", 0.6,   ERROR)))))","v":""},"","","","",""]
[null,null,null,null,null,null,null,null,null,null,null,null,null,null,null,null,null,null,null,null,null,null,{"$f":"IF(A117=\"\",\"\", IF(B117=\"LDV/LDT1\", 0.3,  IF(B117=\"LDT2\", 0.4, IF(OR(B117=\"HLDT/MDPV\",B117=\"HLDT Allowance only\", B117=\"MDPV Allowance only\"), 0.5, IF(B117=\"HDV\", 0.6,   ERROR)))))","v":""},"","","","",""]
[null,null,null,null,null,null,null,null,null,null,null,null,null,null,null,null,null,null,null,null,null,null,{"$f":"IF(A118=\"\",\"\", IF(B118=\"LDV/LDT1\", 0.3,  IF(B118=\"LDT2\", 0.4, IF(OR(B118=\"HLDT/MDPV\",B118=\"HLDT Allowance only\", B118=\"MDPV Allowance only\"), 0.5, IF(B118=\"HDV\", 0.6,   ERROR)))))","v":""},"","","","",""]
[null,null,null,null,null,null,null,null,null,null,null,null,null,null,null,null,null,null,null,null,null,null,{"$f":"IF(A119=\"\",\"\", IF(B119=\"LDV/LDT1\", 0.3,  IF(B119=\"LDT2\", 0.4, IF(OR(B119=\"HLDT/MDPV\",B119=\"HLDT Allowance only\", B119=\"MDPV Allowance only\"), 0.5, IF(B119=\"HDV\", 0.6,   ERROR)))))","v":""},"","","","",""]
[null,null,null,null,null,null,null,null,null,null,null,null,null,null,null,null,null,null,null,null,null,null,{"$f":"IF(A120=\"\",\"\", IF(B120=\"LDV/LDT1\", 0.3,  IF(B120=\"LDT2\", 0.4, IF(OR(B120=\"HLDT/MDPV\",B120=\"HLDT Allowance only\", B120=\"MDPV Allowance only\"), 0.5, IF(B120=\"HDV\", 0.6,   ERROR)))))","v":""},"","","","",""]
[null,null,null,null,null,null,null,null,null,null,null,null,null,null,null,null,null,null,null,null,null,null,{"$f":"IF(A121=\"\",\"\", IF(B121=\"LDV/LDT1\", 0.3,  IF(B121=\"LDT2\", 0.4, IF(OR(B121=\"HLDT/MDPV\",B121=\"HLDT Allowance only\", B121=\"MDPV Allowance only\"), 0.5, IF(B121=\"HDV\", 0.6,   ERROR)))))","v":""},"","","","",""]
[null,null,null,null,null,null,null,null,null,null,null,null,null,null,null,null,null,null,null,null,null,null,{"$f":"IF(A122=\"\",\"\", IF(B122=\"LDV/LDT1\", 0.3,  IF(B122=\"LDT2\", 0.4, IF(OR(B122=\"HLDT/MDPV\",B122=\"HLDT Allowance only\", B122=\"MDPV Allowance only\"), 0.5, IF(B122=\"HDV\", 0.6,   ERROR)))))","v":""},"","","","",""]
[null,null,null,null,null,null,null,null,null,null,null,null,null,null,null,null,null,null,null,null,null,null,{"$f":"IF(A123=\"\",\"\", IF(B123=\"LDV/LDT1\", 0.3,  IF(B123=\"LDT2\", 0.4, IF(OR(B123=\"HLDT/MDPV\",B123=\"HLDT Allowance only\", B123=\"MDPV Allowance only\"), 0.5, IF(B123=\"HDV\", 0.6,   ERROR)))))","v":""},"","","","",""]
[null,null,null,null,null,null,null,null,null,null,null,null,null,null,null,null,null,null,null,null,null,null,{"$f":"IF(A124=\"\",\"\", IF(B124=\"LDV/LDT1\", 0.3,  IF(B124=\"LDT2\", 0.4, IF(OR(B124=\"HLDT/MDPV\",B124=\"HLDT Allowance only\", B124=\"MDPV Allowance only\"), 0.5, IF(B124=\"HDV\", 0.6,   ERROR)))))","v":""},"","","","",""]
[null,null,null,null,null,null,null,null,null,null,null,null,null,null,null,null,null,null,null,null,null,null,{"$f":"IF(A125=\"\",\"\", IF(B125=\"LDV/LDT1\", 0.3,  IF(B125=\"LDT2\", 0.4, IF(OR(B125=\"HLDT/MDPV\",B125=\"HLDT Allowance only\", B125=\"MDPV Allowance only\"), 0.5, IF(B125=\"HDV\", 0.6,   ERROR)))))","v":""},"","","","",""]
[null,null,null,null,null,null,null,null,null,null,null,null,null,null,null,null,null,null,null,null,null,null,{"$f":"IF(A126=\"\",\"\", IF(B126=\"LDV/LDT1\", 0.3,  IF(B126=\"LDT2\", 0.4, IF(OR(B126=\"HLDT/MDPV\",B126=\"HLDT Allowance only\", B126=\"MDPV Allowance only\"), 0.5, IF(B126=\"HDV\", 0.6,   ERROR)))))","v":""},"","","","",""]
[null,null,null,null,null,null,null,null,null,null,null,null,null,null,null,null,null,null,null,null,null,null,{"$f":"IF(A127=\"\",\"\", IF(B127=\"LDV/LDT1\", 0.3,  IF(B127=\"LDT2\", 0.4, IF(OR(B127=\"HLDT/MDPV\",B127=\"HLDT Allowance only\", B127=\"MDPV Allowance only\"), 0.5, IF(B127=\"HDV\", 0.6,   ERROR)))))","v":""},"","","","",""]
[null,null,null,null,null,null,null,null,null,null,null,null,null,null,null,null,null,null,null,null,null,null,{"$f":"IF(A128=\"\",\"\", IF(B128=\"LDV/LDT1\", 0.3,  IF(B128=\"LDT2\", 0.4, IF(OR(B128=\"HLDT/MDPV\",B128=\"HLDT Allowance only\", B128=\"MDPV Allowance only\"), 0.5, IF(B128=\"HDV\", 0.6,   ERROR)))))","v":""},"","","","",""]
[null,null,null,null,null,null,null,null,null,null,null,null,null,null,null,null,null,null,null,null,null,null,{"$f":"IF(A129=\"\",\"\", IF(B129=\"LDV/LDT1\", 0.3,  IF(B129=\"LDT2\", 0.4, IF(OR(B129=\"HLDT/MDPV\",B129=\"HLDT Allowance only\", B129=\"MDPV Allowance only\"), 0.5, IF(B129=\"HDV\", 0.6,   ERROR)))))","v":""},"","","","",""]
[null,null,null,null,null,null,null,null,null,null,null,null,null,null,null,null,null,null,null,null,null,null,{"$f":"IF(A130=\"\",\"\", IF(B130=\"LDV/LDT1\", 0.3,  IF(B130=\"LDT2\", 0.4, IF(OR(B130=\"HLDT/MDPV\",B130=\"HLDT Allowance only\", B130=\"MDPV Allowance only\"), 0.5, IF(B130=\"HDV\", 0.6,   ERROR)))))","v":""},"","","","",""]
[null,null,null,null,null,null,null,null,null,null,null,null,null,null,null,null,null,null,null,null,null,null,{"$f":"IF(A131=\"\",\"\", IF(B131=\"LDV/LDT1\", 0.3,  IF(B131=\"LDT2\", 0.4, IF(OR(B131=\"HLDT/MDPV\",B131=\"HLDT Allowance only\", B131=\"MDPV Allowance only\"), 0.5, IF(B131=\"HDV\", 0.6,   ERROR)))))","v":""},"","","","",""]
[null,null,null,null,null,null,null,null,null,null,null,null,null,null,null,null,null,null,null,null,null,null,{"$f":"IF(A132=\"\",\"\", IF(B132=\"LDV/LDT1\", 0.3,  IF(B132=\"LDT2\", 0.4, IF(OR(B132=\"HLDT/MDPV\",B132=\"HLDT Allowance only\", B132=\"MDPV Allowance only\"), 0.5, IF(B132=\"HDV\", 0.6,   ERROR)))))","v":""},"","","","",""]
[null,null,null,null,null,null,null,null,null,null,null,null,null,null,null,null,null,null,null,null,null,null,{"$f":"IF(A133=\"\",\"\", IF(B133=\"LDV/LDT1\", 0.3,  IF(B133=\"LDT2\", 0.4, IF(OR(B133=\"HLDT/MDPV\",B133=\"HLDT Allowance only\", B133=\"MDPV Allowance only\"), 0.5, IF(B133=\"HDV\", 0.6,   ERROR)))))","v":""},"","","","",""]
[null,null,null,null,null,null,null,null,null,null,null,null,null,null,null,null,null,null,null,null,null,null,{"$f":"IF(A134=\"\",\"\", IF(B134=\"LDV/LDT1\", 0.3,  IF(B134=\"LDT2\", 0.4, IF(OR(B134=\"HLDT/MDPV\",B134=\"HLDT Allowance only\", B134=\"MDPV Allowance only\"), 0.5, IF(B134=\"HDV\", 0.6,   ERROR)))))","v":""},"","","","",""]
[null,null,null,null,null,null,null,null,null,null,null,null,null,null,null,null,null,null,null,null,null,null,{"$f":"IF(A135=\"\",\"\", IF(B135=\"LDV/LDT1\", 0.3,  IF(B135=\"LDT2\", 0.4, IF(OR(B135=\"HLDT/MDPV\",B135=\"HLDT Allowance only\", B135=\"MDPV Allowance only\"), 0.5, IF(B135=\"HDV\", 0.6,   ERROR)))))","v":""},"","","","",""]
[null,null,null,null,null,null,null,null,null,null,null,null,null,null,null,null,null,null,null,null,null,null,{"$f":"IF(A136=\"\",\"\", IF(B136=\"LDV/LDT1\", 0.3,  IF(B136=\"LDT2\", 0.4, IF(OR(B136=\"HLDT/MDPV\",B136=\"HLDT Allowance only\", B136=\"MDPV Allowance only\"), 0.5, IF(B136=\"HDV\", 0.6,   ERROR)))))","v":""},"","","","",""]
[null,null,null,null,null,null,null,null,null,null,null,null,null,null,null,null,null,null,null,null,null,null,{"$f":"IF(A137=\"\",\"\", IF(B137=\"LDV/LDT1\", 0.3,  IF(B137=\"LDT2\", 0.4, IF(OR(B137=\"HLDT/MDPV\",B137=\"HLDT Allowance only\", B137=\"MDPV Allowance only\"), 0.5, IF(B137=\"HDV\", 0.6,   ERROR)))))","v":""},"","","","",""]
[null,null,null,null,null,null,null,null,null,null,null,null,null,null,null,null,null,null,null,null,null,null,{"$f":"IF(A138=\"\",\"\", IF(B138=\"LDV/LDT1\", 0.3,  IF(B138=\"LDT2\", 0.4, IF(OR(B138=\"HLDT/MDPV\",B138=\"HLDT Allowance only\", B138=\"MDPV Allowance only\"), 0.5, IF(B138=\"HDV\", 0.6,   ERROR)))))","v":""},"","","","",""]
[null,null,null,null,null,null,null,null,null,null,null,null,null,null,null,null,null,null,null,null,null,null,{"$f":"IF(A139=\"\",\"\", IF(B139=\"LDV/LDT1\", 0.3,  IF(B139=\"LDT2\", 0.4, IF(OR(B139=\"HLDT/MDPV\",B139=\"HLDT Allowance only\", B139=\"MDPV Allowance only\"), 0.5, IF(B139=\"HDV\", 0.6,   ERROR)))))","v":""},"","","","",""]
[null,null,null,null,null,null,null,null,null,null,null,null,null,null,null,null,null,null,null,null,null,null,{"$f":"IF(A140=\"\",\"\", IF(B140=\"LDV/LDT1\", 0.3,  IF(B140=\"LDT2\", 0.4, IF(OR(B140=\"HLDT/MDPV\",B140=\"HLDT Allowance only\", B140=\"MDPV Allowance only\"), 0.5, IF(B140=\"HDV\", 0.6,   ERROR)))))","v":""},"","","","",""]
[null,null,null,null,null,null,null,null,null,null,null,null,null,null,null,null,null,null,null,null,null,null,{"$f":"IF(A141=\"\",\"\", IF(B141=\"LDV/LDT1\", 0.3,  IF(B141=\"LDT2\", 0.4, IF(OR(B141=\"HLDT/MDPV\",B141=\"HLDT Allowance only\", B141=\"MDPV Allowance only\"), 0.5, IF(B141=\"HDV\", 0.6,   ERROR)))))","v":""},"","","","",""]
[null,null,null,null,null,null,null,null,null,null,null,null,null,null,null,null,null,null,null,null,null,null,{"$f":"IF(A142=\"\",\"\", IF(B142=\"LDV/LDT1\", 0.3,  IF(B142=\"LDT2\", 0.4, IF(OR(B142=\"HLDT/MDPV\",B142=\"HLDT Allowance only\", B142=\"MDPV Allowance only\"), 0.5, IF(B142=\"HDV\", 0.6,   ERROR)))))","v":""},"","","","",""]
[null,null,null,null,null,null,null,null,null,null,null,null,null,null,null,null,null,null,null,null,null,null,{"$f":"IF(A143=\"\",\"\", IF(B143=\"LDV/LDT1\", 0.3,  IF(B143=\"LDT2\", 0.4, IF(OR(B143=\"HLDT/MDPV\",B143=\"HLDT Allowance only\", B143=\"MDPV Allowance only\"), 0.5, IF(B143=\"HDV\", 0.6,   ERROR)))))","v":""},"","","","",""]
[null,null,null,null,null,null,null,null,null,null,null,null,null,null,null,null,null,null,null,null,null,null,{"$f":"IF(A144=\"\",\"\", IF(B144=\"LDV/LDT1\", 0.3,  IF(B144=\"LDT2\", 0.4, IF(OR(B144=\"HLDT/MDPV\",B144=\"HLDT Allowance only\", B144=\"MDPV Allowance only\"), 0.5, IF(B144=\"HDV\", 0.6,   ERROR)))))","v":""},"","","","",""]
[null,null,null,null,null,null,null,null,null,null,null,null,null,null,null,null,null,null,null,null,null,null,{"$f":"IF(A145=\"\",\"\", IF(B145=\"LDV/LDT1\", 0.3,  IF(B145=\"LDT2\", 0.4, IF(OR(B145=\"HLDT/MDPV\",B145=\"HLDT Allowance only\", B145=\"MDPV Allowance only\"), 0.5, IF(B145=\"HDV\", 0.6,   ERROR)))))","v":""},"","","","",""]
[null,null,null,null,null,null,null,null,null,null,null,null,null,null,null,null,null,null,null,null,null,null,{"$f":"IF(A146=\"\",\"\", IF(B146=\"LDV/LDT1\", 0.3,  IF(B146=\"LDT2\", 0.4, IF(OR(B146=\"HLDT/MDPV\",B146=\"HLDT Allowance only\", B146=\"MDPV Allowance only\"), 0.5, IF(B146=\"HDV\", 0.6,   ERROR)))))","v":""},"","","","",""]
[null,null,null,null,null,null,null,null,null,null,null,null,null,null,null,null,null,null,null,null,null,null,{"$f":"IF(A147=\"\",\"\", IF(B147=\"LDV/LDT1\", 0.3,  IF(B147=\"LDT2\", 0.4, IF(OR(B147=\"HLDT/MDPV\",B147=\"HLDT Allowance only\", B147=\"MDPV Allowance only\"), 0.5, IF(B147=\"HDV\", 0.6,   ERROR)))))","v":""},"","","","",""]
[null,null,null,null,null,null,null,null,null,null,null,null,null,null,null,null,null,null,null,null,null,null,{"$f":"IF(A148=\"\",\"\", IF(B148=\"LDV/LDT1\", 0.3,  IF(B148=\"LDT2\", 0.4, IF(OR(B148=\"HLDT/MDPV\",B148=\"HLDT Allowance only\", B148=\"MDPV Allowance only\"), 0.5, IF(B148=\"HDV\", 0.6,   ERROR)))))","v":""},"","","","",""]
[null,null,null,null,null,null,null,null,null,null,null,null,null,null,null,null,null,null,null,null,null,null,{"$f":"IF(A149=\"\",\"\", IF(B149=\"LDV/LDT1\", 0.3,  IF(B149=\"LDT2\", 0.4, IF(OR(B149=\"HLDT/MDPV\",B149=\"HLDT Allowance only\", B149=\"MDPV Allowance only\"), 0.5, IF(B149=\"HDV\", 0.6,   ERROR)))))","v":""},{"$f":"IF(A149=\"\", \"\", IF(J149 = \"Yes\", W149, IF(K149=\"Yes\", W149, IF(AND(A149<>\"\",B149=\"HDV\",E149=\"Statement\"), MAX(C149, W149),C149))))","v":""},{"$f":"IF(A149=\"\",\"\",IF(AND(A149<>\"\",L149=\"Yes\",$C$8>2021),\"ERROR--Can't Use Early Allowances after 2021MY\",\nIF(AND(A149<>\"\",B149=\"HLDT Allowance only\",$C$8=2017),\"Can't Use HLDT Allowance before 2018MY\",IF(AND(A149<>\"\",B149=\"MDPV Allowance only\",$C$8=2017),\"Can't Use MDPV Allowance before 2018MY\",IF(AND(A149<>\"\",B149=\"HLDT/MDPV\",$C$8=2017),\"Can't Use HLDT/MDPV Allowance before 2018MY\",IF(AND(A149<>\"\",B149=\"HDV\",$C$8=2017),\"Can't Use HDV Allowance before 2018MY\",IF(AND(A149<>\"\",L149=\"Yes\",J149<>\"Yes\",K149<>\"Yes\",C149>W149),\"ERROR--Early Allowance evaporative family does not comply with Tier 3 standards and is not a 2015 or 2016 Carryover PZEV or Carryover LEV3 Option 1 (Rig Test) Evap family\",IF(AND(A149<>\"\",L149=\"Yes\",B149=\"HDV\",O149=\"\"),\"FIX 50-St Prod'n--needed for HDV Allowances\",IF(AND(A149<>\"\",B149=\"MDPV Allowance only\",O149=\"\"),\"FIX 50-St Prod'n--needed for MDPV early allowances\",IF(AND(A149<>\"\",L149=\"Yes\",B149=\"LDV/LDT1\",N149=\"\"),\"FIX Fed Prod'n--needed for LDV/LDT1 early allowances\",IF(AND(A149<>\"\",L149=\"Yes\",B149=\"LDT2\",N149=\"\"),\"FIX Fed Prod'n--needed for LDT2 early allowances\",IF(AND(A149<>\"\",L149=\"Yes\",B149=\"HLDT Allowance only\",N149=\"\"),\"FIX Fed Prod'n--needed for HLDT early allowances\",IF(AND(A149<>\"\",L149=\"Yes\",B149=\"HLDT/MDPV\"),\"ERROR in Col B--must use HLDT Allowance only or MDPV Allowance only value from Column B menu and corresponding production values for HLDT Allowances or MDPV Allowances as applicable\",IF(AND(A149<>\"\",B149=\"HDV\",D149=\"\"),\"ERROR--Column B is HDV but HDV Class in Column E is Blank\",IF(AND(A149<>\"\",B149<>\"\",B149<>\"HDV\",D149<>\"\"),\"ERROR--Column B is not HDV but you entered a HDV Class in Column E\",IF(AND(A149<>\"\",B149=\"HDV\",D149=4,E149=\"\"),\"ERROR--Column E indicates HDV Class 4-8 but Certification Basis in Column F is Blank\",IF(AND(A149<>\"\",B149=\"HDV\",D149=5,E149=\"\"),\"ERROR--Column E indicates HDV Class 4-8 but Certification Basis in Column F is Blank\",IF(AND(A149<>\"\",B149=\"HDV\",D149=6,E149=\"\"),\"ERROR--Column E indicates HDV Class 4-8 but Certification Basis in Column F is Blank\",IF(AND(A149<>\"\",B149=\"HDV\",D149=7,E149=\"\"),\"ERROR--Column E indicates HDV Class 4-8 but Certification Basis in Column F is Blank\",IF(AND(A149<>\"\",B149=\"HDV\",D149=8,E149=\"\"),\"ERROR--Column E indicates HDV Class 4-8 but Certification Basis in Column F is Blank\",IF(AND(A149<>\"\",D149=\"2b\",E149=\"Statement\"),\"ERROR in Columns E & F---Can't use Statement for Certification Basis of Class 2b HDVs\",IF(AND(A149<>\"\",D149=3,E149=\"Statement\"),\"ERROR in Columns E & F---Can't use Statement for Certification Basis of Class 3 HDVs\",IF(AND(A149<>\"\",B149<>\"HDV\",E149=\"Statement\"),\"ERROR in Columns B & F---Can only use Statement as the Certification Basis of Class 4 and above HDVs\",IF(AND(A149<>\"\",I149=\"Phase 2\",J149=\"No\"),\"ERROR--Can only use Phase 2 test fuel for 2015-2016 Carryover PZEV Option 1 (Rig Test) Evaporative Families\",IF(AND(A149<>\"\",I149=\"NA\",E149<>\"Statement\"),\"ERROR in Columns F & J---Can only use NA for Test Fuel if Certification is based on a Statement\",IF(AND(A149<>\"\",J149=\"Yes\",I149<>\"Phase 2\"),\"ERROR--Test fuel must be Phase 2 for 2015-2016 Carryover PZEV Option 1 (Rig test) evaporative families\",IF(AND(A149<>\"\",J149=\"Yes\",C149<>0.35,C149<>0.5,C149<>0.75),\"ERROR--FEL must be 0.350, 0.500 or 0.750 for 2015-2016 Carryover PZEV Option 1 (Rig test) evaporative families\",IF(AND(A149<>\"\",J149=\"Yes\",B149<>\"LDV/LDT1\",B149<>\"LDT2\",B149<>\"HLDT/MDPV\"),\"ERROR--Vehicle class must be LDV/LDT1 or LDT2 or HLDT/MDPV for 2015-2016 Carryover PZEV Option 1 (Rig test) evaporative families\",IF(AND(A149<>\"\",$C$8>2019,J149=\"Yes\",L149<>\"Yes\"),\"ERROR--Can't use Carryover data from 2015-2016 PZEV Option 1 (Rig test) using Phase 2 test fuel after 2019MY (or after 2021MY if used as an Early Allowance)\",IF(AND(A149<>\"\",K149=\"Yes\",I149<>\"LEV 3\"),\"ERROR--Test fuel must be LEV 3 for 2015-2016 Carryover LEV3 Option 1 (Rig test) evaporative families\",IF(AND(A149<>\"\",K149=\"Yes\",C149<>0.35,C149<>0.5,C149<>0.75),\"ERROR--FEL must be 0.350, 0.500 or 0.750 for 2015-2016 Carryover LEV3 Option 1 (Rig test) evaporative families\",IF(AND(A149<>\"\",$C$8>2021,K149=\"Yes\"),\"ERROR--Can't use Carryover data from 2015-2016 CARB LEV3 Option 1 (Rig test) using LEV 3 test fuel after 2021MY\",IF(AND(A149<>\"\",B149<>\"LDV/LDT1\",G149=120),\"ERROR--Useful Life must be 150,000 miles for this Tier 3 Evaporative Family\",IF(AND(A149<>\"\",L149=\"Yes\",M149<>2015,M149<>2016,M149<>2017),\"FIX Model Year Early Allowance was earned\",IF(AND(A149<>\"\",L149=\"No\",M149<>\"\",M149<>\"NA\"),\"Error in cols M & N---column M indicates No Allowance but Column N indicates an allowance was earned\",IF(AND(A149<>\"\",L149=\"Yes\",B149<>\"HDV\",B149<>\"HLDT Allowance only\",B149<>\"MDPV Allowance only\",M149=2017),\"ERROR--Early allowances can't be earned in 2017MY for LDV/LDT1 and LDT2 Evaporative Families\",IF(AND(A149<>\"\",$C$8=2017,N149=\"\"),\"FIX Federal Prod'n--needed for 2017MY compliance\",IF(AND(A149<>\"\",$C$8<>2017,L149=\"No\",O149=\"\"),\"FIX 50-St Prod'n\",IF(AND(A149<>\"\",B149=\"HLDT Allowance only\",L149<>\"Yes\"),\"ERROR - Cols B & M--Column B indicates an Allowance is being used but Column M indicates No Allowance\",IF(AND(A149<>\"\",B149=\"MDPV Allowance only\",L149<>\"Yes\"),\"ERROR - Cols B & M--Column B indicates an Allowance is being use but Column M indicates No Allowance\",IF(AND(A149<>\"\",B149=\"HDV\",D149<> \"2b\", L149=\"Yes\",F149 =\"\"),\"FIX Column G 'HDV also meets ORVR Standards'---needed for HDV Class 3 and above Allowances\",IF(AND(A149<>\"\",B149=\"HDV\",D149<> \"2b\", L149=\"Yes\",F149 =\"Yes\"), 2*O149,IF(AND(A149<>\"\",L149=\"Yes\",B149=\"LDV/LDT1\"),N149,IF(AND(A149<>\"\",L149=\"Yes\",B149=\"LDT2\"),N149,IF(AND(A149<>\"\",L149=\"Yes\",B149=\"HLDT Allowance only\"),N149,IF(AND(A149<>\"\",L149=\"No\",$C$8=2017),N149,O149))))))))))))))))))))))))))))))))))))))))))))))","v":""},{"$f":"IF(AND(A149=\"\",N149<>\"\"),\"FIX TEST GROUP\",IF(AND(A149=\"\",O149<>\"\"),\"FIX TEST GROUP\",IF(A149=\"\",\"\", IF(B149=\"\",\"FIX CLASS\",IF(C149=\"\",\"FIX FEL\",IF(G149=\"\",\"FIX U/L Miles\",IF(I149=\"\",\"FIX Test Fuel\",IF(J149=\"\",\"FIX PZEV Carryover\",IF(K149=\"\",\"FIX CARB Opt 1 Carryover\",IF(L149=\"\",\"FIX Allowance Y/N\",IF(M149=\"\",\"FIX Allowance MY\",IF(Y149=\"\",\"FIX PROD'N in Column Q\",Y149*X149))))))))))))","v":""},{"$f":"IF(A149=\"\",\"\",IF(AND(A149<>\"\",B149=\"LDV/LDT1\",C149<=0.5),\"OK\",IF(AND(A149<>\"\",B149=\"LDT2\",C149<=0.65),\"OK\",IF(AND(A149<>\"\",B149=\"HLDT/MDPV\",C149<=0.9),\"OK\",IF(AND(A149<>\"\",B149=\"HLDT/MDPV\",C149>0.9,C149<=1),\"OK if HLDTs < 0.9\",IF(AND(A149<>\"\",B149=\"HDV\",D149=\"2b\",C149<=1.4),\"OK\",IF(AND(A149<>\"\",B149=\"HDV\",D149=3,C149<=1.4),\"OK\",IF(AND(A149<>\"\",B149=\"HDV\",C149<=1.9, D149>=4),\"OK\",IF(AND(A149<>\"\",B149=\"HLDT Allowance only\"),\"OK\",IF(AND(A149<>\"\",B149=\"MDPV Allowance only\"),\"OK\",\"FEL exceeds CAP\"))))))))))","v":""},{"$f":"IF(ISNUMBER(Y149)=TRUE, \"\", Y149)","v":""}]
[null,null,null,null,null,null,null,null,null,null,null,null,null,null,null,null,null,null,null,null,null,null,{"$f":"IF(A150=\"\",\"\", IF(B150=\"LDV/LDT1\", 0.3,  IF(B150=\"LDT2\", 0.4, IF(OR(B150=\"HLDT/MDPV\",B150=\"HLDT Allowance only\", B150=\"MDPV Allowance only\"), 0.5, IF(B150=\"HDV\", 0.6,   ERROR)))))","v":""},"","","","",""]
[null,null,null,null,null,null,null,null,null,null,null,null,null,null,null,null,null,null,null,null,null,null,{"$f":"IF(A151=\"\",\"\", IF(B151=\"LDV/LDT1\", 0.3,  IF(B151=\"LDT2\", 0.4, IF(OR(B151=\"HLDT/MDPV\",B151=\"HLDT Allowance only\", B151=\"MDPV Allowance only\"), 0.5, IF(B151=\"HDV\", 0.6,   ERROR)))))","v":""},"","","","",""]
[null,null,null,null,null,null,null,null,null,null,null,null,null,null,null,null,null,null,null,null,null,null,{"$f":"IF(A152=\"\",\"\", IF(B152=\"LDV/LDT1\", 0.3,  IF(B152=\"LDT2\", 0.4, IF(OR(B152=\"HLDT/MDPV\",B152=\"HLDT Allowance only\", B152=\"MDPV Allowance only\"), 0.5, IF(B152=\"HDV\", 0.6,   ERROR)))))","v":""},"","","","",""]
[null,null,null,null,null,null,null,null,null,null,null,null,null,null,null,null,null,null,null,null,null,null,{"$f":"IF(A153=\"\",\"\", IF(B153=\"LDV/LDT1\", 0.3,  IF(B153=\"LDT2\", 0.4, IF(OR(B153=\"HLDT/MDPV\",B153=\"HLDT Allowance only\", B153=\"MDPV Allowance only\"), 0.5, IF(B153=\"HDV\", 0.6,   ERROR)))))","v":""},"","","","",""]
[null,null,null,null,null,null,null,null,null,null,null,null,null,null,null,null,null,null,null,null,null,null,{"$f":"IF(A154=\"\",\"\", IF(B154=\"LDV/LDT1\", 0.3,  IF(B154=\"LDT2\", 0.4, IF(OR(B154=\"HLDT/MDPV\",B154=\"HLDT Allowance only\", B154=\"MDPV Allowance only\"), 0.5, IF(B154=\"HDV\", 0.6,   ERROR)))))","v":""},"","","","",""]
[null,null,null,null,null,null,null,null,null,null,null,null,null,null,null,null,null,null,null,null,null,null,{"$f":"IF(A155=\"\",\"\", IF(B155=\"LDV/LDT1\", 0.3,  IF(B155=\"LDT2\", 0.4, IF(OR(B155=\"HLDT/MDPV\",B155=\"HLDT Allowance only\", B155=\"MDPV Allowance only\"), 0.5, IF(B155=\"HDV\", 0.6,   ERROR)))))","v":""},"","","","",""]
[null,null,null,null,null,null,null,null,null,null,null,null,null,null,null,null,null,null,null,null,null,null,{"$f":"IF(A156=\"\",\"\", IF(B156=\"LDV/LDT1\", 0.3,  IF(B156=\"LDT2\", 0.4, IF(OR(B156=\"HLDT/MDPV\",B156=\"HLDT Allowance only\", B156=\"MDPV Allowance only\"), 0.5, IF(B156=\"HDV\", 0.6,   ERROR)))))","v":""},"","","","",""]
[null,null,null,null,null,null,null,null,null,null,null,null,null,null,null,null,null,null,null,null,null,null,{"$f":"IF(A157=\"\",\"\", IF(B157=\"LDV/LDT1\", 0.3,  IF(B157=\"LDT2\", 0.4, IF(OR(B157=\"HLDT/MDPV\",B157=\"HLDT Allowance only\", B157=\"MDPV Allowance only\"), 0.5, IF(B157=\"HDV\", 0.6,   ERROR)))))","v":""},"","","","",""]
[null,null,null,null,null,null,null,null,null,null,null,null,null,null,null,null,null,null,null,null,null,null,{"$f":"IF(A158=\"\",\"\", IF(B158=\"LDV/LDT1\", 0.3,  IF(B158=\"LDT2\", 0.4, IF(OR(B158=\"HLDT/MDPV\",B158=\"HLDT Allowance only\", B158=\"MDPV Allowance only\"), 0.5, IF(B158=\"HDV\", 0.6,   ERROR)))))","v":""},"","","","",""]
[null,null,null,null,null,null,null,null,null,null,null,null,null,null,null,null,null,null,null,null,null,null,{"$f":"IF(A159=\"\",\"\", IF(B159=\"LDV/LDT1\", 0.3,  IF(B159=\"LDT2\", 0.4, IF(OR(B159=\"HLDT/MDPV\",B159=\"HLDT Allowance only\", B159=\"MDPV Allowance only\"), 0.5, IF(B159=\"HDV\", 0.6,   ERROR)))))","v":""},"","","","",""]
[null,null,null,null,null,null,null,null,null,null,null,null,null,null,null,null,null,null,null,null,null,null,{"$f":"IF(A160=\"\",\"\", IF(B160=\"LDV/LDT1\", 0.3,  IF(B160=\"LDT2\", 0.4, IF(OR(B160=\"HLDT/MDPV\",B160=\"HLDT Allowance only\", B160=\"MDPV Allowance only\"), 0.5, IF(B160=\"HDV\", 0.6,   ERROR)))))","v":""},"","","","",""]
[null,null,null,null,null,null,null,null,null,null,null,null,null,null,null,null,null,null,null,null,null,null,{"$f":"IF(A161=\"\",\"\", IF(B161=\"LDV/LDT1\", 0.3,  IF(B161=\"LDT2\", 0.4, IF(OR(B161=\"HLDT/MDPV\",B161=\"HLDT Allowance only\", B161=\"MDPV Allowance only\"), 0.5, IF(B161=\"HDV\", 0.6,   ERROR)))))","v":""},"","","","",""]
[null,null,null,null,null,null,null,null,null,null,null,null,null,null,null,null,null,null,null,null,null,null,{"$f":"IF(A162=\"\",\"\", IF(B162=\"LDV/LDT1\", 0.3,  IF(B162=\"LDT2\", 0.4, IF(OR(B162=\"HLDT/MDPV\",B162=\"HLDT Allowance only\", B162=\"MDPV Allowance only\"), 0.5, IF(B162=\"HDV\", 0.6,   ERROR)))))","v":""},"","","","",""]
[null,null,null,null,null,null,null,null,null,null,null,null,null,null,null,null,null,null,null,null,null,null,{"$f":"IF(A163=\"\",\"\", IF(B163=\"LDV/LDT1\", 0.3,  IF(B163=\"LDT2\", 0.4, IF(OR(B163=\"HLDT/MDPV\",B163=\"HLDT Allowance only\", B163=\"MDPV Allowance only\"), 0.5, IF(B163=\"HDV\", 0.6,   ERROR)))))","v":""},"","","","",""]
[null,null,null,null,null,null,null,null,null,null,null,null,null,null,null,null,null,null,null,null,null,null,{"$f":"IF(A164=\"\",\"\", IF(B164=\"LDV/LDT1\", 0.3,  IF(B164=\"LDT2\", 0.4, IF(OR(B164=\"HLDT/MDPV\",B164=\"HLDT Allowance only\", B164=\"MDPV Allowance only\"), 0.5, IF(B164=\"HDV\", 0.6,   ERROR)))))","v":""},"","","","",""]
[null,null,null,null,null,null,null,null,null,null,null,null,null,null,null,null,null,null,null,null,null,null,{"$f":"IF(A165=\"\",\"\", IF(B165=\"LDV/LDT1\", 0.3,  IF(B165=\"LDT2\", 0.4, IF(OR(B165=\"HLDT/MDPV\",B165=\"HLDT Allowance only\", B165=\"MDPV Allowance only\"), 0.5, IF(B165=\"HDV\", 0.6,   ERROR)))))","v":""},"","","","",""]
[null,null,null,null,null,null,null,null,null,null,null,null,null,null,null,null,null,null,null,null,null,null,{"$f":"IF(A166=\"\",\"\", IF(B166=\"LDV/LDT1\", 0.3,  IF(B166=\"LDT2\", 0.4, IF(OR(B166=\"HLDT/MDPV\",B166=\"HLDT Allowance only\", B166=\"MDPV Allowance only\"), 0.5, IF(B166=\"HDV\", 0.6,   ERROR)))))","v":""},"","","","",""]
[null,null,null,null,null,null,null,null,null,null,null,null,null,null,null,null,null,null,null,null,null,null,{"$f":"IF(A167=\"\",\"\", IF(B167=\"LDV/LDT1\", 0.3,  IF(B167=\"LDT2\", 0.4, IF(OR(B167=\"HLDT/MDPV\",B167=\"HLDT Allowance only\", B167=\"MDPV Allowance only\"), 0.5, IF(B167=\"HDV\", 0.6,   ERROR)))))","v":""},"","","","",""]
[null,null,null,null,null,null,null,null,null,null,null,null,null,null,null,null,null,null,null,null,null,null,{"$f":"IF(A168=\"\",\"\", IF(B168=\"LDV/LDT1\", 0.3,  IF(B168=\"LDT2\", 0.4, IF(OR(B168=\"HLDT/MDPV\",B168=\"HLDT Allowance only\", B168=\"MDPV Allowance only\"), 0.5, IF(B168=\"HDV\", 0.6,   ERROR)))))","v":""},"","","","",""]
[null,null,null,null,null,null,null,null,null,null,null,null,null,null,null,null,null,null,null,null,null,null,{"$f":"IF(A169=\"\",\"\", IF(B169=\"LDV/LDT1\", 0.3,  IF(B169=\"LDT2\", 0.4, IF(OR(B169=\"HLDT/MDPV\",B169=\"HLDT Allowance only\", B169=\"MDPV Allowance only\"), 0.5, IF(B169=\"HDV\", 0.6,   ERROR)))))","v":""},"","","","",""]
[null,null,null,null,null,null,null,null,null,null,null,null,null,null,null,null,null,null,null,null,null,null,{"$f":"IF(A170=\"\",\"\", IF(B170=\"LDV/LDT1\", 0.3,  IF(B170=\"LDT2\", 0.4, IF(OR(B170=\"HLDT/MDPV\",B170=\"HLDT Allowance only\", B170=\"MDPV Allowance only\"), 0.5, IF(B170=\"HDV\", 0.6,   ERROR)))))","v":""},"","","","",""]
[null,null,null,null,null,null,null,null,null,null,null,null,null,null,null,null,null,null,null,null,null,null,{"$f":"IF(A171=\"\",\"\", IF(B171=\"LDV/LDT1\", 0.3,  IF(B171=\"LDT2\", 0.4, IF(OR(B171=\"HLDT/MDPV\",B171=\"HLDT Allowance only\", B171=\"MDPV Allowance only\"), 0.5, IF(B171=\"HDV\", 0.6,   ERROR)))))","v":""},"","","","",""]
[null,null,null,null,null,null,null,null,null,null,null,null,null,null,null,null,null,null,null,null,null,null,{"$f":"IF(A172=\"\",\"\", IF(B172=\"LDV/LDT1\", 0.3,  IF(B172=\"LDT2\", 0.4, IF(OR(B172=\"HLDT/MDPV\",B172=\"HLDT Allowance only\", B172=\"MDPV Allowance only\"), 0.5, IF(B172=\"HDV\", 0.6,   ERROR)))))","v":""},"","","","",""]
[null,null,null,null,null,null,null,null,null,null,null,null,null,null,null,null,null,null,null,null,null,null,{"$f":"IF(A173=\"\",\"\", IF(B173=\"LDV/LDT1\", 0.3,  IF(B173=\"LDT2\", 0.4, IF(OR(B173=\"HLDT/MDPV\",B173=\"HLDT Allowance only\", B173=\"MDPV Allowance only\"), 0.5, IF(B173=\"HDV\", 0.6,   ERROR)))))","v":""},"","","","",""]
[null,null,null,null,null,null,null,null,null,null,null,null,null,null,null,null,null,null,null,null,null,null,{"$f":"IF(A174=\"\",\"\", IF(B174=\"LDV/LDT1\", 0.3,  IF(B174=\"LDT2\", 0.4, IF(OR(B174=\"HLDT/MDPV\",B174=\"HLDT Allowance only\", B174=\"MDPV Allowance only\"), 0.5, IF(B174=\"HDV\", 0.6,   ERROR)))))","v":""},"","","","",""]
[null,null,null,null,null,null,null,null,null,null,null,null,null,null,null,null,null,null,null,null,null,null,{"$f":"IF(A175=\"\",\"\", IF(B175=\"LDV/LDT1\", 0.3,  IF(B175=\"LDT2\", 0.4, IF(OR(B175=\"HLDT/MDPV\",B175=\"HLDT Allowance only\", B175=\"MDPV Allowance only\"), 0.5, IF(B175=\"HDV\", 0.6,   ERROR)))))","v":""},"","","","",""]
[null,null,null,null,null,null,null,null,null,null,null,null,null,null,null,null,null,null,null,null,null,null,{"$f":"IF(A176=\"\",\"\", IF(B176=\"LDV/LDT1\", 0.3,  IF(B176=\"LDT2\", 0.4, IF(OR(B176=\"HLDT/MDPV\",B176=\"HLDT Allowance only\", B176=\"MDPV Allowance only\"), 0.5, IF(B176=\"HDV\", 0.6,   ERROR)))))","v":""},"","","","",""]
[null,null,null,null,null,null,null,null,null,null,null,null,null,null,null,null,null,null,null,null,null,null,{"$f":"IF(A177=\"\",\"\", IF(B177=\"LDV/LDT1\", 0.3,  IF(B177=\"LDT2\", 0.4, IF(OR(B177=\"HLDT/MDPV\",B177=\"HLDT Allowance only\", B177=\"MDPV Allowance only\"), 0.5, IF(B177=\"HDV\", 0.6,   ERROR)))))","v":""},"","","","",""]
[null,null,null,null,null,null,null,null,null,null,null,null,null,null,null,null,null,null,null,null,null,null,{"$f":"IF(A178=\"\",\"\", IF(B178=\"LDV/LDT1\", 0.3,  IF(B178=\"LDT2\", 0.4, IF(OR(B178=\"HLDT/MDPV\",B178=\"HLDT Allowance only\", B178=\"MDPV Allowance only\"), 0.5, IF(B178=\"HDV\", 0.6,   ERROR)))))","v":""},"","","","",""]
[null,null,null,null,null,null,null,null,null,null,null,null,null,null,null,null,null,null,null,null,null,null,{"$f":"IF(A179=\"\",\"\", IF(B179=\"LDV/LDT1\", 0.3,  IF(B179=\"LDT2\", 0.4, IF(OR(B179=\"HLDT/MDPV\",B179=\"HLDT Allowance only\", B179=\"MDPV Allowance only\"), 0.5, IF(B179=\"HDV\", 0.6,   ERROR)))))","v":""},"","","","",""]
[null,null,null,null,null,null,null,null,null,null,null,null,null,null,null,null,null,null,null,null,null,null,{"$f":"IF(A180=\"\",\"\", IF(B180=\"LDV/LDT1\", 0.3,  IF(B180=\"LDT2\", 0.4, IF(OR(B180=\"HLDT/MDPV\",B180=\"HLDT Allowance only\", B180=\"MDPV Allowance only\"), 0.5, IF(B180=\"HDV\", 0.6,   ERROR)))))","v":""},"","","","",""]
[null,null,null,null,null,null,null,null,null,null,null,null,null,null,null,null,null,null,null,null,null,null,{"$f":"IF(A181=\"\",\"\", IF(B181=\"LDV/LDT1\", 0.3,  IF(B181=\"LDT2\", 0.4, IF(OR(B181=\"HLDT/MDPV\",B181=\"HLDT Allowance only\", B181=\"MDPV Allowance only\"), 0.5, IF(B181=\"HDV\", 0.6,   ERROR)))))","v":""},"","","","",""]
[null,null,null,null,null,null,null,null,null,null,null,null,null,null,null,null,null,null,null,null,null,null,{"$f":"IF(A182=\"\",\"\", IF(B182=\"LDV/LDT1\", 0.3,  IF(B182=\"LDT2\", 0.4, IF(OR(B182=\"HLDT/MDPV\",B182=\"HLDT Allowance only\", B182=\"MDPV Allowance only\"), 0.5, IF(B182=\"HDV\", 0.6,   ERROR)))))","v":""},"","","","",""]
[null,null,null,null,null,null,null,null,null,null,null,null,null,null,null,null,null,null,null,null,null,null,{"$f":"IF(A183=\"\",\"\", IF(B183=\"LDV/LDT1\", 0.3,  IF(B183=\"LDT2\", 0.4, IF(OR(B183=\"HLDT/MDPV\",B183=\"HLDT Allowance only\", B183=\"MDPV Allowance only\"), 0.5, IF(B183=\"HDV\", 0.6,   ERROR)))))","v":""},"","","","",""]
[null,null,null,null,null,null,null,null,null,null,null,null,null,null,null,null,null,null,null,null,null,null,{"$f":"IF(A184=\"\",\"\", IF(B184=\"LDV/LDT1\", 0.3,  IF(B184=\"LDT2\", 0.4, IF(OR(B184=\"HLDT/MDPV\",B184=\"HLDT Allowance only\", B184=\"MDPV Allowance only\"), 0.5, IF(B184=\"HDV\", 0.6,   ERROR)))))","v":""},"","","","",""]
[null,null,null,null,null,null,null,null,null,null,null,null,null,null,null,null,null,null,null,null,null,null,{"$f":"IF(A185=\"\",\"\", IF(B185=\"LDV/LDT1\", 0.3,  IF(B185=\"LDT2\", 0.4, IF(OR(B185=\"HLDT/MDPV\",B185=\"HLDT Allowance only\", B185=\"MDPV Allowance only\"), 0.5, IF(B185=\"HDV\", 0.6,   ERROR)))))","v":""},"","","","",""]
[null,null,null,null,null,null,null,null,null,null,null,null,null,null,null,null,null,null,null,null,null,null,{"$f":"IF(A186=\"\",\"\", IF(B186=\"LDV/LDT1\", 0.3,  IF(B186=\"LDT2\", 0.4, IF(OR(B186=\"HLDT/MDPV\",B186=\"HLDT Allowance only\", B186=\"MDPV Allowance only\"), 0.5, IF(B186=\"HDV\", 0.6,   ERROR)))))","v":""},"","","","",""]
[null,null,null,null,null,null,null,null,null,null,null,null,null,null,null,null,null,null,null,null,null,null,{"$f":"IF(A187=\"\",\"\", IF(B187=\"LDV/LDT1\", 0.3,  IF(B187=\"LDT2\", 0.4, IF(OR(B187=\"HLDT/MDPV\",B187=\"HLDT Allowance only\", B187=\"MDPV Allowance only\"), 0.5, IF(B187=\"HDV\", 0.6,   ERROR)))))","v":""},"","","","",""]
[null,null,null,null,null,null,null,null,null,null,null,null,null,null,null,null,null,null,null,null,null,null,{"$f":"IF(A188=\"\",\"\", IF(B188=\"LDV/LDT1\", 0.3,  IF(B188=\"LDT2\", 0.4, IF(OR(B188=\"HLDT/MDPV\",B188=\"HLDT Allowance only\", B188=\"MDPV Allowance only\"), 0.5, IF(B188=\"HDV\", 0.6,   ERROR)))))","v":""},"","","","",""]
[null,null,null,null,null,null,null,null,null,null,null,null,null,null,null,null,null,null,null,null,null,null,{"$f":"IF(A189=\"\",\"\", IF(B189=\"LDV/LDT1\", 0.3,  IF(B189=\"LDT2\", 0.4, IF(OR(B189=\"HLDT/MDPV\",B189=\"HLDT Allowance only\", B189=\"MDPV Allowance only\"), 0.5, IF(B189=\"HDV\", 0.6,   ERROR)))))","v":""},"","","","",""]
[null,null,null,null,null,null,null,null,null,null,null,null,null,null,null,null,null,null,null,null,null,null,{"$f":"IF(A190=\"\",\"\", IF(B190=\"LDV/LDT1\", 0.3,  IF(B190=\"LDT2\", 0.4, IF(OR(B190=\"HLDT/MDPV\",B190=\"HLDT Allowance only\", B190=\"MDPV Allowance only\"), 0.5, IF(B190=\"HDV\", 0.6,   ERROR)))))","v":""},"","","","",""]
[null,null,null,null,null,null,null,null,null,null,null,null,null,null,null,null,null,null,null,null,null,null,{"$f":"IF(A191=\"\",\"\", IF(B191=\"LDV/LDT1\", 0.3,  IF(B191=\"LDT2\", 0.4, IF(OR(B191=\"HLDT/MDPV\",B191=\"HLDT Allowance only\", B191=\"MDPV Allowance only\"), 0.5, IF(B191=\"HDV\", 0.6,   ERROR)))))","v":""},"","","","",""]
[null,null,null,null,null,null,null,null,null,null,null,null,null,null,null,null,null,null,null,null,null,null,{"$f":"IF(A192=\"\",\"\", IF(B192=\"LDV/LDT1\", 0.3,  IF(B192=\"LDT2\", 0.4, IF(OR(B192=\"HLDT/MDPV\",B192=\"HLDT Allowance only\", B192=\"MDPV Allowance only\"), 0.5, IF(B192=\"HDV\", 0.6,   ERROR)))))","v":""},"","","","",""]
[null,null,null,null,null,null,null,null,null,null,null,null,null,null,null,null,null,null,null,null,null,null,{"$f":"IF(A193=\"\",\"\", IF(B193=\"LDV/LDT1\", 0.3,  IF(B193=\"LDT2\", 0.4, IF(OR(B193=\"HLDT/MDPV\",B193=\"HLDT Allowance only\", B193=\"MDPV Allowance only\"), 0.5, IF(B193=\"HDV\", 0.6,   ERROR)))))","v":""},"","","","",""]
[null,null,null,null,null,null,null,null,null,null,null,null,null,null,null,null,null,null,null,null,null,null,{"$f":"IF(A194=\"\",\"\", IF(B194=\"LDV/LDT1\", 0.3,  IF(B194=\"LDT2\", 0.4, IF(OR(B194=\"HLDT/MDPV\",B194=\"HLDT Allowance only\", B194=\"MDPV Allowance only\"), 0.5, IF(B194=\"HDV\", 0.6,   ERROR)))))","v":""},"","","","",""]
[null,null,null,null,null,null,null,null,null,null,null,null,null,null,null,null,null,null,null,null,null,null,{"$f":"IF(A195=\"\",\"\", IF(B195=\"LDV/LDT1\", 0.3,  IF(B195=\"LDT2\", 0.4, IF(OR(B195=\"HLDT/MDPV\",B195=\"HLDT Allowance only\", B195=\"MDPV Allowance only\"), 0.5, IF(B195=\"HDV\", 0.6,   ERROR)))))","v":""},"","","","",""]
[null,null,null,null,null,null,null,null,null,null,null,null,null,null,null,null,null,null,null,null,null,null,{"$f":"IF(A196=\"\",\"\", IF(B196=\"LDV/LDT1\", 0.3,  IF(B196=\"LDT2\", 0.4, IF(OR(B196=\"HLDT/MDPV\",B196=\"HLDT Allowance only\", B196=\"MDPV Allowance only\"), 0.5, IF(B196=\"HDV\", 0.6,   ERROR)))))","v":""},"","","","",""]
[null,null,null,null,null,null,null,null,null,null,null,null,null,null,null,null,null,null,null,null,null,null,{"$f":"IF(A197=\"\",\"\", IF(B197=\"LDV/LDT1\", 0.3,  IF(B197=\"LDT2\", 0.4, IF(OR(B197=\"HLDT/MDPV\",B197=\"HLDT Allowance only\", B197=\"MDPV Allowance only\"), 0.5, IF(B197=\"HDV\", 0.6,   ERROR)))))","v":""},"","","","",""]
[null,null,null,null,null,null,null,null,null,null,null,null,null,null,null,null,null,null,null,null,null,null,{"$f":"IF(A198=\"\",\"\", IF(B198=\"LDV/LDT1\", 0.3,  IF(B198=\"LDT2\", 0.4, IF(OR(B198=\"HLDT/MDPV\",B198=\"HLDT Allowance only\", B198=\"MDPV Allowance only\"), 0.5, IF(B198=\"HDV\", 0.6,   ERROR)))))","v":""},"","","","",""]
[null,null,null,null,null,null,null,null,null,null,null,null,null,null,null,null,null,null,null,null,null,null,{"$f":"IF(A199=\"\",\"\", IF(B199=\"LDV/LDT1\", 0.3,  IF(B199=\"LDT2\", 0.4, IF(OR(B199=\"HLDT/MDPV\",B199=\"HLDT Allowance only\", B199=\"MDPV Allowance only\"), 0.5, IF(B199=\"HDV\", 0.6,   ERROR)))))","v":""},"","","","",""]
[null,null,null,null,null,null,null,null,null,null,null,null,null,null,null,null,null,null,null,null,null,null,{"$f":"IF(A200=\"\",\"\", IF(B200=\"LDV/LDT1\", 0.3,  IF(B200=\"LDT2\", 0.4, IF(OR(B200=\"HLDT/MDPV\",B200=\"HLDT Allowance only\", B200=\"MDPV Allowance only\"), 0.5, IF(B200=\"HDV\", 0.6,   ERROR)))))","v":""},"","","","",""]
[null,null,null,null,null,null,null,null,null,null,null,null,null,null,null,null,null,null,null,null,null,null,{"$f":"IF(A201=\"\",\"\", IF(B201=\"LDV/LDT1\", 0.3,  IF(B201=\"LDT2\", 0.4, IF(OR(B201=\"HLDT/MDPV\",B201=\"HLDT Allowance only\", B201=\"MDPV Allowance only\"), 0.5, IF(B201=\"HDV\", 0.6,   ERROR)))))","v":""},"","","","",""]
[null,null,null,null,null,null,null,null,null,null,null,null,null,null,null,null,null,null,null,null,null,null,{"$f":"IF(A202=\"\",\"\", IF(B202=\"LDV/LDT1\", 0.3,  IF(B202=\"LDT2\", 0.4, IF(OR(B202=\"HLDT/MDPV\",B202=\"HLDT Allowance only\", B202=\"MDPV Allowance only\"), 0.5, IF(B202=\"HDV\", 0.6,   ERROR)))))","v":""},"","","","",""]
[null,null,null,null,null,null,null,null,null,null,null,null,null,null,null,null,null,null,null,null,null,null,{"$f":"IF(A203=\"\",\"\", IF(B203=\"LDV/LDT1\", 0.3,  IF(B203=\"LDT2\", 0.4, IF(OR(B203=\"HLDT/MDPV\",B203=\"HLDT Allowance only\", B203=\"MDPV Allowance only\"), 0.5, IF(B203=\"HDV\", 0.6,   ERROR)))))","v":""},"","","","",""]
[null,null,null,null,null,null,null,null,null,null,null,null,null,null,null,null,null,null,null,null,null,null,{"$f":"IF(A204=\"\",\"\", IF(B204=\"LDV/LDT1\", 0.3,  IF(B204=\"LDT2\", 0.4, IF(OR(B204=\"HLDT/MDPV\",B204=\"HLDT Allowance only\", B204=\"MDPV Allowance only\"), 0.5, IF(B204=\"HDV\", 0.6,   ERROR)))))","v":""},"","","","",""]
[null,null,null,null,null,null,null,null,null,null,null,null,null,null,null,null,null,null,null,null,null,null,{"$f":"IF(A205=\"\",\"\", IF(B205=\"LDV/LDT1\", 0.3,  IF(B205=\"LDT2\", 0.4, IF(OR(B205=\"HLDT/MDPV\",B205=\"HLDT Allowance only\", B205=\"MDPV Allowance only\"), 0.5, IF(B205=\"HDV\", 0.6,   ERROR)))))","v":""},"","","","",""]
[null,null,null,null,null,null,null,null,null,null,null,null,null,null,null,null,null,null,null,null,null,null,{"$f":"IF(A206=\"\",\"\", IF(B206=\"LDV/LDT1\", 0.3,  IF(B206=\"LDT2\", 0.4, IF(OR(B206=\"HLDT/MDPV\",B206=\"HLDT Allowance only\", B206=\"MDPV Allowance only\"), 0.5, IF(B206=\"HDV\", 0.6,   ERROR)))))","v":""},"","","","",""]
[null,null,null,null,null,null,null,null,null,null,null,null,null,null,null,null,null,null,null,null,null,null,{"$f":"IF(A207=\"\",\"\", IF(B207=\"LDV/LDT1\", 0.3,  IF(B207=\"LDT2\", 0.4, IF(OR(B207=\"HLDT/MDPV\",B207=\"HLDT Allowance only\", B207=\"MDPV Allowance only\"), 0.5, IF(B207=\"HDV\", 0.6,   ERROR)))))","v":""},"","","","",""]
[null,null,null,null,null,null,null,null,null,null,null,null,null,null,null,null,null,null,null,null,null,null,{"$f":"IF(A208=\"\",\"\", IF(B208=\"LDV/LDT1\", 0.3,  IF(B208=\"LDT2\", 0.4, IF(OR(B208=\"HLDT/MDPV\",B208=\"HLDT Allowance only\", B208=\"MDPV Allowance only\"), 0.5, IF(B208=\"HDV\", 0.6,   ERROR)))))","v":""},"","","","",""]
[null,null,null,null,null,null,null,null,null,null,null,null,null,null,null,null,null,null,null,null,null,null,{"$f":"IF(A209=\"\",\"\", IF(B209=\"LDV/LDT1\", 0.3,  IF(B209=\"LDT2\", 0.4, IF(OR(B209=\"HLDT/MDPV\",B209=\"HLDT Allowance only\", B209=\"MDPV Allowance only\"), 0.5, IF(B209=\"HDV\", 0.6,   ERROR)))))","v":""},"","","","",""]
[null,null,null,null,null,null,null,null,null,null,null,null,null,null,null,null,null,null,null,null,null,null,{"$f":"IF(A210=\"\",\"\", IF(B210=\"LDV/LDT1\", 0.3,  IF(B210=\"LDT2\", 0.4, IF(OR(B210=\"HLDT/MDPV\",B210=\"HLDT Allowance only\", B210=\"MDPV Allowance only\"), 0.5, IF(B210=\"HDV\", 0.6,   ERROR)))))","v":""},"","","","",""]
[null,null,null,null,null,null,null,null,null,null,null,null,null,null,null,null,null,null,null,null,null,null,{"$f":"IF(A211=\"\",\"\", IF(B211=\"LDV/LDT1\", 0.3,  IF(B211=\"LDT2\", 0.4, IF(OR(B211=\"HLDT/MDPV\",B211=\"HLDT Allowance only\", B211=\"MDPV Allowance only\"), 0.5, IF(B211=\"HDV\", 0.6,   ERROR)))))","v":""},"","","","",""]
[null,null,null,null,null,null,null,null,null,null,null,null,null,null,null,null,null,null,null,null,null,null,{"$f":"IF(A212=\"\",\"\", IF(B212=\"LDV/LDT1\", 0.3,  IF(B212=\"LDT2\", 0.4, IF(OR(B212=\"HLDT/MDPV\",B212=\"HLDT Allowance only\", B212=\"MDPV Allowance only\"), 0.5, IF(B212=\"HDV\", 0.6,   ERROR)))))","v":""},"","","","",""]
[null,null,null,null,null,null,null,null,null,null,null,null,null,null,null,null,null,null,null,null,null,null,{"$f":"IF(A213=\"\",\"\", IF(B213=\"LDV/LDT1\", 0.3,  IF(B213=\"LDT2\", 0.4, IF(OR(B213=\"HLDT/MDPV\",B213=\"HLDT Allowance only\", B213=\"MDPV Allowance only\"), 0.5, IF(B213=\"HDV\", 0.6,   ERROR)))))","v":""},{"$f":"IF(A213=\"\", \"\", IF(J213 = \"Yes\", W213, IF(K213=\"Yes\", W213, IF(AND(A213<>\"\",B213=\"HDV\",E213=\"Statement\"), MAX(C213, W213),C213))))","v":""},{"$f":"IF(A213=\"\",\"\",IF(AND(A213<>\"\",L213=\"Yes\",$C$8>2021),\"ERROR--Can't Use Early Allowances after 2021MY\",\nIF(AND(A213<>\"\",B213=\"HLDT Allowance only\",$C$8=2017),\"Can't Use HLDT Allowance before 2018MY\",IF(AND(A213<>\"\",B213=\"MDPV Allowance only\",$C$8=2017),\"Can't Use MDPV Allowance before 2018MY\",IF(AND(A213<>\"\",B213=\"HLDT/MDPV\",$C$8=2017),\"Can't Use HLDT/MDPV Allowance before 2018MY\",IF(AND(A213<>\"\",B213=\"HDV\",$C$8=2017),\"Can't Use HDV Allowance before 2018MY\",IF(AND(A213<>\"\",L213=\"Yes\",J213<>\"Yes\",K213<>\"Yes\",C213>W213),\"ERROR--Early Allowance evaporative family does not comply with Tier 3 standards and is not a 2015 or 2016 Carryover PZEV or Carryover LEV3 Option 1 (Rig Test) Evap family\",IF(AND(A213<>\"\",L213=\"Yes\",B213=\"HDV\",O213=\"\"),\"FIX 50-St Prod'n--needed for HDV Allowances\",IF(AND(A213<>\"\",B213=\"MDPV Allowance only\",O213=\"\"),\"FIX 50-St Prod'n--needed for MDPV early allowances\",IF(AND(A213<>\"\",L213=\"Yes\",B213=\"LDV/LDT1\",N213=\"\"),\"FIX Fed Prod'n--needed for LDV/LDT1 early allowances\",IF(AND(A213<>\"\",L213=\"Yes\",B213=\"LDT2\",N213=\"\"),\"FIX Fed Prod'n--needed for LDT2 early allowances\",IF(AND(A213<>\"\",L213=\"Yes\",B213=\"HLDT Allowance only\",N213=\"\"),\"FIX Fed Prod'n--needed for HLDT early allowances\",IF(AND(A213<>\"\",L213=\"Yes\",B213=\"HLDT/MDPV\"),\"ERROR in Col B--must use HLDT Allowance only or MDPV Allowance only value from Column B menu and corresponding production values for HLDT Allowances or MDPV Allowances as applicable\",IF(AND(A213<>\"\",B213=\"HDV\",D213=\"\"),\"ERROR--Column B is HDV but HDV Class in Column E is Blank\",IF(AND(A213<>\"\",B213<>\"\",B213<>\"HDV\",D213<>\"\"),\"ERROR--Column B is not HDV but you entered a HDV Class in Column E\",IF(AND(A213<>\"\",B213=\"HDV\",D213=4,E213=\"\"),\"ERROR--Column E indicates HDV Class 4-8 but Certification Basis in Column F is Blank\",IF(AND(A213<>\"\",B213=\"HDV\",D213=5,E213=\"\"),\"ERROR--Column E indicates HDV Class 4-8 but Certification Basis in Column F is Blank\",IF(AND(A213<>\"\",B213=\"HDV\",D213=6,E213=\"\"),\"ERROR--Column E indicates HDV Class 4-8 but Certification Basis in Column F is Blank\",IF(AND(A213<>\"\",B213=\"HDV\",D213=7,E213=\"\"),\"ERROR--Column E indicates HDV Class 4-8 but Certification Basis in Column F is Blank\",IF(AND(A213<>\"\",B213=\"HDV\",D213=8,E213=\"\"),\"ERROR--Column E indicates HDV Class 4-8 but Certification Basis in Column F is Blank\",IF(AND(A213<>\"\",D213=\"2b\",E213=\"Statement\"),\"ERROR in Columns E & F---Can't use Statement for Certification Basis of Class 2b HDVs\",IF(AND(A213<>\"\",D213=3,E213=\"Statement\"),\"ERROR in Columns E & F---Can't use Statement for Certification Basis of Class 3 HDVs\",IF(AND(A213<>\"\",B213<>\"HDV\",E213=\"Statement\"),\"ERROR in Columns B & F---Can only use Statement as the Certification Basis of Class 4 and above HDVs\",IF(AND(A213<>\"\",I213=\"Phase 2\",J213=\"No\"),\"ERROR--Can only use Phase 2 test fuel for 2015-2016 Carryover PZEV Option 1 (Rig Test) Evaporative Families\",IF(AND(A213<>\"\",I213=\"NA\",E213<>\"Statement\"),\"ERROR in Columns F & J---Can only use NA for Test Fuel if Certification is based on a Statement\",IF(AND(A213<>\"\",J213=\"Yes\",I213<>\"Phase 2\"),\"ERROR--Test fuel must be Phase 2 for 2015-2016 Carryover PZEV Option 1 (Rig test) evaporative families\",IF(AND(A213<>\"\",J213=\"Yes\",C213<>0.35,C213<>0.5,C213<>0.75),\"ERROR--FEL must be 0.350, 0.500 or 0.750 for 2015-2016 Carryover PZEV Option 1 (Rig test) evaporative families\",IF(AND(A213<>\"\",J213=\"Yes\",B213<>\"LDV/LDT1\",B213<>\"LDT2\",B213<>\"HLDT/MDPV\"),\"ERROR--Vehicle class must be LDV/LDT1 or LDT2 or HLDT/MDPV for 2015-2016 Carryover PZEV Option 1 (Rig test) evaporative families\",IF(AND(A213<>\"\",$C$8>2019,J213=\"Yes\",L213<>\"Yes\"),\"ERROR--Can't use Carryover data from 2015-2016 PZEV Option 1 (Rig test) using Phase 2 test fuel after 2019MY (or after 2021MY if used as an Early Allowance)\",IF(AND(A213<>\"\",K213=\"Yes\",I213<>\"LEV 3\"),\"ERROR--Test fuel must be LEV 3 for 2015-2016 Carryover LEV3 Option 1 (Rig test) evaporative families\",IF(AND(A213<>\"\",K213=\"Yes\",C213<>0.35,C213<>0.5,C213<>0.75),\"ERROR--FEL must be 0.350, 0.500 or 0.750 for 2015-2016 Carryover LEV3 Option 1 (Rig test) evaporative families\",IF(AND(A213<>\"\",$C$8>2021,K213=\"Yes\"),\"ERROR--Can't use Carryover data from 2015-2016 CARB LEV3 Option 1 (Rig test) using LEV 3 test fuel after 2021MY\",IF(AND(A213<>\"\",B213<>\"LDV/LDT1\",G213=120),\"ERROR--Useful Life must be 150,000 miles for this Tier 3 Evaporative Family\",IF(AND(A213<>\"\",L213=\"Yes\",M213<>2015,M213<>2016,M213<>2017),\"FIX Model Year Early Allowance was earned\",IF(AND(A213<>\"\",L213=\"No\",M213<>\"\",M213<>\"NA\"),\"Error in cols M & N---column M indicates No Allowance but Column N indicates an allowance was earned\",IF(AND(A213<>\"\",L213=\"Yes\",B213<>\"HDV\",B213<>\"HLDT Allowance only\",B213<>\"MDPV Allowance only\",M213=2017),\"ERROR--Early allowances can't be earned in 2017MY for LDV/LDT1 and LDT2 Evaporative Families\",IF(AND(A213<>\"\",$C$8=2017,N213=\"\"),\"FIX Federal Prod'n--needed for 2017MY compliance\",IF(AND(A213<>\"\",$C$8<>2017,L213=\"No\",O213=\"\"),\"FIX 50-St Prod'n\",IF(AND(A213<>\"\",B213=\"HLDT Allowance only\",L213<>\"Yes\"),\"ERROR - Cols B & M--Column B indicates an Allowance is being used but Column M indicates No Allowance\",IF(AND(A213<>\"\",B213=\"MDPV Allowance only\",L213<>\"Yes\"),\"ERROR - Cols B & M--Column B indicates an Allowance is being use but Column M indicates No Allowance\",IF(AND(A213<>\"\",B213=\"HDV\",D213<> \"2b\", L213=\"Yes\",F213 =\"\"),\"FIX Column G 'HDV also meets ORVR Standards'---needed for HDV Class 3 and above Allowances\",IF(AND(A213<>\"\",B213=\"HDV\",D213<> \"2b\", L213=\"Yes\",F213 =\"Yes\"), 2*O213,IF(AND(A213<>\"\",L213=\"Yes\",B213=\"LDV/LDT1\"),N213,IF(AND(A213<>\"\",L213=\"Yes\",B213=\"LDT2\"),N213,IF(AND(A213<>\"\",L213=\"Yes\",B213=\"HLDT Allowance only\"),N213,IF(AND(A213<>\"\",L213=\"No\",$C$8=2017),N213,O213))))))))))))))))))))))))))))))))))))))))))))))","v":""},{"$f":"IF(AND(A213=\"\",N213<>\"\"),\"FIX TEST GROUP\",IF(AND(A213=\"\",O213<>\"\"),\"FIX TEST GROUP\",IF(A213=\"\",\"\", IF(B213=\"\",\"FIX CLASS\",IF(C213=\"\",\"FIX FEL\",IF(G213=\"\",\"FIX U/L Miles\",IF(I213=\"\",\"FIX Test Fuel\",IF(J213=\"\",\"FIX PZEV Carryover\",IF(K213=\"\",\"FIX CARB Opt 1 Carryover\",IF(L213=\"\",\"FIX Allowance Y/N\",IF(M213=\"\",\"FIX Allowance MY\",IF(Y213=\"\",\"FIX PROD'N in Column Q\",Y213*X213))))))))))))","v":""},{"$f":"IF(A213=\"\",\"\",IF(AND(A213<>\"\",B213=\"LDV/LDT1\",C213<=0.5),\"OK\",IF(AND(A213<>\"\",B213=\"LDT2\",C213<=0.65),\"OK\",IF(AND(A213<>\"\",B213=\"HLDT/MDPV\",C213<=0.9),\"OK\",IF(AND(A213<>\"\",B213=\"HLDT/MDPV\",C213>0.9,C213<=1),\"OK if HLDTs < 0.9\",IF(AND(A213<>\"\",B213=\"HDV\",D213=\"2b\",C213<=1.4),\"OK\",IF(AND(A213<>\"\",B213=\"HDV\",D213=3,C213<=1.4),\"OK\",IF(AND(A213<>\"\",B213=\"HDV\",C213<=1.9, D213>=4),\"OK\",IF(AND(A213<>\"\",B213=\"HLDT Allowance only\"),\"OK\",IF(AND(A213<>\"\",B213=\"MDPV Allowance only\"),\"OK\",\"FEL exceeds CAP\"))))))))))","v":""},{"$f":"IF(ISNUMBER(Y213)=TRUE, \"\", Y213)","v":""}]
[null,null,null,null,null,null,null,null,null,null,null,null,null,null,null,null,null,null,null,null,null,null,{"$f":"IF(A214=\"\",\"\", IF(B214=\"LDV/LDT1\", 0.3,  IF(B214=\"LDT2\", 0.4, IF(OR(B214=\"HLDT/MDPV\",B214=\"HLDT Allowance only\", B214=\"MDPV Allowance only\"), 0.5, IF(B214=\"HDV\", 0.6,   ERROR)))))","v":""},"","","","",""]
[null,null,null,null,null,null,null,null,null,null,null,null,null,null,null,null,null,null,null,null,null,null,{"$f":"IF(A215=\"\",\"\", IF(B215=\"LDV/LDT1\", 0.3,  IF(B215=\"LDT2\", 0.4, IF(OR(B215=\"HLDT/MDPV\",B215=\"HLDT Allowance only\", B215=\"MDPV Allowance only\"), 0.5, IF(B215=\"HDV\", 0.6,   ERROR)))))","v":""},"","","","",""]
[null,null,null,null,null,null,null,null,null,null,null,null,null,null,null,null,null,null,null,null,null,null,{"$f":"IF(A216=\"\",\"\", IF(B216=\"LDV/LDT1\", 0.3,  IF(B216=\"LDT2\", 0.4, IF(OR(B216=\"HLDT/MDPV\",B216=\"HLDT Allowance only\", B216=\"MDPV Allowance only\"), 0.5, IF(B216=\"HDV\", 0.6,   ERROR)))))","v":""},"","","","",""]
[null,null,null,null,null,null,null,null,null,null,null,null,null,null,null,null,null,null,null,null,null,null,{"$f":"IF(A217=\"\",\"\", IF(B217=\"LDV/LDT1\", 0.3,  IF(B217=\"LDT2\", 0.4, IF(OR(B217=\"HLDT/MDPV\",B217=\"HLDT Allowance only\", B217=\"MDPV Allowance only\"), 0.5, IF(B217=\"HDV\", 0.6,   ERROR)))))","v":""},"","","","",""]
[null,null,null,null,null,null,null,null,null,null,null,null,null,null,null,null,null,null,null,null,null,null,{"$f":"IF(A218=\"\",\"\", IF(B218=\"LDV/LDT1\", 0.3,  IF(B218=\"LDT2\", 0.4, IF(OR(B218=\"HLDT/MDPV\",B218=\"HLDT Allowance only\", B218=\"MDPV Allowance only\"), 0.5, IF(B218=\"HDV\", 0.6,   ERROR)))))","v":""},"","","","",""]
[null,null,null,null,null,null,null,null,null,null,null,null,null,null,null,null,null,null,null,null,null,null,{"$f":"IF(A219=\"\",\"\", IF(B219=\"LDV/LDT1\", 0.3,  IF(B219=\"LDT2\", 0.4, IF(OR(B219=\"HLDT/MDPV\",B219=\"HLDT Allowance only\", B219=\"MDPV Allowance only\"), 0.5, IF(B219=\"HDV\", 0.6,   ERROR)))))","v":""},"","","","",""]
[null,null,null,null,null,null,null,null,null,null,null,null,null,null,null,null,null,null,null,null,null,null,{"$f":"IF(A220=\"\",\"\", IF(B220=\"LDV/LDT1\", 0.3,  IF(B220=\"LDT2\", 0.4, IF(OR(B220=\"HLDT/MDPV\",B220=\"HLDT Allowance only\", B220=\"MDPV Allowance only\"), 0.5, IF(B220=\"HDV\", 0.6,   ERROR)))))","v":""},"","","","",""]
[null,null,null,null,null,null,null,null,null,null,null,null,null,null,null,null,null,null,null,null,null,null,{"$f":"IF(A221=\"\",\"\", IF(B221=\"LDV/LDT1\", 0.3,  IF(B221=\"LDT2\", 0.4, IF(OR(B221=\"HLDT/MDPV\",B221=\"HLDT Allowance only\", B221=\"MDPV Allowance only\"), 0.5, IF(B221=\"HDV\", 0.6,   ERROR)))))","v":""},"","","","",""]
[null,null,null,null,null,null,null,null,null,null,null,null,null,null,null,null,null,null,null,null,null,null,{"$f":"IF(A222=\"\",\"\", IF(B222=\"LDV/LDT1\", 0.3,  IF(B222=\"LDT2\", 0.4, IF(OR(B222=\"HLDT/MDPV\",B222=\"HLDT Allowance only\", B222=\"MDPV Allowance only\"), 0.5, IF(B222=\"HDV\", 0.6,   ERROR)))))","v":""},"","","","",""]
[null,null,null,null,null,null,null,null,null,null,null,null,null,null,null,null,null,null,null,null,null,null,{"$f":"IF(A223=\"\",\"\", IF(B223=\"LDV/LDT1\", 0.3,  IF(B223=\"LDT2\", 0.4, IF(OR(B223=\"HLDT/MDPV\",B223=\"HLDT Allowance only\", B223=\"MDPV Allowance only\"), 0.5, IF(B223=\"HDV\", 0.6,   ERROR)))))","v":""},"","","","",""]
[null,null,null,null,null,null,null,null,null,null,null,null,null,null,null,null,null,null,null,null,null,null,{"$f":"IF(A224=\"\",\"\", IF(B224=\"LDV/LDT1\", 0.3,  IF(B224=\"LDT2\", 0.4, IF(OR(B224=\"HLDT/MDPV\",B224=\"HLDT Allowance only\", B224=\"MDPV Allowance only\"), 0.5, IF(B224=\"HDV\", 0.6,   ERROR)))))","v":""},"","","","",""]
[null,null,null,null,null,null,null,null,null,null,null,null,null,null,null,null,null,null,null,null,null,null,{"$f":"IF(A225=\"\",\"\", IF(B225=\"LDV/LDT1\", 0.3,  IF(B225=\"LDT2\", 0.4, IF(OR(B225=\"HLDT/MDPV\",B225=\"HLDT Allowance only\", B225=\"MDPV Allowance only\"), 0.5, IF(B225=\"HDV\", 0.6,   ERROR)))))","v":""},"","","","",""]
[null,null,null,null,null,null,null,null,null,null,null,null,null,null,null,null,null,null,null,null,null,null,{"$f":"IF(A226=\"\",\"\", IF(B226=\"LDV/LDT1\", 0.3,  IF(B226=\"LDT2\", 0.4, IF(OR(B226=\"HLDT/MDPV\",B226=\"HLDT Allowance only\", B226=\"MDPV Allowance only\"), 0.5, IF(B226=\"HDV\", 0.6,   ERROR)))))","v":""},"","","","",""]
[null,null,null,null,null,null,null,null,null,null,null,null,null,null,null,null,null,null,null,null,null,null,{"$f":"IF(A227=\"\",\"\", IF(B227=\"LDV/LDT1\", 0.3,  IF(B227=\"LDT2\", 0.4, IF(OR(B227=\"HLDT/MDPV\",B227=\"HLDT Allowance only\", B227=\"MDPV Allowance only\"), 0.5, IF(B227=\"HDV\", 0.6,   ERROR)))))","v":""},"","","","",""]
[null,null,null,null,null,null,null,null,null,null,null,null,null,null,null,null,null,null,null,null,null,null,{"$f":"IF(A228=\"\",\"\", IF(B228=\"LDV/LDT1\", 0.3,  IF(B228=\"LDT2\", 0.4, IF(OR(B228=\"HLDT/MDPV\",B228=\"HLDT Allowance only\", B228=\"MDPV Allowance only\"), 0.5, IF(B228=\"HDV\", 0.6,   ERROR)))))","v":""},"","","","",""]
[null,null,null,null,null,null,null,null,null,null,null,null,null,null,null,null,null,null,null,null,null,null,{"$f":"IF(A229=\"\",\"\", IF(B229=\"LDV/LDT1\", 0.3,  IF(B229=\"LDT2\", 0.4, IF(OR(B229=\"HLDT/MDPV\",B229=\"HLDT Allowance only\", B229=\"MDPV Allowance only\"), 0.5, IF(B229=\"HDV\", 0.6,   ERROR)))))","v":""},"","","","",""]
[null,null,null,null,null,null,null,null,null,null,null,null,null,null,null,null,null,null,null,null,null,null,{"$f":"IF(A230=\"\",\"\", IF(B230=\"LDV/LDT1\", 0.3,  IF(B230=\"LDT2\", 0.4, IF(OR(B230=\"HLDT/MDPV\",B230=\"HLDT Allowance only\", B230=\"MDPV Allowance only\"), 0.5, IF(B230=\"HDV\", 0.6,   ERROR)))))","v":""},"","","","",""]
[null,null,null,null,null,null,null,null,null,null,null,null,null,null,null,null,null,null,null,null,null,null,{"$f":"IF(A231=\"\",\"\", IF(B231=\"LDV/LDT1\", 0.3,  IF(B231=\"LDT2\", 0.4, IF(OR(B231=\"HLDT/MDPV\",B231=\"HLDT Allowance only\", B231=\"MDPV Allowance only\"), 0.5, IF(B231=\"HDV\", 0.6,   ERROR)))))","v":""},"","","","",""]
[null,null,null,null,null,null,null,null,null,null,null,null,null,null,null,null,null,null,null,null,null,null,{"$f":"IF(A232=\"\",\"\", IF(B232=\"LDV/LDT1\", 0.3,  IF(B232=\"LDT2\", 0.4, IF(OR(B232=\"HLDT/MDPV\",B232=\"HLDT Allowance only\", B232=\"MDPV Allowance only\"), 0.5, IF(B232=\"HDV\", 0.6,   ERROR)))))","v":""},"","","","",""]
[null,null,null,null,null,null,null,null,null,null,null,null,null,null,null,null,null,null,null,null,null,null,{"$f":"IF(A233=\"\",\"\", IF(B233=\"LDV/LDT1\", 0.3,  IF(B233=\"LDT2\", 0.4, IF(OR(B233=\"HLDT/MDPV\",B233=\"HLDT Allowance only\", B233=\"MDPV Allowance only\"), 0.5, IF(B233=\"HDV\", 0.6,   ERROR)))))","v":""},"","","","",""]
[null,null,null,null,null,null,null,null,null,null,null,null,null,null,null,null,null,null,null,null,null,null,{"$f":"IF(A234=\"\",\"\", IF(B234=\"LDV/LDT1\", 0.3,  IF(B234=\"LDT2\", 0.4, IF(OR(B234=\"HLDT/MDPV\",B234=\"HLDT Allowance only\", B234=\"MDPV Allowance only\"), 0.5, IF(B234=\"HDV\", 0.6,   ERROR)))))","v":""},"","","","",""]
[null,null,null,null,null,null,null,null,null,null,null,null,null,null,null,null,null,null,null,null,null,null,{"$f":"IF(A235=\"\",\"\", IF(B235=\"LDV/LDT1\", 0.3,  IF(B235=\"LDT2\", 0.4, IF(OR(B235=\"HLDT/MDPV\",B235=\"HLDT Allowance only\", B235=\"MDPV Allowance only\"), 0.5, IF(B235=\"HDV\", 0.6,   ERROR)))))","v":""},"","","","",""]
[null,null,null,null,null,null,null,null,null,null,null,null,null,null,null,null,null,null,null,null,null,null,{"$f":"IF(A236=\"\",\"\", IF(B236=\"LDV/LDT1\", 0.3,  IF(B236=\"LDT2\", 0.4, IF(OR(B236=\"HLDT/MDPV\",B236=\"HLDT Allowance only\", B236=\"MDPV Allowance only\"), 0.5, IF(B236=\"HDV\", 0.6,   ERROR)))))","v":""},"","","","",""]
[null,null,null,null,null,null,null,null,null,null,null,null,null,null,null,null,null,null,null,null,null,null,{"$f":"IF(A237=\"\",\"\", IF(B237=\"LDV/LDT1\", 0.3,  IF(B237=\"LDT2\", 0.4, IF(OR(B237=\"HLDT/MDPV\",B237=\"HLDT Allowance only\", B237=\"MDPV Allowance only\"), 0.5, IF(B237=\"HDV\", 0.6,   ERROR)))))","v":""},"","","","",""]
[null,null,null,null,null,null,null,null,null,null,null,null,null,null,null,null,null,null,null,null,null,null,{"$f":"IF(A238=\"\",\"\", IF(B238=\"LDV/LDT1\", 0.3,  IF(B238=\"LDT2\", 0.4, IF(OR(B238=\"HLDT/MDPV\",B238=\"HLDT Allowance only\", B238=\"MDPV Allowance only\"), 0.5, IF(B238=\"HDV\", 0.6,   ERROR)))))","v":""},"","","","",""]
[null,null,null,null,null,null,null,null,null,null,null,null,null,null,null,null,null,null,null,null,null,null,{"$f":"IF(A239=\"\",\"\", IF(B239=\"LDV/LDT1\", 0.3,  IF(B239=\"LDT2\", 0.4, IF(OR(B239=\"HLDT/MDPV\",B239=\"HLDT Allowance only\", B239=\"MDPV Allowance only\"), 0.5, IF(B239=\"HDV\", 0.6,   ERROR)))))","v":""},"","","","",""]
[null,null,null,null,null,null,null,null,null,null,null,null,null,null,null,null,null,null,null,null,null,null,{"$f":"IF(A240=\"\",\"\", IF(B240=\"LDV/LDT1\", 0.3,  IF(B240=\"LDT2\", 0.4, IF(OR(B240=\"HLDT/MDPV\",B240=\"HLDT Allowance only\", B240=\"MDPV Allowance only\"), 0.5, IF(B240=\"HDV\", 0.6,   ERROR)))))","v":""},"","","","",""]
[null,null,null,null,null,null,null,null,null,null,null,null,null,null,null,null,null,null,null,null,null,null,{"$f":"IF(A241=\"\",\"\", IF(B241=\"LDV/LDT1\", 0.3,  IF(B241=\"LDT2\", 0.4, IF(OR(B241=\"HLDT/MDPV\",B241=\"HLDT Allowance only\", B241=\"MDPV Allowance only\"), 0.5, IF(B241=\"HDV\", 0.6,   ERROR)))))","v":""},"","","","",""]
[null,null,null,null,null,null,null,null,null,null,null,null,null,null,null,null,null,null,null,null,null,null,{"$f":"IF(A242=\"\",\"\", IF(B242=\"LDV/LDT1\", 0.3,  IF(B242=\"LDT2\", 0.4, IF(OR(B242=\"HLDT/MDPV\",B242=\"HLDT Allowance only\", B242=\"MDPV Allowance only\"), 0.5, IF(B242=\"HDV\", 0.6,   ERROR)))))","v":""},"","","","",""]
[null,null,null,null,null,null,null,null,null,null,null,null,null,null,null,null,null,null,null,null,null,null,{"$f":"IF(A243=\"\",\"\", IF(B243=\"LDV/LDT1\", 0.3,  IF(B243=\"LDT2\", 0.4, IF(OR(B243=\"HLDT/MDPV\",B243=\"HLDT Allowance only\", B243=\"MDPV Allowance only\"), 0.5, IF(B243=\"HDV\", 0.6,   ERROR)))))","v":""},"","","","",""]
[null,null,null,null,null,null,null,null,null,null,null,null,null,null,null,null,null,null,null,null,null,null,{"$f":"IF(A244=\"\",\"\", IF(B244=\"LDV/LDT1\", 0.3,  IF(B244=\"LDT2\", 0.4, IF(OR(B244=\"HLDT/MDPV\",B244=\"HLDT Allowance only\", B244=\"MDPV Allowance only\"), 0.5, IF(B244=\"HDV\", 0.6,   ERROR)))))","v":""},"","","","",""]
[null,null,null,null,null,null,null,null,null,null,null,null,null,null,null,null,null,null,null,null,null,null,{"$f":"IF(A245=\"\",\"\", IF(B245=\"LDV/LDT1\", 0.3,  IF(B245=\"LDT2\", 0.4, IF(OR(B245=\"HLDT/MDPV\",B245=\"HLDT Allowance only\", B245=\"MDPV Allowance only\"), 0.5, IF(B245=\"HDV\", 0.6,   ERROR)))))","v":""},"","","","",""]
[null,null,null,null,null,null,null,null,null,null,null,null,null,null,null,null,null,null,null,null,null,null,{"$f":"IF(A246=\"\",\"\", IF(B246=\"LDV/LDT1\", 0.3,  IF(B246=\"LDT2\", 0.4, IF(OR(B246=\"HLDT/MDPV\",B246=\"HLDT Allowance only\", B246=\"MDPV Allowance only\"), 0.5, IF(B246=\"HDV\", 0.6,   ERROR)))))","v":""},"","","","",""]
[null,null,null,null,null,null,null,null,null,null,null,null,null,null,null,null,null,null,null,null,null,null,{"$f":"IF(A247=\"\",\"\", IF(B247=\"LDV/LDT1\", 0.3,  IF(B247=\"LDT2\", 0.4, IF(OR(B247=\"HLDT/MDPV\",B247=\"HLDT Allowance only\", B247=\"MDPV Allowance only\"), 0.5, IF(B247=\"HDV\", 0.6,   ERROR)))))","v":""},"","","","",""]
[null,null,null,null,null,null,null,null,null,null,null,null,null,null,null,null,null,null,null,null,null,null,{"$f":"IF(A248=\"\",\"\", IF(B248=\"LDV/LDT1\", 0.3,  IF(B248=\"LDT2\", 0.4, IF(OR(B248=\"HLDT/MDPV\",B248=\"HLDT Allowance only\", B248=\"MDPV Allowance only\"), 0.5, IF(B248=\"HDV\", 0.6,   ERROR)))))","v":""},"","","","",""]
[null,null,null,null,null,null,null,null,null,null,null,null,null,null,null,null,null,null,null,null,null,null,{"$f":"IF(A249=\"\",\"\", IF(B249=\"LDV/LDT1\", 0.3,  IF(B249=\"LDT2\", 0.4, IF(OR(B249=\"HLDT/MDPV\",B249=\"HLDT Allowance only\", B249=\"MDPV Allowance only\"), 0.5, IF(B249=\"HDV\", 0.6,   ERROR)))))","v":""},"","","","",""]
[null,null,null,null,null,null,null,null,null,null,null,null,null,null,null,null,null,null,null,null,null,null,{"$f":"IF(A250=\"\",\"\", IF(B250=\"LDV/LDT1\", 0.3,  IF(B250=\"LDT2\", 0.4, IF(OR(B250=\"HLDT/MDPV\",B250=\"HLDT Allowance only\", B250=\"MDPV Allowance only\"), 0.5, IF(B250=\"HDV\", 0.6,   ERROR)))))","v":""},"","","","",""]
[null,null,null,null,null,null,null,null,null,null,null,null,null,null,null,null,null,null,null,null,null,null,{"$f":"IF(A251=\"\",\"\", IF(B251=\"LDV/LDT1\", 0.3,  IF(B251=\"LDT2\", 0.4, IF(OR(B251=\"HLDT/MDPV\",B251=\"HLDT Allowance only\", B251=\"MDPV Allowance only\"), 0.5, IF(B251=\"HDV\", 0.6,   ERROR)))))","v":""},"","","","",""]
[null,null,null,null,null,null,null,null,null,null,null,null,null,null,null,null,null,null,null,null,null,null,{"$f":"IF(A252=\"\",\"\", IF(B252=\"LDV/LDT1\", 0.3,  IF(B252=\"LDT2\", 0.4, IF(OR(B252=\"HLDT/MDPV\",B252=\"HLDT Allowance only\", B252=\"MDPV Allowance only\"), 0.5, IF(B252=\"HDV\", 0.6,   ERROR)))))","v":""},"","","","",""]
[null,null,null,null,null,null,null,null,null,null,null,null,null,null,null,null,null,null,null,null,null,null,{"$f":"IF(A253=\"\",\"\", IF(B253=\"LDV/LDT1\", 0.3,  IF(B253=\"LDT2\", 0.4, IF(OR(B253=\"HLDT/MDPV\",B253=\"HLDT Allowance only\", B253=\"MDPV Allowance only\"), 0.5, IF(B253=\"HDV\", 0.6,   ERROR)))))","v":""},"","","","",""]
[null,null,null,null,null,null,null,null,null,null,null,null,null,null,null,null,null,null,null,null,null,null,{"$f":"IF(A254=\"\",\"\", IF(B254=\"LDV/LDT1\", 0.3,  IF(B254=\"LDT2\", 0.4, IF(OR(B254=\"HLDT/MDPV\",B254=\"HLDT Allowance only\", B254=\"MDPV Allowance only\"), 0.5, IF(B254=\"HDV\", 0.6,   ERROR)))))","v":""},"","","","",""]
[null,null,null,null,null,null,null,null,null,null,null,null,null,null,null,null,null,null,null,null,null,null,{"$f":"IF(A255=\"\",\"\", IF(B255=\"LDV/LDT1\", 0.3,  IF(B255=\"LDT2\", 0.4, IF(OR(B255=\"HLDT/MDPV\",B255=\"HLDT Allowance only\", B255=\"MDPV Allowance only\"), 0.5, IF(B255=\"HDV\", 0.6,   ERROR)))))","v":""},"","","","",""]
[null,null,null,null,null,null,null,null,null,null,null,null,null,null,null,null,null,null,null,null,null,null,{"$f":"IF(A256=\"\",\"\", IF(B256=\"LDV/LDT1\", 0.3,  IF(B256=\"LDT2\", 0.4, IF(OR(B256=\"HLDT/MDPV\",B256=\"HLDT Allowance only\", B256=\"MDPV Allowance only\"), 0.5, IF(B256=\"HDV\", 0.6,   ERROR)))))","v":""},"","","","",""]
[null,null,null,null,null,null,null,null,null,null,null,null,null,null,null,null,null,null,null,null,null,null,{"$f":"IF(A257=\"\",\"\", IF(B257=\"LDV/LDT1\", 0.3,  IF(B257=\"LDT2\", 0.4, IF(OR(B257=\"HLDT/MDPV\",B257=\"HLDT Allowance only\", B257=\"MDPV Allowance only\"), 0.5, IF(B257=\"HDV\", 0.6,   ERROR)))))","v":""},"","","","",""]
[null,null,null,null,null,null,null,null,null,null,null,null,null,null,null,null,null,null,null,null,null,null,{"$f":"IF(A258=\"\",\"\", IF(B258=\"LDV/LDT1\", 0.3,  IF(B258=\"LDT2\", 0.4, IF(OR(B258=\"HLDT/MDPV\",B258=\"HLDT Allowance only\", B258=\"MDPV Allowance only\"), 0.5, IF(B258=\"HDV\", 0.6,   ERROR)))))","v":""},"","","","",""]
[null,null,null,null,null,null,null,null,null,null,null,null,null,null,null,null,null,null,null,null,null,null,{"$f":"IF(A259=\"\",\"\", IF(B259=\"LDV/LDT1\", 0.3,  IF(B259=\"LDT2\", 0.4, IF(OR(B259=\"HLDT/MDPV\",B259=\"HLDT Allowance only\", B259=\"MDPV Allowance only\"), 0.5, IF(B259=\"HDV\", 0.6,   ERROR)))))","v":""},"","","","",""]
[null,null,null,null,null,null,null,null,null,null,null,null,null,null,null,null,null,null,null,null,null,null,{"$f":"IF(A260=\"\",\"\", IF(B260=\"LDV/LDT1\", 0.3,  IF(B260=\"LDT2\", 0.4, IF(OR(B260=\"HLDT/MDPV\",B260=\"HLDT Allowance only\", B260=\"MDPV Allowance only\"), 0.5, IF(B260=\"HDV\", 0.6,   ERROR)))))","v":""},"","","","",""]
[null,null,null,null,null,null,null,null,null,null,null,null,null,null,null,null,null,null,null,null,null,null,{"$f":"IF(A261=\"\",\"\", IF(B261=\"LDV/LDT1\", 0.3,  IF(B261=\"LDT2\", 0.4, IF(OR(B261=\"HLDT/MDPV\",B261=\"HLDT Allowance only\", B261=\"MDPV Allowance only\"), 0.5, IF(B261=\"HDV\", 0.6,   ERROR)))))","v":""},"","","","",""]
[null,null,null,null,null,null,null,null,null,null,null,null,null,null,null,null,null,null,null,null,null,null,{"$f":"IF(A262=\"\",\"\", IF(B262=\"LDV/LDT1\", 0.3,  IF(B262=\"LDT2\", 0.4, IF(OR(B262=\"HLDT/MDPV\",B262=\"HLDT Allowance only\", B262=\"MDPV Allowance only\"), 0.5, IF(B262=\"HDV\", 0.6,   ERROR)))))","v":""},"","","","",""]
[null,null,null,null,null,null,null,null,null,null,null,null,null,null,null,null,null,null,null,null,null,null,{"$f":"IF(A263=\"\",\"\", IF(B263=\"LDV/LDT1\", 0.3,  IF(B263=\"LDT2\", 0.4, IF(OR(B263=\"HLDT/MDPV\",B263=\"HLDT Allowance only\", B263=\"MDPV Allowance only\"), 0.5, IF(B263=\"HDV\", 0.6,   ERROR)))))","v":""},"","","","",""]
[null,null,null,null,null,null,null,null,null,null,null,null,null,null,null,null,null,null,null,null,null,null,{"$f":"IF(A264=\"\",\"\", IF(B264=\"LDV/LDT1\", 0.3,  IF(B264=\"LDT2\", 0.4, IF(OR(B264=\"HLDT/MDPV\",B264=\"HLDT Allowance only\", B264=\"MDPV Allowance only\"), 0.5, IF(B264=\"HDV\", 0.6,   ERROR)))))","v":""},"","","","",""]
[null,null,null,null,null,null,null,null,null,null,null,null,null,null,null,null,null,null,null,null,null,null,{"$f":"IF(A265=\"\",\"\", IF(B265=\"LDV/LDT1\", 0.3,  IF(B265=\"LDT2\", 0.4, IF(OR(B265=\"HLDT/MDPV\",B265=\"HLDT Allowance only\", B265=\"MDPV Allowance only\"), 0.5, IF(B265=\"HDV\", 0.6,   ERROR)))))","v":""},"","","","",""]
[null,null,null,null,null,null,null,null,null,null,null,null,null,null,null,null,null,null,null,null,null,null,{"$f":"IF(A266=\"\",\"\", IF(B266=\"LDV/LDT1\", 0.3,  IF(B266=\"LDT2\", 0.4, IF(OR(B266=\"HLDT/MDPV\",B266=\"HLDT Allowance only\", B266=\"MDPV Allowance only\"), 0.5, IF(B266=\"HDV\", 0.6,   ERROR)))))","v":""},"","","","",""]
[null,null,null,null,null,null,null,null,null,null,null,null,null,null,null,null,null,null,null,null,null,null,{"$f":"IF(A267=\"\",\"\", IF(B267=\"LDV/LDT1\", 0.3,  IF(B267=\"LDT2\", 0.4, IF(OR(B267=\"HLDT/MDPV\",B267=\"HLDT Allowance only\", B267=\"MDPV Allowance only\"), 0.5, IF(B267=\"HDV\", 0.6,   ERROR)))))","v":""},"","","","",""]
[null,null,null,null,null,null,null,null,null,null,null,null,null,null,null,null,null,null,null,null,null,null,{"$f":"IF(A268=\"\",\"\", IF(B268=\"LDV/LDT1\", 0.3,  IF(B268=\"LDT2\", 0.4, IF(OR(B268=\"HLDT/MDPV\",B268=\"HLDT Allowance only\", B268=\"MDPV Allowance only\"), 0.5, IF(B268=\"HDV\", 0.6,   ERROR)))))","v":""},"","","","",""]
[null,null,null,null,null,null,null,null,null,null,null,null,null,null,null,null,null,null,null,null,null,null,{"$f":"IF(A269=\"\",\"\", IF(B269=\"LDV/LDT1\", 0.3,  IF(B269=\"LDT2\", 0.4, IF(OR(B269=\"HLDT/MDPV\",B269=\"HLDT Allowance only\", B269=\"MDPV Allowance only\"), 0.5, IF(B269=\"HDV\", 0.6,   ERROR)))))","v":""},"","","","",""]
[null,null,null,null,null,null,null,null,null,null,null,null,null,null,null,null,null,null,null,null,null,null,{"$f":"IF(A270=\"\",\"\", IF(B270=\"LDV/LDT1\", 0.3,  IF(B270=\"LDT2\", 0.4, IF(OR(B270=\"HLDT/MDPV\",B270=\"HLDT Allowance only\", B270=\"MDPV Allowance only\"), 0.5, IF(B270=\"HDV\", 0.6,   ERROR)))))","v":""},"","","","",""]
[null,null,null,null,null,null,null,null,null,null,null,null,null,null,null,null,null,null,null,null,null,null,{"$f":"IF(A271=\"\",\"\", IF(B271=\"LDV/LDT1\", 0.3,  IF(B271=\"LDT2\", 0.4, IF(OR(B271=\"HLDT/MDPV\",B271=\"HLDT Allowance only\", B271=\"MDPV Allowance only\"), 0.5, IF(B271=\"HDV\", 0.6,   ERROR)))))","v":""},"","","","",""]
[null,null,null,null,null,null,null,null,null,null,null,null,null,null,null,null,null,null,null,null,null,null,{"$f":"IF(A272=\"\",\"\", IF(B272=\"LDV/LDT1\", 0.3,  IF(B272=\"LDT2\", 0.4, IF(OR(B272=\"HLDT/MDPV\",B272=\"HLDT Allowance only\", B272=\"MDPV Allowance only\"), 0.5, IF(B272=\"HDV\", 0.6,   ERROR)))))","v":""},"","","","",""]
[null,null,null,null,null,null,null,null,null,null,null,null,null,null,null,null,null,null,null,null,null,null,{"$f":"IF(A273=\"\",\"\", IF(B273=\"LDV/LDT1\", 0.3,  IF(B273=\"LDT2\", 0.4, IF(OR(B273=\"HLDT/MDPV\",B273=\"HLDT Allowance only\", B273=\"MDPV Allowance only\"), 0.5, IF(B273=\"HDV\", 0.6,   ERROR)))))","v":""},"","","","",""]
[null,null,null,null,null,null,null,null,null,null,null,null,null,null,null,null,null,null,null,null,null,null,{"$f":"IF(A274=\"\",\"\", IF(B274=\"LDV/LDT1\", 0.3,  IF(B274=\"LDT2\", 0.4, IF(OR(B274=\"HLDT/MDPV\",B274=\"HLDT Allowance only\", B274=\"MDPV Allowance only\"), 0.5, IF(B274=\"HDV\", 0.6,   ERROR)))))","v":""},"","","","",""]
[null,null,null,null,null,null,null,null,null,null,null,null,null,null,null,null,null,null,null,null,null,null,{"$f":"IF(A275=\"\",\"\", IF(B275=\"LDV/LDT1\", 0.3,  IF(B275=\"LDT2\", 0.4, IF(OR(B275=\"HLDT/MDPV\",B275=\"HLDT Allowance only\", B275=\"MDPV Allowance only\"), 0.5, IF(B275=\"HDV\", 0.6,   ERROR)))))","v":""},"","","","",""]
[null,null,null,null,null,null,null,null,null,null,null,null,null,null,null,null,null,null,null,null,null,null,{"$f":"IF(A276=\"\",\"\", IF(B276=\"LDV/LDT1\", 0.3,  IF(B276=\"LDT2\", 0.4, IF(OR(B276=\"HLDT/MDPV\",B276=\"HLDT Allowance only\", B276=\"MDPV Allowance only\"), 0.5, IF(B276=\"HDV\", 0.6,   ERROR)))))","v":""},"","","","",""]
[null,null,null,null,null,null,null,null,null,null,null,null,null,null,null,null,null,null,null,null,null,null,{"$f":"IF(A277=\"\",\"\", IF(B277=\"LDV/LDT1\", 0.3,  IF(B277=\"LDT2\", 0.4, IF(OR(B277=\"HLDT/MDPV\",B277=\"HLDT Allowance only\", B277=\"MDPV Allowance only\"), 0.5, IF(B277=\"HDV\", 0.6,   ERROR)))))","v":""},{"$f":"IF(A277=\"\", \"\", IF(J277 = \"Yes\", W277, IF(K277=\"Yes\", W277, IF(AND(A277<>\"\",B277=\"HDV\",E277=\"Statement\"), MAX(C277, W277),C277))))","v":""},{"$f":"IF(A277=\"\",\"\",IF(AND(A277<>\"\",L277=\"Yes\",$C$8>2021),\"ERROR--Can't Use Early Allowances after 2021MY\",\nIF(AND(A277<>\"\",B277=\"HLDT Allowance only\",$C$8=2017),\"Can't Use HLDT Allowance before 2018MY\",IF(AND(A277<>\"\",B277=\"MDPV Allowance only\",$C$8=2017),\"Can't Use MDPV Allowance before 2018MY\",IF(AND(A277<>\"\",B277=\"HLDT/MDPV\",$C$8=2017),\"Can't Use HLDT/MDPV Allowance before 2018MY\",IF(AND(A277<>\"\",B277=\"HDV\",$C$8=2017),\"Can't Use HDV Allowance before 2018MY\",IF(AND(A277<>\"\",L277=\"Yes\",J277<>\"Yes\",K277<>\"Yes\",C277>W277),\"ERROR--Early Allowance evaporative family does not comply with Tier 3 standards and is not a 2015 or 2016 Carryover PZEV or Carryover LEV3 Option 1 (Rig Test) Evap family\",IF(AND(A277<>\"\",L277=\"Yes\",B277=\"HDV\",O277=\"\"),\"FIX 50-St Prod'n--needed for HDV Allowances\",IF(AND(A277<>\"\",B277=\"MDPV Allowance only\",O277=\"\"),\"FIX 50-St Prod'n--needed for MDPV early allowances\",IF(AND(A277<>\"\",L277=\"Yes\",B277=\"LDV/LDT1\",N277=\"\"),\"FIX Fed Prod'n--needed for LDV/LDT1 early allowances\",IF(AND(A277<>\"\",L277=\"Yes\",B277=\"LDT2\",N277=\"\"),\"FIX Fed Prod'n--needed for LDT2 early allowances\",IF(AND(A277<>\"\",L277=\"Yes\",B277=\"HLDT Allowance only\",N277=\"\"),\"FIX Fed Prod'n--needed for HLDT early allowances\",IF(AND(A277<>\"\",L277=\"Yes\",B277=\"HLDT/MDPV\"),\"ERROR in Col B--must use HLDT Allowance only or MDPV Allowance only value from Column B menu and corresponding production values for HLDT Allowances or MDPV Allowances as applicable\",IF(AND(A277<>\"\",B277=\"HDV\",D277=\"\"),\"ERROR--Column B is HDV but HDV Class in Column E is Blank\",IF(AND(A277<>\"\",B277<>\"\",B277<>\"HDV\",D277<>\"\"),\"ERROR--Column B is not HDV but you entered a HDV Class in Column E\",IF(AND(A277<>\"\",B277=\"HDV\",D277=4,E277=\"\"),\"ERROR--Column E indicates HDV Class 4-8 but Certification Basis in Column F is Blank\",IF(AND(A277<>\"\",B277=\"HDV\",D277=5,E277=\"\"),\"ERROR--Column E indicates HDV Class 4-8 but Certification Basis in Column F is Blank\",IF(AND(A277<>\"\",B277=\"HDV\",D277=6,E277=\"\"),\"ERROR--Column E indicates HDV Class 4-8 but Certification Basis in Column F is Blank\",IF(AND(A277<>\"\",B277=\"HDV\",D277=7,E277=\"\"),\"ERROR--Column E indicates HDV Class 4-8 but Certification Basis in Column F is Blank\",IF(AND(A277<>\"\",B277=\"HDV\",D277=8,E277=\"\"),\"ERROR--Column E indicates HDV Class 4-8 but Certification Basis in Column F is Blank\",IF(AND(A277<>\"\",D277=\"2b\",E277=\"Statement\"),\"ERROR in Columns E & F---Can't use Statement for Certification Basis of Class 2b HDVs\",IF(AND(A277<>\"\",D277=3,E277=\"Statement\"),\"ERROR in Columns E & F---Can't use Statement for Certification Basis of Class 3 HDVs\",IF(AND(A277<>\"\",B277<>\"HDV\",E277=\"Statement\"),\"ERROR in Columns B & F---Can only use Statement as the Certification Basis of Class 4 and above HDVs\",IF(AND(A277<>\"\",I277=\"Phase 2\",J277=\"No\"),\"ERROR--Can only use Phase 2 test fuel for 2015-2016 Carryover PZEV Option 1 (Rig Test) Evaporative Families\",IF(AND(A277<>\"\",I277=\"NA\",E277<>\"Statement\"),\"ERROR in Columns F & J---Can only use NA for Test Fuel if Certification is based on a Statement\",IF(AND(A277<>\"\",J277=\"Yes\",I277<>\"Phase 2\"),\"ERROR--Test fuel must be Phase 2 for 2015-2016 Carryover PZEV Option 1 (Rig test) evaporative families\",IF(AND(A277<>\"\",J277=\"Yes\",C277<>0.35,C277<>0.5,C277<>0.75),\"ERROR--FEL must be 0.350, 0.500 or 0.750 for 2015-2016 Carryover PZEV Option 1 (Rig test) evaporative families\",IF(AND(A277<>\"\",J277=\"Yes\",B277<>\"LDV/LDT1\",B277<>\"LDT2\",B277<>\"HLDT/MDPV\"),\"ERROR--Vehicle class must be LDV/LDT1 or LDT2 or HLDT/MDPV for 2015-2016 Carryover PZEV Option 1 (Rig test) evaporative families\",IF(AND(A277<>\"\",$C$8>2019,J277=\"Yes\",L277<>\"Yes\"),\"ERROR--Can't use Carryover data from 2015-2016 PZEV Option 1 (Rig test) using Phase 2 test fuel after 2019MY (or after 2021MY if used as an Early Allowance)\",IF(AND(A277<>\"\",K277=\"Yes\",I277<>\"LEV 3\"),\"ERROR--Test fuel must be LEV 3 for 2015-2016 Carryover LEV3 Option 1 (Rig test) evaporative families\",IF(AND(A277<>\"\",K277=\"Yes\",C277<>0.35,C277<>0.5,C277<>0.75),\"ERROR--FEL must be 0.350, 0.500 or 0.750 for 2015-2016 Carryover LEV3 Option 1 (Rig test) evaporative families\",IF(AND(A277<>\"\",$C$8>2021,K277=\"Yes\"),\"ERROR--Can't use Carryover data from 2015-2016 CARB LEV3 Option 1 (Rig test) using LEV 3 test fuel after 2021MY\",IF(AND(A277<>\"\",B277<>\"LDV/LDT1\",G277=120),\"ERROR--Useful Life must be 150,000 miles for this Tier 3 Evaporative Family\",IF(AND(A277<>\"\",L277=\"Yes\",M277<>2015,M277<>2016,M277<>2017),\"FIX Model Year Early Allowance was earned\",IF(AND(A277<>\"\",L277=\"No\",M277<>\"\",M277<>\"NA\"),\"Error in cols M & N---column M indicates No Allowance but Column N indicates an allowance was earned\",IF(AND(A277<>\"\",L277=\"Yes\",B277<>\"HDV\",B277<>\"HLDT Allowance only\",B277<>\"MDPV Allowance only\",M277=2017),\"ERROR--Early allowances can't be earned in 2017MY for LDV/LDT1 and LDT2 Evaporative Families\",IF(AND(A277<>\"\",$C$8=2017,N277=\"\"),\"FIX Federal Prod'n--needed for 2017MY compliance\",IF(AND(A277<>\"\",$C$8<>2017,L277=\"No\",O277=\"\"),\"FIX 50-St Prod'n\",IF(AND(A277<>\"\",B277=\"HLDT Allowance only\",L277<>\"Yes\"),\"ERROR - Cols B & M--Column B indicates an Allowance is being used but Column M indicates No Allowance\",IF(AND(A277<>\"\",B277=\"MDPV Allowance only\",L277<>\"Yes\"),\"ERROR - Cols B & M--Column B indicates an Allowance is being use but Column M indicates No Allowance\",IF(AND(A277<>\"\",B277=\"HDV\",D277<> \"2b\", L277=\"Yes\",F277 =\"\"),\"FIX Column G 'HDV also meets ORVR Standards'---needed for HDV Class 3 and above Allowances\",IF(AND(A277<>\"\",B277=\"HDV\",D277<> \"2b\", L277=\"Yes\",F277 =\"Yes\"), 2*O277,IF(AND(A277<>\"\",L277=\"Yes\",B277=\"LDV/LDT1\"),N277,IF(AND(A277<>\"\",L277=\"Yes\",B277=\"LDT2\"),N277,IF(AND(A277<>\"\",L277=\"Yes\",B277=\"HLDT Allowance only\"),N277,IF(AND(A277<>\"\",L277=\"No\",$C$8=2017),N277,O277))))))))))))))))))))))))))))))))))))))))))))))","v":""},{"$f":"IF(AND(A277=\"\",N277<>\"\"),\"FIX TEST GROUP\",IF(AND(A277=\"\",O277<>\"\"),\"FIX TEST GROUP\",IF(A277=\"\",\"\", IF(B277=\"\",\"FIX CLASS\",IF(C277=\"\",\"FIX FEL\",IF(G277=\"\",\"FIX U/L Miles\",IF(I277=\"\",\"FIX Test Fuel\",IF(J277=\"\",\"FIX PZEV Carryover\",IF(K277=\"\",\"FIX CARB Opt 1 Carryover\",IF(L277=\"\",\"FIX Allowance Y/N\",IF(M277=\"\",\"FIX Allowance MY\",IF(Y277=\"\",\"FIX PROD'N in Column Q\",Y277*X277))))))))))))","v":""},{"$f":"IF(A277=\"\",\"\",IF(AND(A277<>\"\",B277=\"LDV/LDT1\",C277<=0.5),\"OK\",IF(AND(A277<>\"\",B277=\"LDT2\",C277<=0.65),\"OK\",IF(AND(A277<>\"\",B277=\"HLDT/MDPV\",C277<=0.9),\"OK\",IF(AND(A277<>\"\",B277=\"HLDT/MDPV\",C277>0.9,C277<=1),\"OK if HLDTs < 0.9\",IF(AND(A277<>\"\",B277=\"HDV\",D277=\"2b\",C277<=1.4),\"OK\",IF(AND(A277<>\"\",B277=\"HDV\",D277=3,C277<=1.4),\"OK\",IF(AND(A277<>\"\",B277=\"HDV\",C277<=1.9, D277>=4),\"OK\",IF(AND(A277<>\"\",B277=\"HLDT Allowance only\"),\"OK\",IF(AND(A277<>\"\",B277=\"MDPV Allowance only\"),\"OK\",\"FEL exceeds CAP\"))))))))))","v":""},{"$f":"IF(ISNUMBER(Y277)=TRUE, \"\", Y277)","v":""}]
[null,null,null,null,null,null,null,null,null,null,null,null,null,null,null,null,null,null,null,null,null,null,{"$f":"IF(A278=\"\",\"\", IF(B278=\"LDV/LDT1\", 0.3,  IF(B278=\"LDT2\", 0.4, IF(OR(B278=\"HLDT/MDPV\",B278=\"HLDT Allowance only\", B278=\"MDPV Allowance only\"), 0.5, IF(B278=\"HDV\", 0.6,   ERROR)))))","v":""},"","","","",""]
[null,null,null,null,null,null,null,null,null,null,null,null,null,null,null,null,null,null,null,null,null,null,{"$f":"IF(A279=\"\",\"\", IF(B279=\"LDV/LDT1\", 0.3,  IF(B279=\"LDT2\", 0.4, IF(OR(B279=\"HLDT/MDPV\",B279=\"HLDT Allowance only\", B279=\"MDPV Allowance only\"), 0.5, IF(B279=\"HDV\", 0.6,   ERROR)))))","v":""},"","","","",""]
[null,null,null,null,null,null,null,null,null,null,null,null,null,null,null,null,null,null,null,null,null,null,{"$f":"IF(A280=\"\",\"\", IF(B280=\"LDV/LDT1\", 0.3,  IF(B280=\"LDT2\", 0.4, IF(OR(B280=\"HLDT/MDPV\",B280=\"HLDT Allowance only\", B280=\"MDPV Allowance only\"), 0.5, IF(B280=\"HDV\", 0.6,   ERROR)))))","v":""},"","","","",""]
[null,null,null,null,null,null,null,null,null,null,null,null,null,null,null,null,null,null,null,null,null,null,{"$f":"IF(A281=\"\",\"\", IF(B281=\"LDV/LDT1\", 0.3,  IF(B281=\"LDT2\", 0.4, IF(OR(B281=\"HLDT/MDPV\",B281=\"HLDT Allowance only\", B281=\"MDPV Allowance only\"), 0.5, IF(B281=\"HDV\", 0.6,   ERROR)))))","v":""},"","","","",""]
[null,null,null,null,null,null,null,null,null,null,null,null,null,null,null,null,null,null,null,null,null,null,{"$f":"IF(A282=\"\",\"\", IF(B282=\"LDV/LDT1\", 0.3,  IF(B282=\"LDT2\", 0.4, IF(OR(B282=\"HLDT/MDPV\",B282=\"HLDT Allowance only\", B282=\"MDPV Allowance only\"), 0.5, IF(B282=\"HDV\", 0.6,   ERROR)))))","v":""},"","","","",""]
[null,null,null,null,null,null,null,null,null,null,null,null,null,null,null,null,null,null,null,null,null,null,{"$f":"IF(A283=\"\",\"\", IF(B283=\"LDV/LDT1\", 0.3,  IF(B283=\"LDT2\", 0.4, IF(OR(B283=\"HLDT/MDPV\",B283=\"HLDT Allowance only\", B283=\"MDPV Allowance only\"), 0.5, IF(B283=\"HDV\", 0.6,   ERROR)))))","v":""},"","","","",""]
[null,null,null,null,null,null,null,null,null,null,null,null,null,null,null,null,null,null,null,null,null,null,{"$f":"IF(A284=\"\",\"\", IF(B284=\"LDV/LDT1\", 0.3,  IF(B284=\"LDT2\", 0.4, IF(OR(B284=\"HLDT/MDPV\",B284=\"HLDT Allowance only\", B284=\"MDPV Allowance only\"), 0.5, IF(B284=\"HDV\", 0.6,   ERROR)))))","v":""},"","","","",""]
[null,null,null,null,null,null,null,null,null,null,null,null,null,null,null,null,null,null,null,null,null,null,{"$f":"IF(A285=\"\",\"\", IF(B285=\"LDV/LDT1\", 0.3,  IF(B285=\"LDT2\", 0.4, IF(OR(B285=\"HLDT/MDPV\",B285=\"HLDT Allowance only\", B285=\"MDPV Allowance only\"), 0.5, IF(B285=\"HDV\", 0.6,   ERROR)))))","v":""},"","","","",""]
[null,null,null,null,null,null,null,null,null,null,null,null,null,null,null,null,null,null,null,null,null,null,{"$f":"IF(A286=\"\",\"\", IF(B286=\"LDV/LDT1\", 0.3,  IF(B286=\"LDT2\", 0.4, IF(OR(B286=\"HLDT/MDPV\",B286=\"HLDT Allowance only\", B286=\"MDPV Allowance only\"), 0.5, IF(B286=\"HDV\", 0.6,   ERROR)))))","v":""},"","","","",""]
[null,null,null,null,null,null,null,null,null,null,null,null,null,null,null,null,null,null,null,null,null,null,{"$f":"IF(A287=\"\",\"\", IF(B287=\"LDV/LDT1\", 0.3,  IF(B287=\"LDT2\", 0.4, IF(OR(B287=\"HLDT/MDPV\",B287=\"HLDT Allowance only\", B287=\"MDPV Allowance only\"), 0.5, IF(B287=\"HDV\", 0.6,   ERROR)))))","v":""},"","","","",""]
[null,null,null,null,null,null,null,null,null,null,null,null,null,null,null,null,null,null,null,null,null,null,{"$f":"IF(A288=\"\",\"\", IF(B288=\"LDV/LDT1\", 0.3,  IF(B288=\"LDT2\", 0.4, IF(OR(B288=\"HLDT/MDPV\",B288=\"HLDT Allowance only\", B288=\"MDPV Allowance only\"), 0.5, IF(B288=\"HDV\", 0.6,   ERROR)))))","v":""},"","","","",""]
[null,null,null,null,null,null,null,null,null,null,null,null,null,null,null,null,null,null,null,null,null,null,{"$f":"IF(A289=\"\",\"\", IF(B289=\"LDV/LDT1\", 0.3,  IF(B289=\"LDT2\", 0.4, IF(OR(B289=\"HLDT/MDPV\",B289=\"HLDT Allowance only\", B289=\"MDPV Allowance only\"), 0.5, IF(B289=\"HDV\", 0.6,   ERROR)))))","v":""},"","","","",""]
[null,null,null,null,null,null,null,null,null,null,null,null,null,null,null,null,null,null,null,null,null,null,{"$f":"IF(A290=\"\",\"\", IF(B290=\"LDV/LDT1\", 0.3,  IF(B290=\"LDT2\", 0.4, IF(OR(B290=\"HLDT/MDPV\",B290=\"HLDT Allowance only\", B290=\"MDPV Allowance only\"), 0.5, IF(B290=\"HDV\", 0.6,   ERROR)))))","v":""},"","","","",""]
[null,null,null,null,null,null,null,null,null,null,null,null,null,null,null,null,null,null,null,null,null,null,{"$f":"IF(A291=\"\",\"\", IF(B291=\"LDV/LDT1\", 0.3,  IF(B291=\"LDT2\", 0.4, IF(OR(B291=\"HLDT/MDPV\",B291=\"HLDT Allowance only\", B291=\"MDPV Allowance only\"), 0.5, IF(B291=\"HDV\", 0.6,   ERROR)))))","v":""},"","","","",""]
[null,null,null,null,null,null,null,null,null,null,null,null,null,null,null,null,null,null,null,null,null,null,{"$f":"IF(A292=\"\",\"\", IF(B292=\"LDV/LDT1\", 0.3,  IF(B292=\"LDT2\", 0.4, IF(OR(B292=\"HLDT/MDPV\",B292=\"HLDT Allowance only\", B292=\"MDPV Allowance only\"), 0.5, IF(B292=\"HDV\", 0.6,   ERROR)))))","v":""},"","","","",""]
[null,null,null,null,null,null,null,null,null,null,null,null,null,null,null,null,null,null,null,null,null,null,{"$f":"IF(A293=\"\",\"\", IF(B293=\"LDV/LDT1\", 0.3,  IF(B293=\"LDT2\", 0.4, IF(OR(B293=\"HLDT/MDPV\",B293=\"HLDT Allowance only\", B293=\"MDPV Allowance only\"), 0.5, IF(B293=\"HDV\", 0.6,   ERROR)))))","v":""},"","","","",""]
[null,null,null,null,null,null,null,null,null,null,null,null,null,null,null,null,null,null,null,null,null,null,{"$f":"IF(A294=\"\",\"\", IF(B294=\"LDV/LDT1\", 0.3,  IF(B294=\"LDT2\", 0.4, IF(OR(B294=\"HLDT/MDPV\",B294=\"HLDT Allowance only\", B294=\"MDPV Allowance only\"), 0.5, IF(B294=\"HDV\", 0.6,   ERROR)))))","v":""},"","","","",""]
[null,null,null,null,null,null,null,null,null,null,null,null,null,null,null,null,null,null,null,null,null,null,{"$f":"IF(A295=\"\",\"\", IF(B295=\"LDV/LDT1\", 0.3,  IF(B295=\"LDT2\", 0.4, IF(OR(B295=\"HLDT/MDPV\",B295=\"HLDT Allowance only\", B295=\"MDPV Allowance only\"), 0.5, IF(B295=\"HDV\", 0.6,   ERROR)))))","v":""},"","","","",""]
[null,null,null,null,null,null,null,null,null,null,null,null,null,null,null,null,null,null,null,null,null,null,{"$f":"IF(A296=\"\",\"\", IF(B296=\"LDV/LDT1\", 0.3,  IF(B296=\"LDT2\", 0.4, IF(OR(B296=\"HLDT/MDPV\",B296=\"HLDT Allowance only\", B296=\"MDPV Allowance only\"), 0.5, IF(B296=\"HDV\", 0.6,   ERROR)))))","v":""},"","","","",""]
[null,null,null,null,null,null,null,null,null,null,null,null,null,null,null,null,null,null,null,null,null,null,{"$f":"IF(A297=\"\",\"\", IF(B297=\"LDV/LDT1\", 0.3,  IF(B297=\"LDT2\", 0.4, IF(OR(B297=\"HLDT/MDPV\",B297=\"HLDT Allowance only\", B297=\"MDPV Allowance only\"), 0.5, IF(B297=\"HDV\", 0.6,   ERROR)))))","v":""},"","","","",""]
[null,null,null,null,null,null,null,null,null,null,null,null,null,null,null,null,null,null,null,null,null,null,{"$f":"IF(A298=\"\",\"\", IF(B298=\"LDV/LDT1\", 0.3,  IF(B298=\"LDT2\", 0.4, IF(OR(B298=\"HLDT/MDPV\",B298=\"HLDT Allowance only\", B298=\"MDPV Allowance only\"), 0.5, IF(B298=\"HDV\", 0.6,   ERROR)))))","v":""},"","","","",""]
[null,null,null,null,null,null,null,null,null,null,null,null,null,null,null,null,null,null,null,null,null,null,{"$f":"IF(A299=\"\",\"\", IF(B299=\"LDV/LDT1\", 0.3,  IF(B299=\"LDT2\", 0.4, IF(OR(B299=\"HLDT/MDPV\",B299=\"HLDT Allowance only\", B299=\"MDPV Allowance only\"), 0.5, IF(B299=\"HDV\", 0.6,   ERROR)))))","v":""},"","","","",""]
[null,null,null,null,null,null,null,null,null,null,null,null,null,null,null,null,null,null,null,null,null,null,{"$f":"IF(A300=\"\",\"\", IF(B300=\"LDV/LDT1\", 0.3,  IF(B300=\"LDT2\", 0.4, IF(OR(B300=\"HLDT/MDPV\",B300=\"HLDT Allowance only\", B300=\"MDPV Allowance only\"), 0.5, IF(B300=\"HDV\", 0.6,   ERROR)))))","v":""},"","","","",""]
[null,null,null,null,null,null,null,null,null,null,null,null,null,null,null,null,null,null,null,null,null,null,{"$f":"IF(A301=\"\",\"\", IF(B301=\"LDV/LDT1\", 0.3,  IF(B301=\"LDT2\", 0.4, IF(OR(B301=\"HLDT/MDPV\",B301=\"HLDT Allowance only\", B301=\"MDPV Allowance only\"), 0.5, IF(B301=\"HDV\", 0.6,   ERROR)))))","v":""},"","","","",""]
[null,null,null,null,null,null,null,null,null,null,null,null,null,null,null,null,null,null,null,null,null,null,{"$f":"IF(A302=\"\",\"\", IF(B302=\"LDV/LDT1\", 0.3,  IF(B302=\"LDT2\", 0.4, IF(OR(B302=\"HLDT/MDPV\",B302=\"HLDT Allowance only\", B302=\"MDPV Allowance only\"), 0.5, IF(B302=\"HDV\", 0.6,   ERROR)))))","v":""},"","","","",""]
[null,null,null,null,null,null,null,null,null,null,null,null,null,null,null,null,null,null,null,null,null,null,{"$f":"IF(A303=\"\",\"\", IF(B303=\"LDV/LDT1\", 0.3,  IF(B303=\"LDT2\", 0.4, IF(OR(B303=\"HLDT/MDPV\",B303=\"HLDT Allowance only\", B303=\"MDPV Allowance only\"), 0.5, IF(B303=\"HDV\", 0.6,   ERROR)))))","v":""},"","","","",""]
[null,null,null,null,null,null,null,null,null,null,null,null,null,null,null,null,null,null,null,null,null,null,{"$f":"IF(A304=\"\",\"\", IF(B304=\"LDV/LDT1\", 0.3,  IF(B304=\"LDT2\", 0.4, IF(OR(B304=\"HLDT/MDPV\",B304=\"HLDT Allowance only\", B304=\"MDPV Allowance only\"), 0.5, IF(B304=\"HDV\", 0.6,   ERROR)))))","v":""},"","","","",""]
[null,null,null,null,null,null,null,null,null,null,null,null,null,null,null,null,null,null,null,null,null,null,{"$f":"IF(A305=\"\",\"\", IF(B305=\"LDV/LDT1\", 0.3,  IF(B305=\"LDT2\", 0.4, IF(OR(B305=\"HLDT/MDPV\",B305=\"HLDT Allowance only\", B305=\"MDPV Allowance only\"), 0.5, IF(B305=\"HDV\", 0.6,   ERROR)))))","v":""},"","","","",""]
[null,null,null,null,null,null,null,null,null,null,null,null,null,null,null,null,null,null,null,null,null,null,{"$f":"IF(A306=\"\",\"\", IF(B306=\"LDV/LDT1\", 0.3,  IF(B306=\"LDT2\", 0.4, IF(OR(B306=\"HLDT/MDPV\",B306=\"HLDT Allowance only\", B306=\"MDPV Allowance only\"), 0.5, IF(B306=\"HDV\", 0.6,   ERROR)))))","v":""},"","","","",""]
[null,null,null,null,null,null,null,null,null,null,null,null,null,null,null,null,null,null,null,null,null,null,{"$f":"IF(A307=\"\",\"\", IF(B307=\"LDV/LDT1\", 0.3,  IF(B307=\"LDT2\", 0.4, IF(OR(B307=\"HLDT/MDPV\",B307=\"HLDT Allowance only\", B307=\"MDPV Allowance only\"), 0.5, IF(B307=\"HDV\", 0.6,   ERROR)))))","v":""},"","","","",""]
[null,null,null,null,null,null,null,null,null,null,null,null,null,null,null,null,null,null,null,null,null,null,{"$f":"IF(A308=\"\",\"\", IF(B308=\"LDV/LDT1\", 0.3,  IF(B308=\"LDT2\", 0.4, IF(OR(B308=\"HLDT/MDPV\",B308=\"HLDT Allowance only\", B308=\"MDPV Allowance only\"), 0.5, IF(B308=\"HDV\", 0.6,   ERROR)))))","v":""},"","","","",""]
[null,null,null,null,null,null,null,null,null,null,null,null,null,null,null,null,null,null,null,null,null,null,{"$f":"IF(A309=\"\",\"\", IF(B309=\"LDV/LDT1\", 0.3,  IF(B309=\"LDT2\", 0.4, IF(OR(B309=\"HLDT/MDPV\",B309=\"HLDT Allowance only\", B309=\"MDPV Allowance only\"), 0.5, IF(B309=\"HDV\", 0.6,   ERROR)))))","v":""},"","","","",""]
[null,null,null,null,null,null,null,null,null,null,null,null,null,null,null,null,null,null,null,null,null,null,{"$f":"IF(A310=\"\",\"\", IF(B310=\"LDV/LDT1\", 0.3,  IF(B310=\"LDT2\", 0.4, IF(OR(B310=\"HLDT/MDPV\",B310=\"HLDT Allowance only\", B310=\"MDPV Allowance only\"), 0.5, IF(B310=\"HDV\", 0.6,   ERROR)))))","v":""},"","","","",""]
[null,null,null,null,null,null,null,null,null,null,null,null,null,null,null,null,null,null,null,null,null,null,{"$f":"IF(A311=\"\",\"\", IF(B311=\"LDV/LDT1\", 0.3,  IF(B311=\"LDT2\", 0.4, IF(OR(B311=\"HLDT/MDPV\",B311=\"HLDT Allowance only\", B311=\"MDPV Allowance only\"), 0.5, IF(B311=\"HDV\", 0.6,   ERROR)))))","v":""},"","","","",""]
[null,null,null,null,null,null,null,null,null,null,null,null,null,null,null,null,null,null,null,null,null,null,{"$f":"IF(A312=\"\",\"\", IF(B312=\"LDV/LDT1\", 0.3,  IF(B312=\"LDT2\", 0.4, IF(OR(B312=\"HLDT/MDPV\",B312=\"HLDT Allowance only\", B312=\"MDPV Allowance only\"), 0.5, IF(B312=\"HDV\", 0.6,   ERROR)))))","v":""},"","","","",""]
[null,null,null,null,null,null,null,null,null,null,null,null,null,null,null,null,null,null,null,null,null,null,{"$f":"IF(A313=\"\",\"\", IF(B313=\"LDV/LDT1\", 0.3,  IF(B313=\"LDT2\", 0.4, IF(OR(B313=\"HLDT/MDPV\",B313=\"HLDT Allowance only\", B313=\"MDPV Allowance only\"), 0.5, IF(B313=\"HDV\", 0.6,   ERROR)))))","v":""},"","","","",""]
[null,null,null,null,null,null,null,null,null,null,null,null,null,null,null,null,null,null,null,null,null,null,{"$f":"IF(A314=\"\",\"\", IF(B314=\"LDV/LDT1\", 0.3,  IF(B314=\"LDT2\", 0.4, IF(OR(B314=\"HLDT/MDPV\",B314=\"HLDT Allowance only\", B314=\"MDPV Allowance only\"), 0.5, IF(B314=\"HDV\", 0.6,   ERROR)))))","v":""},"","","","",""]
[null,null,null,null,null,null,null,null,null,null,null,null,null,null,null,null,null,null,null,null,null,null,{"$f":"IF(A315=\"\",\"\", IF(B315=\"LDV/LDT1\", 0.3,  IF(B315=\"LDT2\", 0.4, IF(OR(B315=\"HLDT/MDPV\",B315=\"HLDT Allowance only\", B315=\"MDPV Allowance only\"), 0.5, IF(B315=\"HDV\", 0.6,   ERROR)))))","v":""},"","","","",""]
[null,null,null,null,null,null,null,null,null,null,null,null,null,null,null,null,null,null,null,null,null,null,{"$f":"IF(A316=\"\",\"\", IF(B316=\"LDV/LDT1\", 0.3,  IF(B316=\"LDT2\", 0.4, IF(OR(B316=\"HLDT/MDPV\",B316=\"HLDT Allowance only\", B316=\"MDPV Allowance only\"), 0.5, IF(B316=\"HDV\", 0.6,   ERROR)))))","v":""},"","","","",""]
[null,null,null,null,null,null,null,null,null,null,null,null,null,null,null,null,null,null,null,null,null,null,{"$f":"IF(A317=\"\",\"\", IF(B317=\"LDV/LDT1\", 0.3,  IF(B317=\"LDT2\", 0.4, IF(OR(B317=\"HLDT/MDPV\",B317=\"HLDT Allowance only\", B317=\"MDPV Allowance only\"), 0.5, IF(B317=\"HDV\", 0.6,   ERROR)))))","v":""},"","","","",""]
[null,null,null,null,null,null,null,null,null,null,null,null,null,null,null,null,null,null,null,null,null,null,{"$f":"IF(A318=\"\",\"\", IF(B318=\"LDV/LDT1\", 0.3,  IF(B318=\"LDT2\", 0.4, IF(OR(B318=\"HLDT/MDPV\",B318=\"HLDT Allowance only\", B318=\"MDPV Allowance only\"), 0.5, IF(B318=\"HDV\", 0.6,   ERROR)))))","v":""},"","","","",""]
[null,null,null,null,null,null,null,null,null,null,null,null,null,null,null,null,null,null,null,null,null,null,{"$f":"IF(A319=\"\",\"\", IF(B319=\"LDV/LDT1\", 0.3,  IF(B319=\"LDT2\", 0.4, IF(OR(B319=\"HLDT/MDPV\",B319=\"HLDT Allowance only\", B319=\"MDPV Allowance only\"), 0.5, IF(B319=\"HDV\", 0.6,   ERROR)))))","v":""},"","","","",""]
[null,null,null,null,null,null,null,null,null,null,null,null,null,null,null,null,null,null,null,null,null,null,{"$f":"IF(A320=\"\",\"\", IF(B320=\"LDV/LDT1\", 0.3,  IF(B320=\"LDT2\", 0.4, IF(OR(B320=\"HLDT/MDPV\",B320=\"HLDT Allowance only\", B320=\"MDPV Allowance only\"), 0.5, IF(B320=\"HDV\", 0.6,   ERROR)))))","v":""},"","","","",""]
[null,null,null,null,null,null,null,null,null,null,null,null,null,null,null,null,null,null,null,null,null,null,{"$f":"IF(A321=\"\",\"\", IF(B321=\"LDV/LDT1\", 0.3,  IF(B321=\"LDT2\", 0.4, IF(OR(B321=\"HLDT/MDPV\",B321=\"HLDT Allowance only\", B321=\"MDPV Allowance only\"), 0.5, IF(B321=\"HDV\", 0.6,   ERROR)))))","v":""},"","","","",""]
[null,null,null,null,null,null,null,null,null,null,null,null,null,null,null,null,null,null,null,null,null,null,{"$f":"IF(A322=\"\",\"\", IF(B322=\"LDV/LDT1\", 0.3,  IF(B322=\"LDT2\", 0.4, IF(OR(B322=\"HLDT/MDPV\",B322=\"HLDT Allowance only\", B322=\"MDPV Allowance only\"), 0.5, IF(B322=\"HDV\", 0.6,   ERROR)))))","v":""},"","","","",""]
[null,null,null,null,null,null,null,null,null,null,null,null,null,null,null,null,null,null,null,null,null,null,{"$f":"IF(A323=\"\",\"\", IF(B323=\"LDV/LDT1\", 0.3,  IF(B323=\"LDT2\", 0.4, IF(OR(B323=\"HLDT/MDPV\",B323=\"HLDT Allowance only\", B323=\"MDPV Allowance only\"), 0.5, IF(B323=\"HDV\", 0.6,   ERROR)))))","v":""},"","","","",""]
[null,null,null,null,null,null,null,null,null,null,null,null,null,null,null,null,null,null,null,null,null,null,{"$f":"IF(A324=\"\",\"\", IF(B324=\"LDV/LDT1\", 0.3,  IF(B324=\"LDT2\", 0.4, IF(OR(B324=\"HLDT/MDPV\",B324=\"HLDT Allowance only\", B324=\"MDPV Allowance only\"), 0.5, IF(B324=\"HDV\", 0.6,   ERROR)))))","v":""},"","","","",""]
[null,null,null,null,null,null,null,null,null,null,null,null,null,null,null,null,null,null,null,null,null,null,{"$f":"IF(A325=\"\",\"\", IF(B325=\"LDV/LDT1\", 0.3,  IF(B325=\"LDT2\", 0.4, IF(OR(B325=\"HLDT/MDPV\",B325=\"HLDT Allowance only\", B325=\"MDPV Allowance only\"), 0.5, IF(B325=\"HDV\", 0.6,   ERROR)))))","v":""},"","","","",""]
[null,null,null,null,null,null,null,null,null,null,null,null,null,null,null,null,null,null,null,null,null,null,{"$f":"IF(A326=\"\",\"\", IF(B326=\"LDV/LDT1\", 0.3,  IF(B326=\"LDT2\", 0.4, IF(OR(B326=\"HLDT/MDPV\",B326=\"HLDT Allowance only\", B326=\"MDPV Allowance only\"), 0.5, IF(B326=\"HDV\", 0.6,   ERROR)))))","v":""},"","","","",""]
[null,null,null,null,null,null,null,null,null,null,null,null,null,null,null,null,null,null,null,null,null,null,{"$f":"IF(A327=\"\",\"\", IF(B327=\"LDV/LDT1\", 0.3,  IF(B327=\"LDT2\", 0.4, IF(OR(B327=\"HLDT/MDPV\",B327=\"HLDT Allowance only\", B327=\"MDPV Allowance only\"), 0.5, IF(B327=\"HDV\", 0.6,   ERROR)))))","v":""},"","","","",""]
[null,null,null,null,null,null,null,null,null,null,null,null,null,null,null,null,null,null,null,null,null,null,{"$f":"IF(A328=\"\",\"\", IF(B328=\"LDV/LDT1\", 0.3,  IF(B328=\"LDT2\", 0.4, IF(OR(B328=\"HLDT/MDPV\",B328=\"HLDT Allowance only\", B328=\"MDPV Allowance only\"), 0.5, IF(B328=\"HDV\", 0.6,   ERROR)))))","v":""},"","","","",""]
[null,null,null,null,null,null,null,null,null,null,null,null,null,null,null,null,null,null,null,null,null,null,{"$f":"IF(A329=\"\",\"\", IF(B329=\"LDV/LDT1\", 0.3,  IF(B329=\"LDT2\", 0.4, IF(OR(B329=\"HLDT/MDPV\",B329=\"HLDT Allowance only\", B329=\"MDPV Allowance only\"), 0.5, IF(B329=\"HDV\", 0.6,   ERROR)))))","v":""},"","","","",""]
[null,null,null,null,null,null,null,null,null,null,null,null,null,null,null,null,null,null,null,null,null,null,{"$f":"IF(A330=\"\",\"\", IF(B330=\"LDV/LDT1\", 0.3,  IF(B330=\"LDT2\", 0.4, IF(OR(B330=\"HLDT/MDPV\",B330=\"HLDT Allowance only\", B330=\"MDPV Allowance only\"), 0.5, IF(B330=\"HDV\", 0.6,   ERROR)))))","v":""},"","","","",""]
[null,null,null,null,null,null,null,null,null,null,null,null,null,null,null,null,null,null,null,null,null,null,{"$f":"IF(A331=\"\",\"\", IF(B331=\"LDV/LDT1\", 0.3,  IF(B331=\"LDT2\", 0.4, IF(OR(B331=\"HLDT/MDPV\",B331=\"HLDT Allowance only\", B331=\"MDPV Allowance only\"), 0.5, IF(B331=\"HDV\", 0.6,   ERROR)))))","v":""},"","","","",""]
[null,null,null,null,null,null,null,null,null,null,null,null,null,null,null,null,null,null,null,null,null,null,{"$f":"IF(A332=\"\",\"\", IF(B332=\"LDV/LDT1\", 0.3,  IF(B332=\"LDT2\", 0.4, IF(OR(B332=\"HLDT/MDPV\",B332=\"HLDT Allowance only\", B332=\"MDPV Allowance only\"), 0.5, IF(B332=\"HDV\", 0.6,   ERROR)))))","v":""},"","","","",""]
[null,null,null,null,null,null,null,null,null,null,null,null,null,null,null,null,null,null,null,null,null,null,{"$f":"IF(A333=\"\",\"\", IF(B333=\"LDV/LDT1\", 0.3,  IF(B333=\"LDT2\", 0.4, IF(OR(B333=\"HLDT/MDPV\",B333=\"HLDT Allowance only\", B333=\"MDPV Allowance only\"), 0.5, IF(B333=\"HDV\", 0.6,   ERROR)))))","v":""},"","","","",""]
[null,null,null,null,null,null,null,null,null,null,null,null,null,null,null,null,null,null,null,null,null,null,{"$f":"IF(A334=\"\",\"\", IF(B334=\"LDV/LDT1\", 0.3,  IF(B334=\"LDT2\", 0.4, IF(OR(B334=\"HLDT/MDPV\",B334=\"HLDT Allowance only\", B334=\"MDPV Allowance only\"), 0.5, IF(B334=\"HDV\", 0.6,   ERROR)))))","v":""},"","","","",""]
[null,null,null,null,null,null,null,null,null,null,null,null,null,null,null,null,null,null,null,null,null,null,{"$f":"IF(A335=\"\",\"\", IF(B335=\"LDV/LDT1\", 0.3,  IF(B335=\"LDT2\", 0.4, IF(OR(B335=\"HLDT/MDPV\",B335=\"HLDT Allowance only\", B335=\"MDPV Allowance only\"), 0.5, IF(B335=\"HDV\", 0.6,   ERROR)))))","v":""},"","","","",""]
[null,null,null,null,null,null,null,null,null,null,null,null,null,null,null,null,null,null,null,null,null,null,{"$f":"IF(A336=\"\",\"\", IF(B336=\"LDV/LDT1\", 0.3,  IF(B336=\"LDT2\", 0.4, IF(OR(B336=\"HLDT/MDPV\",B336=\"HLDT Allowance only\", B336=\"MDPV Allowance only\"), 0.5, IF(B336=\"HDV\", 0.6,   ERROR)))))","v":""},"","","","",""]
[null,null,null,null,null,null,null,null,null,null,null,null,null,null,null,null,null,null,null,null,null,null,{"$f":"IF(A337=\"\",\"\", IF(B337=\"LDV/LDT1\", 0.3,  IF(B337=\"LDT2\", 0.4, IF(OR(B337=\"HLDT/MDPV\",B337=\"HLDT Allowance only\", B337=\"MDPV Allowance only\"), 0.5, IF(B337=\"HDV\", 0.6,   ERROR)))))","v":""},"","","","",""]
[null,null,null,null,null,null,null,null,null,null,null,null,null,null,null,null,null,null,null,null,null,null,{"$f":"IF(A338=\"\",\"\", IF(B338=\"LDV/LDT1\", 0.3,  IF(B338=\"LDT2\", 0.4, IF(OR(B338=\"HLDT/MDPV\",B338=\"HLDT Allowance only\", B338=\"MDPV Allowance only\"), 0.5, IF(B338=\"HDV\", 0.6,   ERROR)))))","v":""},"","","","",""]
[null,null,null,null,null,null,null,null,null,null,null,null,null,null,null,null,null,null,null,null,null,null,{"$f":"IF(A339=\"\",\"\", IF(B339=\"LDV/LDT1\", 0.3,  IF(B339=\"LDT2\", 0.4, IF(OR(B339=\"HLDT/MDPV\",B339=\"HLDT Allowance only\", B339=\"MDPV Allowance only\"), 0.5, IF(B339=\"HDV\", 0.6,   ERROR)))))","v":""},"","","","",""]
[null,null,null,null,null,null,null,null,null,null,null,null,null,null,null,null,null,null,null,null,null,null,{"$f":"IF(A340=\"\",\"\", IF(B340=\"LDV/LDT1\", 0.3,  IF(B340=\"LDT2\", 0.4, IF(OR(B340=\"HLDT/MDPV\",B340=\"HLDT Allowance only\", B340=\"MDPV Allowance only\"), 0.5, IF(B340=\"HDV\", 0.6,   ERROR)))))","v":""},"","","","",""]
[null,null,null,null,null,null,null,null,null,null,null,null,null,null,null,null,null,null,null,null,null,null,{"$f":"IF(A341=\"\",\"\", IF(B341=\"LDV/LDT1\", 0.3,  IF(B341=\"LDT2\", 0.4, IF(OR(B341=\"HLDT/MDPV\",B341=\"HLDT Allowance only\", B341=\"MDPV Allowance only\"), 0.5, IF(B341=\"HDV\", 0.6,   ERROR)))))","v":""},{"$f":"IF(A341=\"\", \"\", IF(J341 = \"Yes\", W341, IF(K341=\"Yes\", W341, IF(AND(A341<>\"\",B341=\"HDV\",E341=\"Statement\"), MAX(C341, W341),C341))))","v":""},{"$f":"IF(A341=\"\",\"\",IF(AND(A341<>\"\",L341=\"Yes\",$C$8>2021),\"ERROR--Can't Use Early Allowances after 2021MY\",\nIF(AND(A341<>\"\",B341=\"HLDT Allowance only\",$C$8=2017),\"Can't Use HLDT Allowance before 2018MY\",IF(AND(A341<>\"\",B341=\"MDPV Allowance only\",$C$8=2017),\"Can't Use MDPV Allowance before 2018MY\",IF(AND(A341<>\"\",B341=\"HLDT/MDPV\",$C$8=2017),\"Can't Use HLDT/MDPV Allowance before 2018MY\",IF(AND(A341<>\"\",B341=\"HDV\",$C$8=2017),\"Can't Use HDV Allowance before 2018MY\",IF(AND(A341<>\"\",L341=\"Yes\",J341<>\"Yes\",K341<>\"Yes\",C341>W341),\"ERROR--Early Allowance evaporative family does not comply with Tier 3 standards and is not a 2015 or 2016 Carryover PZEV or Carryover LEV3 Option 1 (Rig Test) Evap family\",IF(AND(A341<>\"\",L341=\"Yes\",B341=\"HDV\",O341=\"\"),\"FIX 50-St Prod'n--needed for HDV Allowances\",IF(AND(A341<>\"\",B341=\"MDPV Allowance only\",O341=\"\"),\"FIX 50-St Prod'n--needed for MDPV early allowances\",IF(AND(A341<>\"\",L341=\"Yes\",B341=\"LDV/LDT1\",N341=\"\"),\"FIX Fed Prod'n--needed for LDV/LDT1 early allowances\",IF(AND(A341<>\"\",L341=\"Yes\",B341=\"LDT2\",N341=\"\"),\"FIX Fed Prod'n--needed for LDT2 early allowances\",IF(AND(A341<>\"\",L341=\"Yes\",B341=\"HLDT Allowance only\",N341=\"\"),\"FIX Fed Prod'n--needed for HLDT early allowances\",IF(AND(A341<>\"\",L341=\"Yes\",B341=\"HLDT/MDPV\"),\"ERROR in Col B--must use HLDT Allowance only or MDPV Allowance only value from Column B menu and corresponding production values for HLDT Allowances or MDPV Allowances as applicable\",IF(AND(A341<>\"\",B341=\"HDV\",D341=\"\"),\"ERROR--Column B is HDV but HDV Class in Column E is Blank\",IF(AND(A341<>\"\",B341<>\"\",B341<>\"HDV\",D341<>\"\"),\"ERROR--Column B is not HDV but you entered a HDV Class in Column E\",IF(AND(A341<>\"\",B341=\"HDV\",D341=4,E341=\"\"),\"ERROR--Column E indicates HDV Class 4-8 but Certification Basis in Column F is Blank\",IF(AND(A341<>\"\",B341=\"HDV\",D341=5,E341=\"\"),\"ERROR--Column E indicates HDV Class 4-8 but Certification Basis in Column F is Blank\",IF(AND(A341<>\"\",B341=\"HDV\",D341=6,E341=\"\"),\"ERROR--Column E indicates HDV Class 4-8 but Certification Basis in Column F is Blank\",IF(AND(A341<>\"\",B341=\"HDV\",D341=7,E341=\"\"),\"ERROR--Column E indicates HDV Class 4-8 but Certification Basis in Column F is Blank\",IF(AND(A341<>\"\",B341=\"HDV\",D341=8,E341=\"\"),\"ERROR--Column E indicates HDV Class 4-8 but Certification Basis in Column F is Blank\",IF(AND(A341<>\"\",D341=\"2b\",E341=\"Statement\"),\"ERROR in Columns E & F---Can't use Statement for Certification Basis of Class 2b HDVs\",IF(AND(A341<>\"\",D341=3,E341=\"Statement\"),\"ERROR in Columns E & F---Can't use Statement for Certification Basis of Class 3 HDVs\",IF(AND(A341<>\"\",B341<>\"HDV\",E341=\"Statement\"),\"ERROR in Columns B & F---Can only use Statement as the Certification Basis of Class 4 and above HDVs\",IF(AND(A341<>\"\",I341=\"Phase 2\",J341=\"No\"),\"ERROR--Can only use Phase 2 test fuel for 2015-2016 Carryover PZEV Option 1 (Rig Test) Evaporative Families\",IF(AND(A341<>\"\",I341=\"NA\",E341<>\"Statement\"),\"ERROR in Columns F & J---Can only use NA for Test Fuel if Certification is based on a Statement\",IF(AND(A341<>\"\",J341=\"Yes\",I341<>\"Phase 2\"),\"ERROR--Test fuel must be Phase 2 for 2015-2016 Carryover PZEV Option 1 (Rig test) evaporative families\",IF(AND(A341<>\"\",J341=\"Yes\",C341<>0.35,C341<>0.5,C341<>0.75),\"ERROR--FEL must be 0.350, 0.500 or 0.750 for 2015-2016 Carryover PZEV Option 1 (Rig test) evaporative families\",IF(AND(A341<>\"\",J341=\"Yes\",B341<>\"LDV/LDT1\",B341<>\"LDT2\",B341<>\"HLDT/MDPV\"),\"ERROR--Vehicle class must be LDV/LDT1 or LDT2 or HLDT/MDPV for 2015-2016 Carryover PZEV Option 1 (Rig test) evaporative families\",IF(AND(A341<>\"\",$C$8>2019,J341=\"Yes\",L341<>\"Yes\"),\"ERROR--Can't use Carryover data from 2015-2016 PZEV Option 1 (Rig test) using Phase 2 test fuel after 2019MY (or after 2021MY if used as an Early Allowance)\",IF(AND(A341<>\"\",K341=\"Yes\",I341<>\"LEV 3\"),\"ERROR--Test fuel must be LEV 3 for 2015-2016 Carryover LEV3 Option 1 (Rig test) evaporative families\",IF(AND(A341<>\"\",K341=\"Yes\",C341<>0.35,C341<>0.5,C341<>0.75),\"ERROR--FEL must be 0.350, 0.500 or 0.750 for 2015-2016 Carryover LEV3 Option 1 (Rig test) evaporative families\",IF(AND(A341<>\"\",$C$8>2021,K341=\"Yes\"),\"ERROR--Can't use Carryover data from 2015-2016 CARB LEV3 Option 1 (Rig test) using LEV 3 test fuel after 2021MY\",IF(AND(A341<>\"\",B341<>\"LDV/LDT1\",G341=120),\"ERROR--Useful Life must be 150,000 miles for this Tier 3 Evaporative Family\",IF(AND(A341<>\"\",L341=\"Yes\",M341<>2015,M341<>2016,M341<>2017),\"FIX Model Year Early Allowance was earned\",IF(AND(A341<>\"\",L341=\"No\",M341<>\"\",M341<>\"NA\"),\"Error in cols M & N---column M indicates No Allowance but Column N indicates an allowance was earned\",IF(AND(A341<>\"\",L341=\"Yes\",B341<>\"HDV\",B341<>\"HLDT Allowance only\",B341<>\"MDPV Allowance only\",M341=2017),\"ERROR--Early allowances can't be earned in 2017MY for LDV/LDT1 and LDT2 Evaporative Families\",IF(AND(A341<>\"\",$C$8=2017,N341=\"\"),\"FIX Federal Prod'n--needed for 2017MY compliance\",IF(AND(A341<>\"\",$C$8<>2017,L341=\"No\",O341=\"\"),\"FIX 50-St Prod'n\",IF(AND(A341<>\"\",B341=\"HLDT Allowance only\",L341<>\"Yes\"),\"ERROR - Cols B & M--Column B indicates an Allowance is being used but Column M indicates No Allowance\",IF(AND(A341<>\"\",B341=\"MDPV Allowance only\",L341<>\"Yes\"),\"ERROR - Cols B & M--Column B indicates an Allowance is being use but Column M indicates No Allowance\",IF(AND(A341<>\"\",B341=\"HDV\",D341<> \"2b\", L341=\"Yes\",F341 =\"\"),\"FIX Column G 'HDV also meets ORVR Standards'---needed for HDV Class 3 and above Allowances\",IF(AND(A341<>\"\",B341=\"HDV\",D341<> \"2b\", L341=\"Yes\",F341 =\"Yes\"), 2*O341,IF(AND(A341<>\"\",L341=\"Yes\",B341=\"LDV/LDT1\"),N341,IF(AND(A341<>\"\",L341=\"Yes\",B341=\"LDT2\"),N341,IF(AND(A341<>\"\",L341=\"Yes\",B341=\"HLDT Allowance only\"),N341,IF(AND(A341<>\"\",L341=\"No\",$C$8=2017),N341,O341))))))))))))))))))))))))))))))))))))))))))))))","v":""},{"$f":"IF(AND(A341=\"\",N341<>\"\"),\"FIX TEST GROUP\",IF(AND(A341=\"\",O341<>\"\"),\"FIX TEST GROUP\",IF(A341=\"\",\"\", IF(B341=\"\",\"FIX CLASS\",IF(C341=\"\",\"FIX FEL\",IF(G341=\"\",\"FIX U/L Miles\",IF(I341=\"\",\"FIX Test Fuel\",IF(J341=\"\",\"FIX PZEV Carryover\",IF(K341=\"\",\"FIX CARB Opt 1 Carryover\",IF(L341=\"\",\"FIX Allowance Y/N\",IF(M341=\"\",\"FIX Allowance MY\",IF(Y341=\"\",\"FIX PROD'N in Column Q\",Y341*X341))))))))))))","v":""},{"$f":"IF(A341=\"\",\"\",IF(AND(A341<>\"\",B341=\"LDV/LDT1\",C341<=0.5),\"OK\",IF(AND(A341<>\"\",B341=\"LDT2\",C341<=0.65),\"OK\",IF(AND(A341<>\"\",B341=\"HLDT/MDPV\",C341<=0.9),\"OK\",IF(AND(A341<>\"\",B341=\"HLDT/MDPV\",C341>0.9,C341<=1),\"OK if HLDTs < 0.9\",IF(AND(A341<>\"\",B341=\"HDV\",D341=\"2b\",C341<=1.4),\"OK\",IF(AND(A341<>\"\",B341=\"HDV\",D341=3,C341<=1.4),\"OK\",IF(AND(A341<>\"\",B341=\"HDV\",C341<=1.9, D341>=4),\"OK\",IF(AND(A341<>\"\",B341=\"HLDT Allowance only\"),\"OK\",IF(AND(A341<>\"\",B341=\"MDPV Allowance only\"),\"OK\",\"FEL exceeds CAP\"))))))))))","v":""},{"$f":"IF(ISNUMBER(Y341)=TRUE, \"\", Y341)","v":""}]
[null,null,null,null,null,null,null,null,null,null,null,null,null,null,null,null,null,null,null,null,null,null,{"$f":"IF(A342=\"\",\"\", IF(B342=\"LDV/LDT1\", 0.3,  IF(B342=\"LDT2\", 0.4, IF(OR(B342=\"HLDT/MDPV\",B342=\"HLDT Allowance only\", B342=\"MDPV Allowance only\"), 0.5, IF(B342=\"HDV\", 0.6,   ERROR)))))","v":""},"","","","",""]
[null,null,null,null,null,null,null,null,null,null,null,null,null,null,null,null,null,null,null,null,null,null,{"$f":"IF(A343=\"\",\"\", IF(B343=\"LDV/LDT1\", 0.3,  IF(B343=\"LDT2\", 0.4, IF(OR(B343=\"HLDT/MDPV\",B343=\"HLDT Allowance only\", B343=\"MDPV Allowance only\"), 0.5, IF(B343=\"HDV\", 0.6,   ERROR)))))","v":""},"","","","",""]
[null,null,null,null,null,null,null,null,null,null,null,null,null,null,null,null,null,null,null,null,null,null,{"$f":"IF(A344=\"\",\"\", IF(B344=\"LDV/LDT1\", 0.3,  IF(B344=\"LDT2\", 0.4, IF(OR(B344=\"HLDT/MDPV\",B344=\"HLDT Allowance only\", B344=\"MDPV Allowance only\"), 0.5, IF(B344=\"HDV\", 0.6,   ERROR)))))","v":""},"","","","",""]
[null,null,null,null,null,null,null,null,null,null,null,null,null,null,null,null,null,null,null,null,null,null,{"$f":"IF(A345=\"\",\"\", IF(B345=\"LDV/LDT1\", 0.3,  IF(B345=\"LDT2\", 0.4, IF(OR(B345=\"HLDT/MDPV\",B345=\"HLDT Allowance only\", B345=\"MDPV Allowance only\"), 0.5, IF(B345=\"HDV\", 0.6,   ERROR)))))","v":""},"","","","",""]
[null,null,null,null,null,null,null,null,null,null,null,null,null,null,null,null,null,null,null,null,null,null,{"$f":"IF(A346=\"\",\"\", IF(B346=\"LDV/LDT1\", 0.3,  IF(B346=\"LDT2\", 0.4, IF(OR(B346=\"HLDT/MDPV\",B346=\"HLDT Allowance only\", B346=\"MDPV Allowance only\"), 0.5, IF(B346=\"HDV\", 0.6,   ERROR)))))","v":""},"","","","",""]
[null,null,null,null,null,null,null,null,null,null,null,null,null,null,null,null,null,null,null,null,null,null,{"$f":"IF(A347=\"\",\"\", IF(B347=\"LDV/LDT1\", 0.3,  IF(B347=\"LDT2\", 0.4, IF(OR(B347=\"HLDT/MDPV\",B347=\"HLDT Allowance only\", B347=\"MDPV Allowance only\"), 0.5, IF(B347=\"HDV\", 0.6,   ERROR)))))","v":""},"","","","",""]
[null,null,null,null,null,null,null,null,null,null,null,null,null,null,null,null,null,null,null,null,null,null,{"$f":"IF(A348=\"\",\"\", IF(B348=\"LDV/LDT1\", 0.3,  IF(B348=\"LDT2\", 0.4, IF(OR(B348=\"HLDT/MDPV\",B348=\"HLDT Allowance only\", B348=\"MDPV Allowance only\"), 0.5, IF(B348=\"HDV\", 0.6,   ERROR)))))","v":""},"","","","",""]
[null,null,null,null,null,null,null,null,null,null,null,null,null,null,null,null,null,null,null,null,null,null,{"$f":"IF(A349=\"\",\"\", IF(B349=\"LDV/LDT1\", 0.3,  IF(B349=\"LDT2\", 0.4, IF(OR(B349=\"HLDT/MDPV\",B349=\"HLDT Allowance only\", B349=\"MDPV Allowance only\"), 0.5, IF(B349=\"HDV\", 0.6,   ERROR)))))","v":""},"","","","",""]
[null,null,null,null,null,null,null,null,null,null,null,null,null,null,null,null,null,null,null,null,null,null,{"$f":"IF(A350=\"\",\"\", IF(B350=\"LDV/LDT1\", 0.3,  IF(B350=\"LDT2\", 0.4, IF(OR(B350=\"HLDT/MDPV\",B350=\"HLDT Allowance only\", B350=\"MDPV Allowance only\"), 0.5, IF(B350=\"HDV\", 0.6,   ERROR)))))","v":""},"","","","",""]
[null,null,null,null,null,null,null,null,null,null,null,null,null,null,null,null,null,null,null,null,null,null,{"$f":"IF(A351=\"\",\"\", IF(B351=\"LDV/LDT1\", 0.3,  IF(B351=\"LDT2\", 0.4, IF(OR(B351=\"HLDT/MDPV\",B351=\"HLDT Allowance only\", B351=\"MDPV Allowance only\"), 0.5, IF(B351=\"HDV\", 0.6,   ERROR)))))","v":""},"","","","",""]
[null,null,null,null,null,null,null,null,null,null,null,null,null,null,null,null,null,null,null,null,null,null,{"$f":"IF(A352=\"\",\"\", IF(B352=\"LDV/LDT1\", 0.3,  IF(B352=\"LDT2\", 0.4, IF(OR(B352=\"HLDT/MDPV\",B352=\"HLDT Allowance only\", B352=\"MDPV Allowance only\"), 0.5, IF(B352=\"HDV\", 0.6,   ERROR)))))","v":""},"","","","",""]
[null,null,null,null,null,null,null,null,null,null,null,null,null,null,null,null,null,null,null,null,null,null,{"$f":"IF(A353=\"\",\"\", IF(B353=\"LDV/LDT1\", 0.3,  IF(B353=\"LDT2\", 0.4, IF(OR(B353=\"HLDT/MDPV\",B353=\"HLDT Allowance only\", B353=\"MDPV Allowance only\"), 0.5, IF(B353=\"HDV\", 0.6,   ERROR)))))","v":""},"","","","",""]
[null,null,null,null,null,null,null,null,null,null,null,null,null,null,null,null,null,null,null,null,null,null,{"$f":"IF(A354=\"\",\"\", IF(B354=\"LDV/LDT1\", 0.3,  IF(B354=\"LDT2\", 0.4, IF(OR(B354=\"HLDT/MDPV\",B354=\"HLDT Allowance only\", B354=\"MDPV Allowance only\"), 0.5, IF(B354=\"HDV\", 0.6,   ERROR)))))","v":""},"","","","",""]
[null,null,null,null,null,null,null,null,null,null,null,null,null,null,null,null,null,null,null,null,null,null,{"$f":"IF(A355=\"\",\"\", IF(B355=\"LDV/LDT1\", 0.3,  IF(B355=\"LDT2\", 0.4, IF(OR(B355=\"HLDT/MDPV\",B355=\"HLDT Allowance only\", B355=\"MDPV Allowance only\"), 0.5, IF(B355=\"HDV\", 0.6,   ERROR)))))","v":""},"","","","",""]
[null,null,null,null,null,null,null,null,null,null,null,null,null,null,null,null,null,null,null,null,null,null,{"$f":"IF(A356=\"\",\"\", IF(B356=\"LDV/LDT1\", 0.3,  IF(B356=\"LDT2\", 0.4, IF(OR(B356=\"HLDT/MDPV\",B356=\"HLDT Allowance only\", B356=\"MDPV Allowance only\"), 0.5, IF(B356=\"HDV\", 0.6,   ERROR)))))","v":""},"","","","",""]
[null,null,null,null,null,null,null,null,null,null,null,null,null,null,null,null,null,null,null,null,null,null,{"$f":"IF(A357=\"\",\"\", IF(B357=\"LDV/LDT1\", 0.3,  IF(B357=\"LDT2\", 0.4, IF(OR(B357=\"HLDT/MDPV\",B357=\"HLDT Allowance only\", B357=\"MDPV Allowance only\"), 0.5, IF(B357=\"HDV\", 0.6,   ERROR)))))","v":""},"","","","",""]
[null,null,null,null,null,null,null,null,null,null,null,null,null,null,null,null,null,null,null,null,null,null,{"$f":"IF(A358=\"\",\"\", IF(B358=\"LDV/LDT1\", 0.3,  IF(B358=\"LDT2\", 0.4, IF(OR(B358=\"HLDT/MDPV\",B358=\"HLDT Allowance only\", B358=\"MDPV Allowance only\"), 0.5, IF(B358=\"HDV\", 0.6,   ERROR)))))","v":""},"","","","",""]
[null,null,null,null,null,null,null,null,null,null,null,null,null,null,null,null,null,null,null,null,null,null,{"$f":"IF(A359=\"\",\"\", IF(B359=\"LDV/LDT1\", 0.3,  IF(B359=\"LDT2\", 0.4, IF(OR(B359=\"HLDT/MDPV\",B359=\"HLDT Allowance only\", B359=\"MDPV Allowance only\"), 0.5, IF(B359=\"HDV\", 0.6,   ERROR)))))","v":""},"","","","",""]
[null,null,null,null,null,null,null,null,null,null,null,null,null,null,null,null,null,null,null,null,null,null,{"$f":"IF(A360=\"\",\"\", IF(B360=\"LDV/LDT1\", 0.3,  IF(B360=\"LDT2\", 0.4, IF(OR(B360=\"HLDT/MDPV\",B360=\"HLDT Allowance only\", B360=\"MDPV Allowance only\"), 0.5, IF(B360=\"HDV\", 0.6,   ERROR)))))","v":""},"","","","",""]
[null,null,null,null,null,null,null,null,null,null,null,null,null,null,null,null,null,null,null,null,null,null,{"$f":"IF(A361=\"\",\"\", IF(B361=\"LDV/LDT1\", 0.3,  IF(B361=\"LDT2\", 0.4, IF(OR(B361=\"HLDT/MDPV\",B361=\"HLDT Allowance only\", B361=\"MDPV Allowance only\"), 0.5, IF(B361=\"HDV\", 0.6,   ERROR)))))","v":""},"","","","",""]
[null,null,null,null,null,null,null,null,null,null,null,null,null,null,null,null,null,null,null,null,null,null,{"$f":"IF(A362=\"\",\"\", IF(B362=\"LDV/LDT1\", 0.3,  IF(B362=\"LDT2\", 0.4, IF(OR(B362=\"HLDT/MDPV\",B362=\"HLDT Allowance only\", B362=\"MDPV Allowance only\"), 0.5, IF(B362=\"HDV\", 0.6,   ERROR)))))","v":""},"","","","",""]
[null,null,null,null,null,null,null,null,null,null,null,null,null,null,null,null,null,null,null,null,null,null,{"$f":"IF(A363=\"\",\"\", IF(B363=\"LDV/LDT1\", 0.3,  IF(B363=\"LDT2\", 0.4, IF(OR(B363=\"HLDT/MDPV\",B363=\"HLDT Allowance only\", B363=\"MDPV Allowance only\"), 0.5, IF(B363=\"HDV\", 0.6,   ERROR)))))","v":""},"","","","",""]
[null,null,null,null,null,null,null,null,null,null,null,null,null,null,null,null,null,null,null,null,null,null,{"$f":"IF(A364=\"\",\"\", IF(B364=\"LDV/LDT1\", 0.3,  IF(B364=\"LDT2\", 0.4, IF(OR(B364=\"HLDT/MDPV\",B364=\"HLDT Allowance only\", B364=\"MDPV Allowance only\"), 0.5, IF(B364=\"HDV\", 0.6,   ERROR)))))","v":""},"","","","",""]
[null,null,null,null,null,null,null,null,null,null,null,null,null,null,null,null,null,null,null,null,null,null,{"$f":"IF(A365=\"\",\"\", IF(B365=\"LDV/LDT1\", 0.3,  IF(B365=\"LDT2\", 0.4, IF(OR(B365=\"HLDT/MDPV\",B365=\"HLDT Allowance only\", B365=\"MDPV Allowance only\"), 0.5, IF(B365=\"HDV\", 0.6,   ERROR)))))","v":""},"","","","",""]
[null,null,null,null,null,null,null,null,null,null,null,null,null,null,null,null,null,null,null,null,null,null,{"$f":"IF(A366=\"\",\"\", IF(B366=\"LDV/LDT1\", 0.3,  IF(B366=\"LDT2\", 0.4, IF(OR(B366=\"HLDT/MDPV\",B366=\"HLDT Allowance only\", B366=\"MDPV Allowance only\"), 0.5, IF(B366=\"HDV\", 0.6,   ERROR)))))","v":""},"","","","",""]
[null,null,null,null,null,null,null,null,null,null,null,null,null,null,null,null,null,null,null,null,null,null,{"$f":"IF(A367=\"\",\"\", IF(B367=\"LDV/LDT1\", 0.3,  IF(B367=\"LDT2\", 0.4, IF(OR(B367=\"HLDT/MDPV\",B367=\"HLDT Allowance only\", B367=\"MDPV Allowance only\"), 0.5, IF(B367=\"HDV\", 0.6,   ERROR)))))","v":""},"","","","",""]
[null,null,null,null,null,null,null,null,null,null,null,null,null,null,null,null,null,null,null,null,null,null,{"$f":"IF(A368=\"\",\"\", IF(B368=\"LDV/LDT1\", 0.3,  IF(B368=\"LDT2\", 0.4, IF(OR(B368=\"HLDT/MDPV\",B368=\"HLDT Allowance only\", B368=\"MDPV Allowance only\"), 0.5, IF(B368=\"HDV\", 0.6,   ERROR)))))","v":""},"","","","",""]
[null,null,null,null,null,null,null,null,null,null,null,null,null,null,null,null,null,null,null,null,null,null,{"$f":"IF(A369=\"\",\"\", IF(B369=\"LDV/LDT1\", 0.3,  IF(B369=\"LDT2\", 0.4, IF(OR(B369=\"HLDT/MDPV\",B369=\"HLDT Allowance only\", B369=\"MDPV Allowance only\"), 0.5, IF(B369=\"HDV\", 0.6,   ERROR)))))","v":""},"","","","",""]
[null,null,null,null,null,null,null,null,null,null,null,null,null,null,null,null,null,null,null,null,null,null,{"$f":"IF(A370=\"\",\"\", IF(B370=\"LDV/LDT1\", 0.3,  IF(B370=\"LDT2\", 0.4, IF(OR(B370=\"HLDT/MDPV\",B370=\"HLDT Allowance only\", B370=\"MDPV Allowance only\"), 0.5, IF(B370=\"HDV\", 0.6,   ERROR)))))","v":""},"","","","",""]
[null,null,null,null,null,null,null,null,null,null,null,null,null,null,null,null,null,null,null,null,null,null,{"$f":"IF(A371=\"\",\"\", IF(B371=\"LDV/LDT1\", 0.3,  IF(B371=\"LDT2\", 0.4, IF(OR(B371=\"HLDT/MDPV\",B371=\"HLDT Allowance only\", B371=\"MDPV Allowance only\"), 0.5, IF(B371=\"HDV\", 0.6,   ERROR)))))","v":""},"","","","",""]
[null,null,null,null,null,null,null,null,null,null,null,null,null,null,null,null,null,null,null,null,null,null,{"$f":"IF(A372=\"\",\"\", IF(B372=\"LDV/LDT1\", 0.3,  IF(B372=\"LDT2\", 0.4, IF(OR(B372=\"HLDT/MDPV\",B372=\"HLDT Allowance only\", B372=\"MDPV Allowance only\"), 0.5, IF(B372=\"HDV\", 0.6,   ERROR)))))","v":""},"","","","",""]
[null,null,null,null,null,null,null,null,null,null,null,null,null,null,null,null,null,null,null,null,null,null,{"$f":"IF(A373=\"\",\"\", IF(B373=\"LDV/LDT1\", 0.3,  IF(B373=\"LDT2\", 0.4, IF(OR(B373=\"HLDT/MDPV\",B373=\"HLDT Allowance only\", B373=\"MDPV Allowance only\"), 0.5, IF(B373=\"HDV\", 0.6,   ERROR)))))","v":""},"","","","",""]
[null,null,null,null,null,null,null,null,null,null,null,null,null,null,null,null,null,null,null,null,null,null,{"$f":"IF(A374=\"\",\"\", IF(B374=\"LDV/LDT1\", 0.3,  IF(B374=\"LDT2\", 0.4, IF(OR(B374=\"HLDT/MDPV\",B374=\"HLDT Allowance only\", B374=\"MDPV Allowance only\"), 0.5, IF(B374=\"HDV\", 0.6,   ERROR)))))","v":""},"","","","",""]
[null,null,null,null,null,null,null,null,null,null,null,null,null,null,null,null,null,null,null,null,null,null,{"$f":"IF(A375=\"\",\"\", IF(B375=\"LDV/LDT1\", 0.3,  IF(B375=\"LDT2\", 0.4, IF(OR(B375=\"HLDT/MDPV\",B375=\"HLDT Allowance only\", B375=\"MDPV Allowance only\"), 0.5, IF(B375=\"HDV\", 0.6,   ERROR)))))","v":""},"","","","",""]
[null,null,null,null,null,null,null,null,null,null,null,null,null,null,null,null,null,null,null,null,null,null,{"$f":"IF(A376=\"\",\"\", IF(B376=\"LDV/LDT1\", 0.3,  IF(B376=\"LDT2\", 0.4, IF(OR(B376=\"HLDT/MDPV\",B376=\"HLDT Allowance only\", B376=\"MDPV Allowance only\"), 0.5, IF(B376=\"HDV\", 0.6,   ERROR)))))","v":""},"","","","",""]
[null,null,null,null,null,null,null,null,null,null,null,null,null,null,null,null,null,null,null,null,null,null,{"$f":"IF(A377=\"\",\"\", IF(B377=\"LDV/LDT1\", 0.3,  IF(B377=\"LDT2\", 0.4, IF(OR(B377=\"HLDT/MDPV\",B377=\"HLDT Allowance only\", B377=\"MDPV Allowance only\"), 0.5, IF(B377=\"HDV\", 0.6,   ERROR)))))","v":""},"","","","",""]
[null,null,null,null,null,null,null,null,null,null,null,null,null,null,null,null,null,null,null,null,null,null,{"$f":"IF(A378=\"\",\"\", IF(B378=\"LDV/LDT1\", 0.3,  IF(B378=\"LDT2\", 0.4, IF(OR(B378=\"HLDT/MDPV\",B378=\"HLDT Allowance only\", B378=\"MDPV Allowance only\"), 0.5, IF(B378=\"HDV\", 0.6,   ERROR)))))","v":""},"","","","",""]
[null,null,null,null,null,null,null,null,null,null,null,null,null,null,null,null,null,null,null,null,null,null,{"$f":"IF(A379=\"\",\"\", IF(B379=\"LDV/LDT1\", 0.3,  IF(B379=\"LDT2\", 0.4, IF(OR(B379=\"HLDT/MDPV\",B379=\"HLDT Allowance only\", B379=\"MDPV Allowance only\"), 0.5, IF(B379=\"HDV\", 0.6,   ERROR)))))","v":""},"","","","",""]
[null,null,null,null,null,null,null,null,null,null,null,null,null,null,null,null,null,null,null,null,null,null,{"$f":"IF(A380=\"\",\"\", IF(B380=\"LDV/LDT1\", 0.3,  IF(B380=\"LDT2\", 0.4, IF(OR(B380=\"HLDT/MDPV\",B380=\"HLDT Allowance only\", B380=\"MDPV Allowance only\"), 0.5, IF(B380=\"HDV\", 0.6,   ERROR)))))","v":""},"","","","",""]
[null,null,null,null,null,null,null,null,null,null,null,null,null,null,null,null,null,null,null,null,null,null,{"$f":"IF(A381=\"\",\"\", IF(B381=\"LDV/LDT1\", 0.3,  IF(B381=\"LDT2\", 0.4, IF(OR(B381=\"HLDT/MDPV\",B381=\"HLDT Allowance only\", B381=\"MDPV Allowance only\"), 0.5, IF(B381=\"HDV\", 0.6,   ERROR)))))","v":""},"","","","",""]
[null,null,null,null,null,null,null,null,null,null,null,null,null,null,null,null,null,null,null,null,null,null,{"$f":"IF(A382=\"\",\"\", IF(B382=\"LDV/LDT1\", 0.3,  IF(B382=\"LDT2\", 0.4, IF(OR(B382=\"HLDT/MDPV\",B382=\"HLDT Allowance only\", B382=\"MDPV Allowance only\"), 0.5, IF(B382=\"HDV\", 0.6,   ERROR)))))","v":""},"","","","",""]
[null,null,null,null,null,null,null,null,null,null,null,null,null,null,null,null,null,null,null,null,null,null,{"$f":"IF(A383=\"\",\"\", IF(B383=\"LDV/LDT1\", 0.3,  IF(B383=\"LDT2\", 0.4, IF(OR(B383=\"HLDT/MDPV\",B383=\"HLDT Allowance only\", B383=\"MDPV Allowance only\"), 0.5, IF(B383=\"HDV\", 0.6,   ERROR)))))","v":""},"","","","",""]
[null,null,null,null,null,null,null,null,null,null,null,null,null,null,null,null,null,null,null,null,null,null,{"$f":"IF(A384=\"\",\"\", IF(B384=\"LDV/LDT1\", 0.3,  IF(B384=\"LDT2\", 0.4, IF(OR(B384=\"HLDT/MDPV\",B384=\"HLDT Allowance only\", B384=\"MDPV Allowance only\"), 0.5, IF(B384=\"HDV\", 0.6,   ERROR)))))","v":""},"","","","",""]
[null,null,null,null,null,null,null,null,null,null,null,null,null,null,null,null,null,null,null,null,null,null,{"$f":"IF(A385=\"\",\"\", IF(B385=\"LDV/LDT1\", 0.3,  IF(B385=\"LDT2\", 0.4, IF(OR(B385=\"HLDT/MDPV\",B385=\"HLDT Allowance only\", B385=\"MDPV Allowance only\"), 0.5, IF(B385=\"HDV\", 0.6,   ERROR)))))","v":""},"","","","",""]
[null,null,null,null,null,null,null,null,null,null,null,null,null,null,null,null,null,null,null,null,null,null,{"$f":"IF(A386=\"\",\"\", IF(B386=\"LDV/LDT1\", 0.3,  IF(B386=\"LDT2\", 0.4, IF(OR(B386=\"HLDT/MDPV\",B386=\"HLDT Allowance only\", B386=\"MDPV Allowance only\"), 0.5, IF(B386=\"HDV\", 0.6,   ERROR)))))","v":""},"","","","",""]
[null,null,null,null,null,null,null,null,null,null,null,null,null,null,null,null,null,null,null,null,null,null,{"$f":"IF(A387=\"\",\"\", IF(B387=\"LDV/LDT1\", 0.3,  IF(B387=\"LDT2\", 0.4, IF(OR(B387=\"HLDT/MDPV\",B387=\"HLDT Allowance only\", B387=\"MDPV Allowance only\"), 0.5, IF(B387=\"HDV\", 0.6,   ERROR)))))","v":""},"","","","",""]
[null,null,null,null,null,null,null,null,null,null,null,null,null,null,null,null,null,null,null,null,null,null,{"$f":"IF(A388=\"\",\"\", IF(B388=\"LDV/LDT1\", 0.3,  IF(B388=\"LDT2\", 0.4, IF(OR(B388=\"HLDT/MDPV\",B388=\"HLDT Allowance only\", B388=\"MDPV Allowance only\"), 0.5, IF(B388=\"HDV\", 0.6,   ERROR)))))","v":""},"","","","",""]
[null,null,null,null,null,null,null,null,null,null,null,null,null,null,null,null,null,null,null,null,null,null,{"$f":"IF(A389=\"\",\"\", IF(B389=\"LDV/LDT1\", 0.3,  IF(B389=\"LDT2\", 0.4, IF(OR(B389=\"HLDT/MDPV\",B389=\"HLDT Allowance only\", B389=\"MDPV Allowance only\"), 0.5, IF(B389=\"HDV\", 0.6,   ERROR)))))","v":""},"","","","",""]
[null,null,null,null,null,null,null,null,null,null,null,null,null,null,null,null,null,null,null,null,null,null,{"$f":"IF(A390=\"\",\"\", IF(B390=\"LDV/LDT1\", 0.3,  IF(B390=\"LDT2\", 0.4, IF(OR(B390=\"HLDT/MDPV\",B390=\"HLDT Allowance only\", B390=\"MDPV Allowance only\"), 0.5, IF(B390=\"HDV\", 0.6,   ERROR)))))","v":""},"","","","",""]
[null,null,null,null,null,null,null,null,null,null,null,null,null,null,null,null,null,null,null,null,null,null,{"$f":"IF(A391=\"\",\"\", IF(B391=\"LDV/LDT1\", 0.3,  IF(B391=\"LDT2\", 0.4, IF(OR(B391=\"HLDT/MDPV\",B391=\"HLDT Allowance only\", B391=\"MDPV Allowance only\"), 0.5, IF(B391=\"HDV\", 0.6,   ERROR)))))","v":""},"","","","",""]
[null,null,null,null,null,null,null,null,null,null,null,null,null,null,null,null,null,null,null,null,null,null,{"$f":"IF(A392=\"\",\"\", IF(B392=\"LDV/LDT1\", 0.3,  IF(B392=\"LDT2\", 0.4, IF(OR(B392=\"HLDT/MDPV\",B392=\"HLDT Allowance only\", B392=\"MDPV Allowance only\"), 0.5, IF(B392=\"HDV\", 0.6,   ERROR)))))","v":""},"","","","",""]
[null,null,null,null,null,null,null,null,null,null,null,null,null,null,null,null,null,null,null,null,null,null,{"$f":"IF(A393=\"\",\"\", IF(B393=\"LDV/LDT1\", 0.3,  IF(B393=\"LDT2\", 0.4, IF(OR(B393=\"HLDT/MDPV\",B393=\"HLDT Allowance only\", B393=\"MDPV Allowance only\"), 0.5, IF(B393=\"HDV\", 0.6,   ERROR)))))","v":""},"","","","",""]
[null,null,null,null,null,null,null,null,null,null,null,null,null,null,null,null,null,null,null,null,null,null,{"$f":"IF(A394=\"\",\"\", IF(B394=\"LDV/LDT1\", 0.3,  IF(B394=\"LDT2\", 0.4, IF(OR(B394=\"HLDT/MDPV\",B394=\"HLDT Allowance only\", B394=\"MDPV Allowance only\"), 0.5, IF(B394=\"HDV\", 0.6,   ERROR)))))","v":""},"","","","",""]
[null,null,null,null,null,null,null,null,null,null,null,null,null,null,null,null,null,null,null,null,null,null,{"$f":"IF(A395=\"\",\"\", IF(B395=\"LDV/LDT1\", 0.3,  IF(B395=\"LDT2\", 0.4, IF(OR(B395=\"HLDT/MDPV\",B395=\"HLDT Allowance only\", B395=\"MDPV Allowance only\"), 0.5, IF(B395=\"HDV\", 0.6,   ERROR)))))","v":""},"","","","",""]
[null,null,null,null,null,null,null,null,null,null,null,null,null,null,null,null,null,null,null,null,null,null,{"$f":"IF(A396=\"\",\"\", IF(B396=\"LDV/LDT1\", 0.3,  IF(B396=\"LDT2\", 0.4, IF(OR(B396=\"HLDT/MDPV\",B396=\"HLDT Allowance only\", B396=\"MDPV Allowance only\"), 0.5, IF(B396=\"HDV\", 0.6,   ERROR)))))","v":""},"","","","",""]
[null,null,null,null,null,null,null,null,null,null,null,null,null,null,null,null,null,null,null,null,null,null,{"$f":"IF(A397=\"\",\"\", IF(B397=\"LDV/LDT1\", 0.3,  IF(B397=\"LDT2\", 0.4, IF(OR(B397=\"HLDT/MDPV\",B397=\"HLDT Allowance only\", B397=\"MDPV Allowance only\"), 0.5, IF(B397=\"HDV\", 0.6,   ERROR)))))","v":""},"","","","",""]
[null,null,null,null,null,null,null,null,null,null,null,null,null,null,null,null,null,null,null,null,null,null,{"$f":"IF(A398=\"\",\"\", IF(B398=\"LDV/LDT1\", 0.3,  IF(B398=\"LDT2\", 0.4, IF(OR(B398=\"HLDT/MDPV\",B398=\"HLDT Allowance only\", B398=\"MDPV Allowance only\"), 0.5, IF(B398=\"HDV\", 0.6,   ERROR)))))","v":""},"","","","",""]
[null,null,null,null,null,null,null,null,null,null,null,null,null,null,null,null,null,null,null,null,null,null,{"$f":"IF(A399=\"\",\"\", IF(B399=\"LDV/LDT1\", 0.3,  IF(B399=\"LDT2\", 0.4, IF(OR(B399=\"HLDT/MDPV\",B399=\"HLDT Allowance only\", B399=\"MDPV Allowance only\"), 0.5, IF(B399=\"HDV\", 0.6,   ERROR)))))","v":""},"","","","",""]
[null,null,null,null,null,null,null,null,null,null,null,null,null,null,null,null,null,null,null,null,null,null,{"$f":"IF(A400=\"\",\"\", IF(B400=\"LDV/LDT1\", 0.3,  IF(B400=\"LDT2\", 0.4, IF(OR(B400=\"HLDT/MDPV\",B400=\"HLDT Allowance only\", B400=\"MDPV Allowance only\"), 0.5, IF(B400=\"HDV\", 0.6,   ERROR)))))","v":""},"","","","",""]
[null,null,null,null,null,null,null,null,null,null,null,null,null,null,null,null,null,null,null,null,null,null,{"$f":"IF(A401=\"\",\"\", IF(B401=\"LDV/LDT1\", 0.3,  IF(B401=\"LDT2\", 0.4, IF(OR(B401=\"HLDT/MDPV\",B401=\"HLDT Allowance only\", B401=\"MDPV Allowance only\"), 0.5, IF(B401=\"HDV\", 0.6,   ERROR)))))","v":""},"","","","",""]
[null,null,null,null,null,null,null,null,null,null,null,null,null,null,null,null,null,null,null,null,null,null,{"$f":"IF(A402=\"\",\"\", IF(B402=\"LDV/LDT1\", 0.3,  IF(B402=\"LDT2\", 0.4, IF(OR(B402=\"HLDT/MDPV\",B402=\"HLDT Allowance only\", B402=\"MDPV Allowance only\"), 0.5, IF(B402=\"HDV\", 0.6,   ERROR)))))","v":""},"","","","",""]
[null,null,null,null,null,null,null,null,null,null,null,null,null,null,null,null,null,null,null,null,null,null,{"$f":"IF(A403=\"\",\"\", IF(B403=\"LDV/LDT1\", 0.3,  IF(B403=\"LDT2\", 0.4, IF(OR(B403=\"HLDT/MDPV\",B403=\"HLDT Allowance only\", B403=\"MDPV Allowance only\"), 0.5, IF(B403=\"HDV\", 0.6,   ERROR)))))","v":""},"","","","",""]
[null,null,null,null,null,null,null,null,null,null,null,null,null,null,null,null,null,null,null,null,null,null,{"$f":"IF(A404=\"\",\"\", IF(B404=\"LDV/LDT1\", 0.3,  IF(B404=\"LDT2\", 0.4, IF(OR(B404=\"HLDT/MDPV\",B404=\"HLDT Allowance only\", B404=\"MDPV Allowance only\"), 0.5, IF(B404=\"HDV\", 0.6,   ERROR)))))","v":""},"","","","",""]
[null,null,null,null,null,null,null,null,null,null,null,null,null,null,null,null,null,null,null,null,null,null,{"$f":"IF(A405=\"\",\"\", IF(B405=\"LDV/LDT1\", 0.3,  IF(B405=\"LDT2\", 0.4, IF(OR(B405=\"HLDT/MDPV\",B405=\"HLDT Allowance only\", B405=\"MDPV Allowance only\"), 0.5, IF(B405=\"HDV\", 0.6,   ERROR)))))","v":""},{"$f":"IF(A405=\"\", \"\", IF(J405 = \"Yes\", W405, IF(K405=\"Yes\", W405, IF(AND(A405<>\"\",B405=\"HDV\",E405=\"Statement\"), MAX(C405, W405),C405))))","v":""},{"$f":"IF(A405=\"\",\"\",IF(AND(A405<>\"\",L405=\"Yes\",$C$8>2021),\"ERROR--Can't Use Early Allowances after 2021MY\",\nIF(AND(A405<>\"\",B405=\"HLDT Allowance only\",$C$8=2017),\"Can't Use HLDT Allowance before 2018MY\",IF(AND(A405<>\"\",B405=\"MDPV Allowance only\",$C$8=2017),\"Can't Use MDPV Allowance before 2018MY\",IF(AND(A405<>\"\",B405=\"HLDT/MDPV\",$C$8=2017),\"Can't Use HLDT/MDPV Allowance before 2018MY\",IF(AND(A405<>\"\",B405=\"HDV\",$C$8=2017),\"Can't Use HDV Allowance before 2018MY\",IF(AND(A405<>\"\",L405=\"Yes\",J405<>\"Yes\",K405<>\"Yes\",C405>W405),\"ERROR--Early Allowance evaporative family does not comply with Tier 3 standards and is not a 2015 or 2016 Carryover PZEV or Carryover LEV3 Option 1 (Rig Test) Evap family\",IF(AND(A405<>\"\",L405=\"Yes\",B405=\"HDV\",O405=\"\"),\"FIX 50-St Prod'n--needed for HDV Allowances\",IF(AND(A405<>\"\",B405=\"MDPV Allowance only\",O405=\"\"),\"FIX 50-St Prod'n--needed for MDPV early allowances\",IF(AND(A405<>\"\",L405=\"Yes\",B405=\"LDV/LDT1\",N405=\"\"),\"FIX Fed Prod'n--needed for LDV/LDT1 early allowances\",IF(AND(A405<>\"\",L405=\"Yes\",B405=\"LDT2\",N405=\"\"),\"FIX Fed Prod'n--needed for LDT2 early allowances\",IF(AND(A405<>\"\",L405=\"Yes\",B405=\"HLDT Allowance only\",N405=\"\"),\"FIX Fed Prod'n--needed for HLDT early allowances\",IF(AND(A405<>\"\",L405=\"Yes\",B405=\"HLDT/MDPV\"),\"ERROR in Col B--must use HLDT Allowance only or MDPV Allowance only value from Column B menu and corresponding production values for HLDT Allowances or MDPV Allowances as applicable\",IF(AND(A405<>\"\",B405=\"HDV\",D405=\"\"),\"ERROR--Column B is HDV but HDV Class in Column E is Blank\",IF(AND(A405<>\"\",B405<>\"\",B405<>\"HDV\",D405<>\"\"),\"ERROR--Column B is not HDV but you entered a HDV Class in Column E\",IF(AND(A405<>\"\",B405=\"HDV\",D405=4,E405=\"\"),\"ERROR--Column E indicates HDV Class 4-8 but Certification Basis in Column F is Blank\",IF(AND(A405<>\"\",B405=\"HDV\",D405=5,E405=\"\"),\"ERROR--Column E indicates HDV Class 4-8 but Certification Basis in Column F is Blank\",IF(AND(A405<>\"\",B405=\"HDV\",D405=6,E405=\"\"),\"ERROR--Column E indicates HDV Class 4-8 but Certification Basis in Column F is Blank\",IF(AND(A405<>\"\",B405=\"HDV\",D405=7,E405=\"\"),\"ERROR--Column E indicates HDV Class 4-8 but Certification Basis in Column F is Blank\",IF(AND(A405<>\"\",B405=\"HDV\",D405=8,E405=\"\"),\"ERROR--Column E indicates HDV Class 4-8 but Certification Basis in Column F is Blank\",IF(AND(A405<>\"\",D405=\"2b\",E405=\"Statement\"),\"ERROR in Columns E & F---Can't use Statement for Certification Basis of Class 2b HDVs\",IF(AND(A405<>\"\",D405=3,E405=\"Statement\"),\"ERROR in Columns E & F---Can't use Statement for Certification Basis of Class 3 HDVs\",IF(AND(A405<>\"\",B405<>\"HDV\",E405=\"Statement\"),\"ERROR in Columns B & F---Can only use Statement as the Certification Basis of Class 4 and above HDVs\",IF(AND(A405<>\"\",I405=\"Phase 2\",J405=\"No\"),\"ERROR--Can only use Phase 2 test fuel for 2015-2016 Carryover PZEV Option 1 (Rig Test) Evaporative Families\",IF(AND(A405<>\"\",I405=\"NA\",E405<>\"Statement\"),\"ERROR in Columns F & J---Can only use NA for Test Fuel if Certification is based on a Statement\",IF(AND(A405<>\"\",J405=\"Yes\",I405<>\"Phase 2\"),\"ERROR--Test fuel must be Phase 2 for 2015-2016 Carryover PZEV Option 1 (Rig test) evaporative families\",IF(AND(A405<>\"\",J405=\"Yes\",C405<>0.35,C405<>0.5,C405<>0.75),\"ERROR--FEL must be 0.350, 0.500 or 0.750 for 2015-2016 Carryover PZEV Option 1 (Rig test) evaporative families\",IF(AND(A405<>\"\",J405=\"Yes\",B405<>\"LDV/LDT1\",B405<>\"LDT2\",B405<>\"HLDT/MDPV\"),\"ERROR--Vehicle class must be LDV/LDT1 or LDT2 or HLDT/MDPV for 2015-2016 Carryover PZEV Option 1 (Rig test) evaporative families\",IF(AND(A405<>\"\",$C$8>2019,J405=\"Yes\",L405<>\"Yes\"),\"ERROR--Can't use Carryover data from 2015-2016 PZEV Option 1 (Rig test) using Phase 2 test fuel after 2019MY (or after 2021MY if used as an Early Allowance)\",IF(AND(A405<>\"\",K405=\"Yes\",I405<>\"LEV 3\"),\"ERROR--Test fuel must be LEV 3 for 2015-2016 Carryover LEV3 Option 1 (Rig test) evaporative families\",IF(AND(A405<>\"\",K405=\"Yes\",C405<>0.35,C405<>0.5,C405<>0.75),\"ERROR--FEL must be 0.350, 0.500 or 0.750 for 2015-2016 Carryover LEV3 Option 1 (Rig test) evaporative families\",IF(AND(A405<>\"\",$C$8>2021,K405=\"Yes\"),\"ERROR--Can't use Carryover data from 2015-2016 CARB LEV3 Option 1 (Rig test) using LEV 3 test fuel after 2021MY\",IF(AND(A405<>\"\",B405<>\"LDV/LDT1\",G405=120),\"ERROR--Useful Life must be 150,000 miles for this Tier 3 Evaporative Family\",IF(AND(A405<>\"\",L405=\"Yes\",M405<>2015,M405<>2016,M405<>2017),\"FIX Model Year Early Allowance was earned\",IF(AND(A405<>\"\",L405=\"No\",M405<>\"\",M405<>\"NA\"),\"Error in cols M & N---column M indicates No Allowance but Column N indicates an allowance was earned\",IF(AND(A405<>\"\",L405=\"Yes\",B405<>\"HDV\",B405<>\"HLDT Allowance only\",B405<>\"MDPV Allowance only\",M405=2017),\"ERROR--Early allowances can't be earned in 2017MY for LDV/LDT1 and LDT2 Evaporative Families\",IF(AND(A405<>\"\",$C$8=2017,N405=\"\"),\"FIX Federal Prod'n--needed for 2017MY compliance\",IF(AND(A405<>\"\",$C$8<>2017,L405=\"No\",O405=\"\"),\"FIX 50-St Prod'n\",IF(AND(A405<>\"\",B405=\"HLDT Allowance only\",L405<>\"Yes\"),\"ERROR - Cols B & M--Column B indicates an Allowance is being used but Column M indicates No Allowance\",IF(AND(A405<>\"\",B405=\"MDPV Allowance only\",L405<>\"Yes\"),\"ERROR - Cols B & M--Column B indicates an Allowance is being use but Column M indicates No Allowance\",IF(AND(A405<>\"\",B405=\"HDV\",D405<> \"2b\", L405=\"Yes\",F405 =\"\"),\"FIX Column G 'HDV also meets ORVR Standards'---needed for HDV Class 3 and above Allowances\",IF(AND(A405<>\"\",B405=\"HDV\",D405<> \"2b\", L405=\"Yes\",F405 =\"Yes\"), 2*O405,IF(AND(A405<>\"\",L405=\"Yes\",B405=\"LDV/LDT1\"),N405,IF(AND(A405<>\"\",L405=\"Yes\",B405=\"LDT2\"),N405,IF(AND(A405<>\"\",L405=\"Yes\",B405=\"HLDT Allowance only\"),N405,IF(AND(A405<>\"\",L405=\"No\",$C$8=2017),N405,O405))))))))))))))))))))))))))))))))))))))))))))))","v":""},{"$f":"IF(AND(A405=\"\",N405<>\"\"),\"FIX TEST GROUP\",IF(AND(A405=\"\",O405<>\"\"),\"FIX TEST GROUP\",IF(A405=\"\",\"\", IF(B405=\"\",\"FIX CLASS\",IF(C405=\"\",\"FIX FEL\",IF(G405=\"\",\"FIX U/L Miles\",IF(I405=\"\",\"FIX Test Fuel\",IF(J405=\"\",\"FIX PZEV Carryover\",IF(K405=\"\",\"FIX CARB Opt 1 Carryover\",IF(L405=\"\",\"FIX Allowance Y/N\",IF(M405=\"\",\"FIX Allowance MY\",IF(Y405=\"\",\"FIX PROD'N in Column Q\",Y405*X405))))))))))))","v":""},{"$f":"IF(A405=\"\",\"\",IF(AND(A405<>\"\",B405=\"LDV/LDT1\",C405<=0.5),\"OK\",IF(AND(A405<>\"\",B405=\"LDT2\",C405<=0.65),\"OK\",IF(AND(A405<>\"\",B405=\"HLDT/MDPV\",C405<=0.9),\"OK\",IF(AND(A405<>\"\",B405=\"HLDT/MDPV\",C405>0.9,C405<=1),\"OK if HLDTs < 0.9\",IF(AND(A405<>\"\",B405=\"HDV\",D405=\"2b\",C405<=1.4),\"OK\",IF(AND(A405<>\"\",B405=\"HDV\",D405=3,C405<=1.4),\"OK\",IF(AND(A405<>\"\",B405=\"HDV\",C405<=1.9, D405>=4),\"OK\",IF(AND(A405<>\"\",B405=\"HLDT Allowance only\"),\"OK\",IF(AND(A405<>\"\",B405=\"MDPV Allowance only\"),\"OK\",\"FEL exceeds CAP\"))))))))))","v":""},{"$f":"IF(ISNUMBER(Y405)=TRUE, \"\", Y405)","v":""}]
[null,null,null,null,null,null,null,null,null,null,null,null,null,null,null,null,null,null,null,null,null,null,{"$f":"IF(A406=\"\",\"\", IF(B406=\"LDV/LDT1\", 0.3,  IF(B406=\"LDT2\", 0.4, IF(OR(B406=\"HLDT/MDPV\",B406=\"HLDT Allowance only\", B406=\"MDPV Allowance only\"), 0.5, IF(B406=\"HDV\", 0.6,   ERROR)))))","v":""},"","","","",""]
[null,null,null,null,null,null,null,null,null,null,null,null,null,null,null,null,null,null,null,null,null,null,{"$f":"IF(A407=\"\",\"\", IF(B407=\"LDV/LDT1\", 0.3,  IF(B407=\"LDT2\", 0.4, IF(OR(B407=\"HLDT/MDPV\",B407=\"HLDT Allowance only\", B407=\"MDPV Allowance only\"), 0.5, IF(B407=\"HDV\", 0.6,   ERROR)))))","v":""},"","","","",""]
[null,null,null,null,null,null,null,null,null,null,null,null,null,null,null,null,null,null,null,null,null,null,{"$f":"IF(A408=\"\",\"\", IF(B408=\"LDV/LDT1\", 0.3,  IF(B408=\"LDT2\", 0.4, IF(OR(B408=\"HLDT/MDPV\",B408=\"HLDT Allowance only\", B408=\"MDPV Allowance only\"), 0.5, IF(B408=\"HDV\", 0.6,   ERROR)))))","v":""},"","","","",""]
[null,null,null,null,null,null,null,null,null,null,null,null,null,null,null,null,null,null,null,null,null,null,{"$f":"IF(A409=\"\",\"\", IF(B409=\"LDV/LDT1\", 0.3,  IF(B409=\"LDT2\", 0.4, IF(OR(B409=\"HLDT/MDPV\",B409=\"HLDT Allowance only\", B409=\"MDPV Allowance only\"), 0.5, IF(B409=\"HDV\", 0.6,   ERROR)))))","v":""},"","","","",""]
[null,null,null,null,null,null,null,null,null,null,null,null,null,null,null,null,null,null,null,null,null,null,{"$f":"IF(A410=\"\",\"\", IF(B410=\"LDV/LDT1\", 0.3,  IF(B410=\"LDT2\", 0.4, IF(OR(B410=\"HLDT/MDPV\",B410=\"HLDT Allowance only\", B410=\"MDPV Allowance only\"), 0.5, IF(B410=\"HDV\", 0.6,   ERROR)))))","v":""},"","","","",""]
[null,null,null,null,null,null,null,null,null,null,null,null,null,null,null,null,null,null,null,null,null,null,{"$f":"IF(A411=\"\",\"\", IF(B411=\"LDV/LDT1\", 0.3,  IF(B411=\"LDT2\", 0.4, IF(OR(B411=\"HLDT/MDPV\",B411=\"HLDT Allowance only\", B411=\"MDPV Allowance only\"), 0.5, IF(B411=\"HDV\", 0.6,   ERROR)))))","v":""},"","","","",""]
[null,null,null,null,null,null,null,null,null,null,null,null,null,null,null,null,null,null,null,null,null,null,{"$f":"IF(A412=\"\",\"\", IF(B412=\"LDV/LDT1\", 0.3,  IF(B412=\"LDT2\", 0.4, IF(OR(B412=\"HLDT/MDPV\",B412=\"HLDT Allowance only\", B412=\"MDPV Allowance only\"), 0.5, IF(B412=\"HDV\", 0.6,   ERROR)))))","v":""},"","","","",""]
[null,null,null,null,null,null,null,null,null,null,null,null,null,null,null,null,null,null,null,null,null,null,{"$f":"IF(A413=\"\",\"\", IF(B413=\"LDV/LDT1\", 0.3,  IF(B413=\"LDT2\", 0.4, IF(OR(B413=\"HLDT/MDPV\",B413=\"HLDT Allowance only\", B413=\"MDPV Allowance only\"), 0.5, IF(B413=\"HDV\", 0.6,   ERROR)))))","v":""},"","","","",""]
[null,null,null,null,null,null,null,null,null,null,null,null,null,null,null,null,null,null,null,null,null,null,{"$f":"IF(A414=\"\",\"\", IF(B414=\"LDV/LDT1\", 0.3,  IF(B414=\"LDT2\", 0.4, IF(OR(B414=\"HLDT/MDPV\",B414=\"HLDT Allowance only\", B414=\"MDPV Allowance only\"), 0.5, IF(B414=\"HDV\", 0.6,   ERROR)))))","v":""},"","","","",""]
[null,null,null,null,null,null,null,null,null,null,null,null,null,null,null,null,null,null,null,null,null,null,{"$f":"IF(A415=\"\",\"\", IF(B415=\"LDV/LDT1\", 0.3,  IF(B415=\"LDT2\", 0.4, IF(OR(B415=\"HLDT/MDPV\",B415=\"HLDT Allowance only\", B415=\"MDPV Allowance only\"), 0.5, IF(B415=\"HDV\", 0.6,   ERROR)))))","v":""},"","","","",""]
[null,null,null,null,null,null,null,null,null,null,null,null,null,null,null,null,null,null,null,null,null,null,{"$f":"IF(A416=\"\",\"\", IF(B416=\"LDV/LDT1\", 0.3,  IF(B416=\"LDT2\", 0.4, IF(OR(B416=\"HLDT/MDPV\",B416=\"HLDT Allowance only\", B416=\"MDPV Allowance only\"), 0.5, IF(B416=\"HDV\", 0.6,   ERROR)))))","v":""},"","","","",""]
[null,null,null,null,null,null,null,null,null,null,null,null,null,null,null,null,null,null,null,null,null,null,{"$f":"IF(A417=\"\",\"\", IF(B417=\"LDV/LDT1\", 0.3,  IF(B417=\"LDT2\", 0.4, IF(OR(B417=\"HLDT/MDPV\",B417=\"HLDT Allowance only\", B417=\"MDPV Allowance only\"), 0.5, IF(B417=\"HDV\", 0.6,   ERROR)))))","v":""},"","","","",""]
[null,null,null,null,null,null,null,null,null,null,null,null,null,null,null,null,null,null,null,null,null,null,{"$f":"IF(A418=\"\",\"\", IF(B418=\"LDV/LDT1\", 0.3,  IF(B418=\"LDT2\", 0.4, IF(OR(B418=\"HLDT/MDPV\",B418=\"HLDT Allowance only\", B418=\"MDPV Allowance only\"), 0.5, IF(B418=\"HDV\", 0.6,   ERROR)))))","v":""},"","","","",""]
[null,null,null,null,null,null,null,null,null,null,null,null,null,null,null,null,null,null,null,null,null,null,{"$f":"IF(A419=\"\",\"\", IF(B419=\"LDV/LDT1\", 0.3,  IF(B419=\"LDT2\", 0.4, IF(OR(B419=\"HLDT/MDPV\",B419=\"HLDT Allowance only\", B419=\"MDPV Allowance only\"), 0.5, IF(B419=\"HDV\", 0.6,   ERROR)))))","v":""},"","","","",""]
[null,null,null,null,null,null,null,null,null,null,null,null,null,null,null,null,null,null,null,null,null,null,{"$f":"IF(A420=\"\",\"\", IF(B420=\"LDV/LDT1\", 0.3,  IF(B420=\"LDT2\", 0.4, IF(OR(B420=\"HLDT/MDPV\",B420=\"HLDT Allowance only\", B420=\"MDPV Allowance only\"), 0.5, IF(B420=\"HDV\", 0.6,   ERROR)))))","v":""},"","","","",""]
[null,null,null,null,null,null,null,null,null,null,null,null,null,null,null,null,null,null,null,null,null,null,{"$f":"IF(A421=\"\",\"\", IF(B421=\"LDV/LDT1\", 0.3,  IF(B421=\"LDT2\", 0.4, IF(OR(B421=\"HLDT/MDPV\",B421=\"HLDT Allowance only\", B421=\"MDPV Allowance only\"), 0.5, IF(B421=\"HDV\", 0.6,   ERROR)))))","v":""},"","","","",""]
[null,null,null,null,null,null,null,null,null,null,null,null,null,null,null,null,null,null,null,null,null,null,{"$f":"IF(A422=\"\",\"\", IF(B422=\"LDV/LDT1\", 0.3,  IF(B422=\"LDT2\", 0.4, IF(OR(B422=\"HLDT/MDPV\",B422=\"HLDT Allowance only\", B422=\"MDPV Allowance only\"), 0.5, IF(B422=\"HDV\", 0.6,   ERROR)))))","v":""},"","","","",""]
[null,null,null,null,null,null,null,null,null,null,null,null,null,null,null,null,null,null,null,null,null,null,{"$f":"IF(A423=\"\",\"\", IF(B423=\"LDV/LDT1\", 0.3,  IF(B423=\"LDT2\", 0.4, IF(OR(B423=\"HLDT/MDPV\",B423=\"HLDT Allowance only\", B423=\"MDPV Allowance only\"), 0.5, IF(B423=\"HDV\", 0.6,   ERROR)))))","v":""},"","","","",""]
[null,null,null,null,null,null,null,null,null,null,null,null,null,null,null,null,null,null,null,null,null,null,{"$f":"IF(A424=\"\",\"\", IF(B424=\"LDV/LDT1\", 0.3,  IF(B424=\"LDT2\", 0.4, IF(OR(B424=\"HLDT/MDPV\",B424=\"HLDT Allowance only\", B424=\"MDPV Allowance only\"), 0.5, IF(B424=\"HDV\", 0.6,   ERROR)))))","v":""},"","","","",""]
[null,null,null,null,null,null,null,null,null,null,null,null,null,null,null,null,null,null,null,null,null,null,{"$f":"IF(A425=\"\",\"\", IF(B425=\"LDV/LDT1\", 0.3,  IF(B425=\"LDT2\", 0.4, IF(OR(B425=\"HLDT/MDPV\",B425=\"HLDT Allowance only\", B425=\"MDPV Allowance only\"), 0.5, IF(B425=\"HDV\", 0.6,   ERROR)))))","v":""},"","","","",""]
[null,null,null,null,null,null,null,null,null,null,null,null,null,null,null,null,null,null,null,null,null,null,{"$f":"IF(A426=\"\",\"\", IF(B426=\"LDV/LDT1\", 0.3,  IF(B426=\"LDT2\", 0.4, IF(OR(B426=\"HLDT/MDPV\",B426=\"HLDT Allowance only\", B426=\"MDPV Allowance only\"), 0.5, IF(B426=\"HDV\", 0.6,   ERROR)))))","v":""},"","","","",""]
[null,null,null,null,null,null,null,null,null,null,null,null,null,null,null,null,null,null,null,null,null,null,{"$f":"IF(A427=\"\",\"\", IF(B427=\"LDV/LDT1\", 0.3,  IF(B427=\"LDT2\", 0.4, IF(OR(B427=\"HLDT/MDPV\",B427=\"HLDT Allowance only\", B427=\"MDPV Allowance only\"), 0.5, IF(B427=\"HDV\", 0.6,   ERROR)))))","v":""},"","","","",""]
[null,null,null,null,null,null,null,null,null,null,null,null,null,null,null,null,null,null,null,null,null,null,{"$f":"IF(A428=\"\",\"\", IF(B428=\"LDV/LDT1\", 0.3,  IF(B428=\"LDT2\", 0.4, IF(OR(B428=\"HLDT/MDPV\",B428=\"HLDT Allowance only\", B428=\"MDPV Allowance only\"), 0.5, IF(B428=\"HDV\", 0.6,   ERROR)))))","v":""},"","","","",""]
[null,null,null,null,null,null,null,null,null,null,null,null,null,null,null,null,null,null,null,null,null,null,{"$f":"IF(A429=\"\",\"\", IF(B429=\"LDV/LDT1\", 0.3,  IF(B429=\"LDT2\", 0.4, IF(OR(B429=\"HLDT/MDPV\",B429=\"HLDT Allowance only\", B429=\"MDPV Allowance only\"), 0.5, IF(B429=\"HDV\", 0.6,   ERROR)))))","v":""},"","","","",""]
[null,null,null,null,null,null,null,null,null,null,null,null,null,null,null,null,null,null,null,null,null,null,{"$f":"IF(A430=\"\",\"\", IF(B430=\"LDV/LDT1\", 0.3,  IF(B430=\"LDT2\", 0.4, IF(OR(B430=\"HLDT/MDPV\",B430=\"HLDT Allowance only\", B430=\"MDPV Allowance only\"), 0.5, IF(B430=\"HDV\", 0.6,   ERROR)))))","v":""},"","","","",""]
[null,null,null,null,null,null,null,null,null,null,null,null,null,null,null,null,null,null,null,null,null,null,{"$f":"IF(A431=\"\",\"\", IF(B431=\"LDV/LDT1\", 0.3,  IF(B431=\"LDT2\", 0.4, IF(OR(B431=\"HLDT/MDPV\",B431=\"HLDT Allowance only\", B431=\"MDPV Allowance only\"), 0.5, IF(B431=\"HDV\", 0.6,   ERROR)))))","v":""},"","","","",""]
[null,null,null,null,null,null,null,null,null,null,null,null,null,null,null,null,null,null,null,null,null,null,{"$f":"IF(A432=\"\",\"\", IF(B432=\"LDV/LDT1\", 0.3,  IF(B432=\"LDT2\", 0.4, IF(OR(B432=\"HLDT/MDPV\",B432=\"HLDT Allowance only\", B432=\"MDPV Allowance only\"), 0.5, IF(B432=\"HDV\", 0.6,   ERROR)))))","v":""},"","","","",""]
[null,null,null,null,null,null,null,null,null,null,null,null,null,null,null,null,null,null,null,null,null,null,{"$f":"IF(A433=\"\",\"\", IF(B433=\"LDV/LDT1\", 0.3,  IF(B433=\"LDT2\", 0.4, IF(OR(B433=\"HLDT/MDPV\",B433=\"HLDT Allowance only\", B433=\"MDPV Allowance only\"), 0.5, IF(B433=\"HDV\", 0.6,   ERROR)))))","v":""},"","","","",""]
[null,null,null,null,null,null,null,null,null,null,null,null,null,null,null,null,null,null,null,null,null,null,{"$f":"IF(A434=\"\",\"\", IF(B434=\"LDV/LDT1\", 0.3,  IF(B434=\"LDT2\", 0.4, IF(OR(B434=\"HLDT/MDPV\",B434=\"HLDT Allowance only\", B434=\"MDPV Allowance only\"), 0.5, IF(B434=\"HDV\", 0.6,   ERROR)))))","v":""},"","","","",""]
[null,null,null,null,null,null,null,null,null,null,null,null,null,null,null,null,null,null,null,null,null,null,{"$f":"IF(A435=\"\",\"\", IF(B435=\"LDV/LDT1\", 0.3,  IF(B435=\"LDT2\", 0.4, IF(OR(B435=\"HLDT/MDPV\",B435=\"HLDT Allowance only\", B435=\"MDPV Allowance only\"), 0.5, IF(B435=\"HDV\", 0.6,   ERROR)))))","v":""},"","","","",""]
[null,null,null,null,null,null,null,null,null,null,null,null,null,null,null,null,null,null,null,null,null,null,{"$f":"IF(A436=\"\",\"\", IF(B436=\"LDV/LDT1\", 0.3,  IF(B436=\"LDT2\", 0.4, IF(OR(B436=\"HLDT/MDPV\",B436=\"HLDT Allowance only\", B436=\"MDPV Allowance only\"), 0.5, IF(B436=\"HDV\", 0.6,   ERROR)))))","v":""},"","","","",""]
[null,null,null,null,null,null,null,null,null,null,null,null,null,null,null,null,null,null,null,null,null,null,{"$f":"IF(A437=\"\",\"\", IF(B437=\"LDV/LDT1\", 0.3,  IF(B437=\"LDT2\", 0.4, IF(OR(B437=\"HLDT/MDPV\",B437=\"HLDT Allowance only\", B437=\"MDPV Allowance only\"), 0.5, IF(B437=\"HDV\", 0.6,   ERROR)))))","v":""},"","","","",""]
[null,null,null,null,null,null,null,null,null,null,null,null,null,null,null,null,null,null,null,null,null,null,{"$f":"IF(A438=\"\",\"\", IF(B438=\"LDV/LDT1\", 0.3,  IF(B438=\"LDT2\", 0.4, IF(OR(B438=\"HLDT/MDPV\",B438=\"HLDT Allowance only\", B438=\"MDPV Allowance only\"), 0.5, IF(B438=\"HDV\", 0.6,   ERROR)))))","v":""},"","","","",""]
[null,null,null,null,null,null,null,null,null,null,null,null,null,null,null,null,null,null,null,null,null,null,{"$f":"IF(A439=\"\",\"\", IF(B439=\"LDV/LDT1\", 0.3,  IF(B439=\"LDT2\", 0.4, IF(OR(B439=\"HLDT/MDPV\",B439=\"HLDT Allowance only\", B439=\"MDPV Allowance only\"), 0.5, IF(B439=\"HDV\", 0.6,   ERROR)))))","v":""},"","","","",""]
[null,null,null,null,null,null,null,null,null,null,null,null,null,null,null,null,null,null,null,null,null,null,{"$f":"IF(A440=\"\",\"\", IF(B440=\"LDV/LDT1\", 0.3,  IF(B440=\"LDT2\", 0.4, IF(OR(B440=\"HLDT/MDPV\",B440=\"HLDT Allowance only\", B440=\"MDPV Allowance only\"), 0.5, IF(B440=\"HDV\", 0.6,   ERROR)))))","v":""},"","","","",""]
[null,null,null,null,null,null,null,null,null,null,null,null,null,null,null,null,null,null,null,null,null,null,{"$f":"IF(A441=\"\",\"\", IF(B441=\"LDV/LDT1\", 0.3,  IF(B441=\"LDT2\", 0.4, IF(OR(B441=\"HLDT/MDPV\",B441=\"HLDT Allowance only\", B441=\"MDPV Allowance only\"), 0.5, IF(B441=\"HDV\", 0.6,   ERROR)))))","v":""},"","","","",""]
[null,null,null,null,null,null,null,null,null,null,null,null,null,null,null,null,null,null,null,null,null,null,{"$f":"IF(A442=\"\",\"\", IF(B442=\"LDV/LDT1\", 0.3,  IF(B442=\"LDT2\", 0.4, IF(OR(B442=\"HLDT/MDPV\",B442=\"HLDT Allowance only\", B442=\"MDPV Allowance only\"), 0.5, IF(B442=\"HDV\", 0.6,   ERROR)))))","v":""},"","","","",""]
[null,null,null,null,null,null,null,null,null,null,null,null,null,null,null,null,null,null,null,null,null,null,{"$f":"IF(A443=\"\",\"\", IF(B443=\"LDV/LDT1\", 0.3,  IF(B443=\"LDT2\", 0.4, IF(OR(B443=\"HLDT/MDPV\",B443=\"HLDT Allowance only\", B443=\"MDPV Allowance only\"), 0.5, IF(B443=\"HDV\", 0.6,   ERROR)))))","v":""},"","","","",""]
[null,null,null,null,null,null,null,null,null,null,null,null,null,null,null,null,null,null,null,null,null,null,{"$f":"IF(A444=\"\",\"\", IF(B444=\"LDV/LDT1\", 0.3,  IF(B444=\"LDT2\", 0.4, IF(OR(B444=\"HLDT/MDPV\",B444=\"HLDT Allowance only\", B444=\"MDPV Allowance only\"), 0.5, IF(B444=\"HDV\", 0.6,   ERROR)))))","v":""},"","","","",""]
[null,null,null,null,null,null,null,null,null,null,null,null,null,null,null,null,null,null,null,null,null,null,{"$f":"IF(A445=\"\",\"\", IF(B445=\"LDV/LDT1\", 0.3,  IF(B445=\"LDT2\", 0.4, IF(OR(B445=\"HLDT/MDPV\",B445=\"HLDT Allowance only\", B445=\"MDPV Allowance only\"), 0.5, IF(B445=\"HDV\", 0.6,   ERROR)))))","v":""},"","","","",""]
[null,null,null,null,null,null,null,null,null,null,null,null,null,null,null,null,null,null,null,null,null,null,{"$f":"IF(A446=\"\",\"\", IF(B446=\"LDV/LDT1\", 0.3,  IF(B446=\"LDT2\", 0.4, IF(OR(B446=\"HLDT/MDPV\",B446=\"HLDT Allowance only\", B446=\"MDPV Allowance only\"), 0.5, IF(B446=\"HDV\", 0.6,   ERROR)))))","v":""},"","","","",""]
[null,null,null,null,null,null,null,null,null,null,null,null,null,null,null,null,null,null,null,null,null,null,{"$f":"IF(A447=\"\",\"\", IF(B447=\"LDV/LDT1\", 0.3,  IF(B447=\"LDT2\", 0.4, IF(OR(B447=\"HLDT/MDPV\",B447=\"HLDT Allowance only\", B447=\"MDPV Allowance only\"), 0.5, IF(B447=\"HDV\", 0.6,   ERROR)))))","v":""},"","","","",""]
[null,null,null,null,null,null,null,null,null,null,null,null,null,null,null,null,null,null,null,null,null,null,{"$f":"IF(A448=\"\",\"\", IF(B448=\"LDV/LDT1\", 0.3,  IF(B448=\"LDT2\", 0.4, IF(OR(B448=\"HLDT/MDPV\",B448=\"HLDT Allowance only\", B448=\"MDPV Allowance only\"), 0.5, IF(B448=\"HDV\", 0.6,   ERROR)))))","v":""},"","","","",""]
[null,null,null,null,null,null,null,null,null,null,null,null,null,null,null,null,null,null,null,null,null,null,{"$f":"IF(A449=\"\",\"\", IF(B449=\"LDV/LDT1\", 0.3,  IF(B449=\"LDT2\", 0.4, IF(OR(B449=\"HLDT/MDPV\",B449=\"HLDT Allowance only\", B449=\"MDPV Allowance only\"), 0.5, IF(B449=\"HDV\", 0.6,   ERROR)))))","v":""},"","","","",""]
[null,null,null,null,null,null,null,null,null,null,null,null,null,null,null,null,null,null,null,null,null,null,{"$f":"IF(A450=\"\",\"\", IF(B450=\"LDV/LDT1\", 0.3,  IF(B450=\"LDT2\", 0.4, IF(OR(B450=\"HLDT/MDPV\",B450=\"HLDT Allowance only\", B450=\"MDPV Allowance only\"), 0.5, IF(B450=\"HDV\", 0.6,   ERROR)))))","v":""},"","","","",""]
[null,null,null,null,null,null,null,null,null,null,null,null,null,null,null,null,null,null,null,null,null,null,{"$f":"IF(A451=\"\",\"\", IF(B451=\"LDV/LDT1\", 0.3,  IF(B451=\"LDT2\", 0.4, IF(OR(B451=\"HLDT/MDPV\",B451=\"HLDT Allowance only\", B451=\"MDPV Allowance only\"), 0.5, IF(B451=\"HDV\", 0.6,   ERROR)))))","v":""},"","","","",""]
[null,null,null,null,null,null,null,null,null,null,null,null,null,null,null,null,null,null,null,null,null,null,{"$f":"IF(A452=\"\",\"\", IF(B452=\"LDV/LDT1\", 0.3,  IF(B452=\"LDT2\", 0.4, IF(OR(B452=\"HLDT/MDPV\",B452=\"HLDT Allowance only\", B452=\"MDPV Allowance only\"), 0.5, IF(B452=\"HDV\", 0.6,   ERROR)))))","v":""},"","","","",""]
[null,null,null,null,null,null,null,null,null,null,null,null,null,null,null,null,null,null,null,null,null,null,{"$f":"IF(A453=\"\",\"\", IF(B453=\"LDV/LDT1\", 0.3,  IF(B453=\"LDT2\", 0.4, IF(OR(B453=\"HLDT/MDPV\",B453=\"HLDT Allowance only\", B453=\"MDPV Allowance only\"), 0.5, IF(B453=\"HDV\", 0.6,   ERROR)))))","v":""},"","","","",""]
[null,null,null,null,null,null,null,null,null,null,null,null,null,null,null,null,null,null,null,null,null,null,{"$f":"IF(A454=\"\",\"\", IF(B454=\"LDV/LDT1\", 0.3,  IF(B454=\"LDT2\", 0.4, IF(OR(B454=\"HLDT/MDPV\",B454=\"HLDT Allowance only\", B454=\"MDPV Allowance only\"), 0.5, IF(B454=\"HDV\", 0.6,   ERROR)))))","v":""},"","","","",""]
[null,null,null,null,null,null,null,null,null,null,null,null,null,null,null,null,null,null,null,null,null,null,{"$f":"IF(A455=\"\",\"\", IF(B455=\"LDV/LDT1\", 0.3,  IF(B455=\"LDT2\", 0.4, IF(OR(B455=\"HLDT/MDPV\",B455=\"HLDT Allowance only\", B455=\"MDPV Allowance only\"), 0.5, IF(B455=\"HDV\", 0.6,   ERROR)))))","v":""},"","","","",""]
[null,null,null,null,null,null,null,null,null,null,null,null,null,null,null,null,null,null,null,null,null,null,{"$f":"IF(A456=\"\",\"\", IF(B456=\"LDV/LDT1\", 0.3,  IF(B456=\"LDT2\", 0.4, IF(OR(B456=\"HLDT/MDPV\",B456=\"HLDT Allowance only\", B456=\"MDPV Allowance only\"), 0.5, IF(B456=\"HDV\", 0.6,   ERROR)))))","v":""},"","","","",""]
[null,null,null,null,null,null,null,null,null,null,null,null,null,null,null,null,null,null,null,null,null,null,{"$f":"IF(A457=\"\",\"\", IF(B457=\"LDV/LDT1\", 0.3,  IF(B457=\"LDT2\", 0.4, IF(OR(B457=\"HLDT/MDPV\",B457=\"HLDT Allowance only\", B457=\"MDPV Allowance only\"), 0.5, IF(B457=\"HDV\", 0.6,   ERROR)))))","v":""},"","","","",""]
[null,null,null,null,null,null,null,null,null,null,null,null,null,null,null,null,null,null,null,null,null,null,{"$f":"IF(A458=\"\",\"\", IF(B458=\"LDV/LDT1\", 0.3,  IF(B458=\"LDT2\", 0.4, IF(OR(B458=\"HLDT/MDPV\",B458=\"HLDT Allowance only\", B458=\"MDPV Allowance only\"), 0.5, IF(B458=\"HDV\", 0.6,   ERROR)))))","v":""},"","","","",""]
[null,null,null,null,null,null,null,null,null,null,null,null,null,null,null,null,null,null,null,null,null,null,{"$f":"IF(A459=\"\",\"\", IF(B459=\"LDV/LDT1\", 0.3,  IF(B459=\"LDT2\", 0.4, IF(OR(B459=\"HLDT/MDPV\",B459=\"HLDT Allowance only\", B459=\"MDPV Allowance only\"), 0.5, IF(B459=\"HDV\", 0.6,   ERROR)))))","v":""},"","","","",""]
[null,null,null,null,null,null,null,null,null,null,null,null,null,null,null,null,null,null,null,null,null,null,{"$f":"IF(A460=\"\",\"\", IF(B460=\"LDV/LDT1\", 0.3,  IF(B460=\"LDT2\", 0.4, IF(OR(B460=\"HLDT/MDPV\",B460=\"HLDT Allowance only\", B460=\"MDPV Allowance only\"), 0.5, IF(B460=\"HDV\", 0.6,   ERROR)))))","v":""},"","","","",""]
[null,null,null,null,null,null,null,null,null,null,null,null,null,null,null,null,null,null,null,null,null,null,{"$f":"IF(A461=\"\",\"\", IF(B461=\"LDV/LDT1\", 0.3,  IF(B461=\"LDT2\", 0.4, IF(OR(B461=\"HLDT/MDPV\",B461=\"HLDT Allowance only\", B461=\"MDPV Allowance only\"), 0.5, IF(B461=\"HDV\", 0.6,   ERROR)))))","v":""},"","","","",""]
[null,null,null,null,null,null,null,null,null,null,null,null,null,null,null,null,null,null,null,null,null,null,{"$f":"IF(A462=\"\",\"\", IF(B462=\"LDV/LDT1\", 0.3,  IF(B462=\"LDT2\", 0.4, IF(OR(B462=\"HLDT/MDPV\",B462=\"HLDT Allowance only\", B462=\"MDPV Allowance only\"), 0.5, IF(B462=\"HDV\", 0.6,   ERROR)))))","v":""},"","","","",""]
[null,null,null,null,null,null,null,null,null,null,null,null,null,null,null,null,null,null,null,null,null,null,{"$f":"IF(A463=\"\",\"\", IF(B463=\"LDV/LDT1\", 0.3,  IF(B463=\"LDT2\", 0.4, IF(OR(B463=\"HLDT/MDPV\",B463=\"HLDT Allowance only\", B463=\"MDPV Allowance only\"), 0.5, IF(B463=\"HDV\", 0.6,   ERROR)))))","v":""},"","","","",""]
[null,null,null,null,null,null,null,null,null,null,null,null,null,null,null,null,null,null,null,null,null,null,{"$f":"IF(A464=\"\",\"\", IF(B464=\"LDV/LDT1\", 0.3,  IF(B464=\"LDT2\", 0.4, IF(OR(B464=\"HLDT/MDPV\",B464=\"HLDT Allowance only\", B464=\"MDPV Allowance only\"), 0.5, IF(B464=\"HDV\", 0.6,   ERROR)))))","v":""},"","","","",""]
[null,null,null,null,null,null,null,null,null,null,null,null,null,null,null,null,null,null,null,null,null,null,{"$f":"IF(A465=\"\",\"\", IF(B465=\"LDV/LDT1\", 0.3,  IF(B465=\"LDT2\", 0.4, IF(OR(B465=\"HLDT/MDPV\",B465=\"HLDT Allowance only\", B465=\"MDPV Allowance only\"), 0.5, IF(B465=\"HDV\", 0.6,   ERROR)))))","v":""},"","","","",""]
[null,null,null,null,null,null,null,null,null,null,null,null,null,null,null,null,null,null,null,null,null,null,{"$f":"IF(A466=\"\",\"\", IF(B466=\"LDV/LDT1\", 0.3,  IF(B466=\"LDT2\", 0.4, IF(OR(B466=\"HLDT/MDPV\",B466=\"HLDT Allowance only\", B466=\"MDPV Allowance only\"), 0.5, IF(B466=\"HDV\", 0.6,   ERROR)))))","v":""},"","","","",""]
[null,null,null,null,null,null,null,null,null,null,null,null,null,null,null,null,null,null,null,null,null,null,{"$f":"IF(A467=\"\",\"\", IF(B467=\"LDV/LDT1\", 0.3,  IF(B467=\"LDT2\", 0.4, IF(OR(B467=\"HLDT/MDPV\",B467=\"HLDT Allowance only\", B467=\"MDPV Allowance only\"), 0.5, IF(B467=\"HDV\", 0.6,   ERROR)))))","v":""},"","","","",""]
[null,null,null,null,null,null,null,null,null,null,null,null,null,null,null,null,null,null,null,null,null,null,{"$f":"IF(A468=\"\",\"\", IF(B468=\"LDV/LDT1\", 0.3,  IF(B468=\"LDT2\", 0.4, IF(OR(B468=\"HLDT/MDPV\",B468=\"HLDT Allowance only\", B468=\"MDPV Allowance only\"), 0.5, IF(B468=\"HDV\", 0.6,   ERROR)))))","v":""},"","","","",""]
[null,null,null,null,null,null,null,null,null,null,null,null,null,null,null,null,null,null,null,null,null,null,{"$f":"IF(A469=\"\",\"\", IF(B469=\"LDV/LDT1\", 0.3,  IF(B469=\"LDT2\", 0.4, IF(OR(B469=\"HLDT/MDPV\",B469=\"HLDT Allowance only\", B469=\"MDPV Allowance only\"), 0.5, IF(B469=\"HDV\", 0.6,   ERROR)))))","v":""},{"$f":"IF(A469=\"\", \"\", IF(J469 = \"Yes\", W469, IF(K469=\"Yes\", W469, IF(AND(A469<>\"\",B469=\"HDV\",E469=\"Statement\"), MAX(C469, W469),C469))))","v":""},{"$f":"IF(A469=\"\",\"\",IF(AND(A469<>\"\",L469=\"Yes\",$C$8>2021),\"ERROR--Can't Use Early Allowances after 2021MY\",\nIF(AND(A469<>\"\",B469=\"HLDT Allowance only\",$C$8=2017),\"Can't Use HLDT Allowance before 2018MY\",IF(AND(A469<>\"\",B469=\"MDPV Allowance only\",$C$8=2017),\"Can't Use MDPV Allowance before 2018MY\",IF(AND(A469<>\"\",B469=\"HLDT/MDPV\",$C$8=2017),\"Can't Use HLDT/MDPV Allowance before 2018MY\",IF(AND(A469<>\"\",B469=\"HDV\",$C$8=2017),\"Can't Use HDV Allowance before 2018MY\",IF(AND(A469<>\"\",L469=\"Yes\",J469<>\"Yes\",K469<>\"Yes\",C469>W469),\"ERROR--Early Allowance evaporative family does not comply with Tier 3 standards and is not a 2015 or 2016 Carryover PZEV or Carryover LEV3 Option 1 (Rig Test) Evap family\",IF(AND(A469<>\"\",L469=\"Yes\",B469=\"HDV\",O469=\"\"),\"FIX 50-St Prod'n--needed for HDV Allowances\",IF(AND(A469<>\"\",B469=\"MDPV Allowance only\",O469=\"\"),\"FIX 50-St Prod'n--needed for MDPV early allowances\",IF(AND(A469<>\"\",L469=\"Yes\",B469=\"LDV/LDT1\",N469=\"\"),\"FIX Fed Prod'n--needed for LDV/LDT1 early allowances\",IF(AND(A469<>\"\",L469=\"Yes\",B469=\"LDT2\",N469=\"\"),\"FIX Fed Prod'n--needed for LDT2 early allowances\",IF(AND(A469<>\"\",L469=\"Yes\",B469=\"HLDT Allowance only\",N469=\"\"),\"FIX Fed Prod'n--needed for HLDT early allowances\",IF(AND(A469<>\"\",L469=\"Yes\",B469=\"HLDT/MDPV\"),\"ERROR in Col B--must use HLDT Allowance only or MDPV Allowance only value from Column B menu and corresponding production values for HLDT Allowances or MDPV Allowances as applicable\",IF(AND(A469<>\"\",B469=\"HDV\",D469=\"\"),\"ERROR--Column B is HDV but HDV Class in Column E is Blank\",IF(AND(A469<>\"\",B469<>\"\",B469<>\"HDV\",D469<>\"\"),\"ERROR--Column B is not HDV but you entered a HDV Class in Column E\",IF(AND(A469<>\"\",B469=\"HDV\",D469=4,E469=\"\"),\"ERROR--Column E indicates HDV Class 4-8 but Certification Basis in Column F is Blank\",IF(AND(A469<>\"\",B469=\"HDV\",D469=5,E469=\"\"),\"ERROR--Column E indicates HDV Class 4-8 but Certification Basis in Column F is Blank\",IF(AND(A469<>\"\",B469=\"HDV\",D469=6,E469=\"\"),\"ERROR--Column E indicates HDV Class 4-8 but Certification Basis in Column F is Blank\",IF(AND(A469<>\"\",B469=\"HDV\",D469=7,E469=\"\"),\"ERROR--Column E indicates HDV Class 4-8 but Certification Basis in Column F is Blank\",IF(AND(A469<>\"\",B469=\"HDV\",D469=8,E469=\"\"),\"ERROR--Column E indicates HDV Class 4-8 but Certification Basis in Column F is Blank\",IF(AND(A469<>\"\",D469=\"2b\",E469=\"Statement\"),\"ERROR in Columns E & F---Can't use Statement for Certification Basis of Class 2b HDVs\",IF(AND(A469<>\"\",D469=3,E469=\"Statement\"),\"ERROR in Columns E & F---Can't use Statement for Certification Basis of Class 3 HDVs\",IF(AND(A469<>\"\",B469<>\"HDV\",E469=\"Statement\"),\"ERROR in Columns B & F---Can only use Statement as the Certification Basis of Class 4 and above HDVs\",IF(AND(A469<>\"\",I469=\"Phase 2\",J469=\"No\"),\"ERROR--Can only use Phase 2 test fuel for 2015-2016 Carryover PZEV Option 1 (Rig Test) Evaporative Families\",IF(AND(A469<>\"\",I469=\"NA\",E469<>\"Statement\"),\"ERROR in Columns F & J---Can only use NA for Test Fuel if Certification is based on a Statement\",IF(AND(A469<>\"\",J469=\"Yes\",I469<>\"Phase 2\"),\"ERROR--Test fuel must be Phase 2 for 2015-2016 Carryover PZEV Option 1 (Rig test) evaporative families\",IF(AND(A469<>\"\",J469=\"Yes\",C469<>0.35,C469<>0.5,C469<>0.75),\"ERROR--FEL must be 0.350, 0.500 or 0.750 for 2015-2016 Carryover PZEV Option 1 (Rig test) evaporative families\",IF(AND(A469<>\"\",J469=\"Yes\",B469<>\"LDV/LDT1\",B469<>\"LDT2\",B469<>\"HLDT/MDPV\"),\"ERROR--Vehicle class must be LDV/LDT1 or LDT2 or HLDT/MDPV for 2015-2016 Carryover PZEV Option 1 (Rig test) evaporative families\",IF(AND(A469<>\"\",$C$8>2019,J469=\"Yes\",L469<>\"Yes\"),\"ERROR--Can't use Carryover data from 2015-2016 PZEV Option 1 (Rig test) using Phase 2 test fuel after 2019MY (or after 2021MY if used as an Early Allowance)\",IF(AND(A469<>\"\",K469=\"Yes\",I469<>\"LEV 3\"),\"ERROR--Test fuel must be LEV 3 for 2015-2016 Carryover LEV3 Option 1 (Rig test) evaporative families\",IF(AND(A469<>\"\",K469=\"Yes\",C469<>0.35,C469<>0.5,C469<>0.75),\"ERROR--FEL must be 0.350, 0.500 or 0.750 for 2015-2016 Carryover LEV3 Option 1 (Rig test) evaporative families\",IF(AND(A469<>\"\",$C$8>2021,K469=\"Yes\"),\"ERROR--Can't use Carryover data from 2015-2016 CARB LEV3 Option 1 (Rig test) using LEV 3 test fuel after 2021MY\",IF(AND(A469<>\"\",B469<>\"LDV/LDT1\",G469=120),\"ERROR--Useful Life must be 150,000 miles for this Tier 3 Evaporative Family\",IF(AND(A469<>\"\",L469=\"Yes\",M469<>2015,M469<>2016,M469<>2017),\"FIX Model Year Early Allowance was earned\",IF(AND(A469<>\"\",L469=\"No\",M469<>\"\",M469<>\"NA\"),\"Error in cols M & N---column M indicates No Allowance but Column N indicates an allowance was earned\",IF(AND(A469<>\"\",L469=\"Yes\",B469<>\"HDV\",B469<>\"HLDT Allowance only\",B469<>\"MDPV Allowance only\",M469=2017),\"ERROR--Early allowances can't be earned in 2017MY for LDV/LDT1 and LDT2 Evaporative Families\",IF(AND(A469<>\"\",$C$8=2017,N469=\"\"),\"FIX Federal Prod'n--needed for 2017MY compliance\",IF(AND(A469<>\"\",$C$8<>2017,L469=\"No\",O469=\"\"),\"FIX 50-St Prod'n\",IF(AND(A469<>\"\",B469=\"HLDT Allowance only\",L469<>\"Yes\"),\"ERROR - Cols B & M--Column B indicates an Allowance is being used but Column M indicates No Allowance\",IF(AND(A469<>\"\",B469=\"MDPV Allowance only\",L469<>\"Yes\"),\"ERROR - Cols B & M--Column B indicates an Allowance is being use but Column M indicates No Allowance\",IF(AND(A469<>\"\",B469=\"HDV\",D469<> \"2b\", L469=\"Yes\",F469 =\"\"),\"FIX Column G 'HDV also meets ORVR Standards'---needed for HDV Class 3 and above Allowances\",IF(AND(A469<>\"\",B469=\"HDV\",D469<> \"2b\", L469=\"Yes\",F469 =\"Yes\"), 2*O469,IF(AND(A469<>\"\",L469=\"Yes\",B469=\"LDV/LDT1\"),N469,IF(AND(A469<>\"\",L469=\"Yes\",B469=\"LDT2\"),N469,IF(AND(A469<>\"\",L469=\"Yes\",B469=\"HLDT Allowance only\"),N469,IF(AND(A469<>\"\",L469=\"No\",$C$8=2017),N469,O469))))))))))))))))))))))))))))))))))))))))))))))","v":""},{"$f":"IF(AND(A469=\"\",N469<>\"\"),\"FIX TEST GROUP\",IF(AND(A469=\"\",O469<>\"\"),\"FIX TEST GROUP\",IF(A469=\"\",\"\", IF(B469=\"\",\"FIX CLASS\",IF(C469=\"\",\"FIX FEL\",IF(G469=\"\",\"FIX U/L Miles\",IF(I469=\"\",\"FIX Test Fuel\",IF(J469=\"\",\"FIX PZEV Carryover\",IF(K469=\"\",\"FIX CARB Opt 1 Carryover\",IF(L469=\"\",\"FIX Allowance Y/N\",IF(M469=\"\",\"FIX Allowance MY\",IF(Y469=\"\",\"FIX PROD'N in Column Q\",Y469*X469))))))))))))","v":""},{"$f":"IF(A469=\"\",\"\",IF(AND(A469<>\"\",B469=\"LDV/LDT1\",C469<=0.5),\"OK\",IF(AND(A469<>\"\",B469=\"LDT2\",C469<=0.65),\"OK\",IF(AND(A469<>\"\",B469=\"HLDT/MDPV\",C469<=0.9),\"OK\",IF(AND(A469<>\"\",B469=\"HLDT/MDPV\",C469>0.9,C469<=1),\"OK if HLDTs < 0.9\",IF(AND(A469<>\"\",B469=\"HDV\",D469=\"2b\",C469<=1.4),\"OK\",IF(AND(A469<>\"\",B469=\"HDV\",D469=3,C469<=1.4),\"OK\",IF(AND(A469<>\"\",B469=\"HDV\",C469<=1.9, D469>=4),\"OK\",IF(AND(A469<>\"\",B469=\"HLDT Allowance only\"),\"OK\",IF(AND(A469<>\"\",B469=\"MDPV Allowance only\"),\"OK\",\"FEL exceeds CAP\"))))))))))","v":""},{"$f":"IF(ISNUMBER(Y469)=TRUE, \"\", Y469)","v":""}]
[null,null,null,null,null,null,null,null,null,null,null,null,null,null,null,null,null,null,null,null,null,null,{"$f":"IF(A470=\"\",\"\", IF(B470=\"LDV/LDT1\", 0.3,  IF(B470=\"LDT2\", 0.4, IF(OR(B470=\"HLDT/MDPV\",B470=\"HLDT Allowance only\", B470=\"MDPV Allowance only\"), 0.5, IF(B470=\"HDV\", 0.6,   ERROR)))))","v":""},"","","","",""]
[null,null,null,null,null,null,null,null,null,null,null,null,null,null,null,null,null,null,null,null,null,null,{"$f":"IF(A471=\"\",\"\", IF(B471=\"LDV/LDT1\", 0.3,  IF(B471=\"LDT2\", 0.4, IF(OR(B471=\"HLDT/MDPV\",B471=\"HLDT Allowance only\", B471=\"MDPV Allowance only\"), 0.5, IF(B471=\"HDV\", 0.6,   ERROR)))))","v":""},"","","","",""]
[null,null,null,null,null,null,null,null,null,null,null,null,null,null,null,null,null,null,null,null,null,null,{"$f":"IF(A472=\"\",\"\", IF(B472=\"LDV/LDT1\", 0.3,  IF(B472=\"LDT2\", 0.4, IF(OR(B472=\"HLDT/MDPV\",B472=\"HLDT Allowance only\", B472=\"MDPV Allowance only\"), 0.5, IF(B472=\"HDV\", 0.6,   ERROR)))))","v":""},"","","","",""]
[null,null,null,null,null,null,null,null,null,null,null,null,null,null,null,null,null,null,null,null,null,null,{"$f":"IF(A473=\"\",\"\", IF(B473=\"LDV/LDT1\", 0.3,  IF(B473=\"LDT2\", 0.4, IF(OR(B473=\"HLDT/MDPV\",B473=\"HLDT Allowance only\", B473=\"MDPV Allowance only\"), 0.5, IF(B473=\"HDV\", 0.6,   ERROR)))))","v":""},"","","","",""]
[null,null,null,null,null,null,null,null,null,null,null,null,null,null,null,null,null,null,null,null,null,null,{"$f":"IF(A474=\"\",\"\", IF(B474=\"LDV/LDT1\", 0.3,  IF(B474=\"LDT2\", 0.4, IF(OR(B474=\"HLDT/MDPV\",B474=\"HLDT Allowance only\", B474=\"MDPV Allowance only\"), 0.5, IF(B474=\"HDV\", 0.6,   ERROR)))))","v":""},"","","","",""]
[null,null,null,null,null,null,null,null,null,null,null,null,null,null,null,null,null,null,null,null,null,null,{"$f":"IF(A475=\"\",\"\", IF(B475=\"LDV/LDT1\", 0.3,  IF(B475=\"LDT2\", 0.4, IF(OR(B475=\"HLDT/MDPV\",B475=\"HLDT Allowance only\", B475=\"MDPV Allowance only\"), 0.5, IF(B475=\"HDV\", 0.6,   ERROR)))))","v":""},"","","","",""]
[null,null,null,null,null,null,null,null,null,null,null,null,null,null,null,null,null,null,null,null,null,null,{"$f":"IF(A476=\"\",\"\", IF(B476=\"LDV/LDT1\", 0.3,  IF(B476=\"LDT2\", 0.4, IF(OR(B476=\"HLDT/MDPV\",B476=\"HLDT Allowance only\", B476=\"MDPV Allowance only\"), 0.5, IF(B476=\"HDV\", 0.6,   ERROR)))))","v":""},"","","","",""]
[null,null,null,null,null,null,null,null,null,null,null,null,null,null,null,null,null,null,null,null,null,null,{"$f":"IF(A477=\"\",\"\", IF(B477=\"LDV/LDT1\", 0.3,  IF(B477=\"LDT2\", 0.4, IF(OR(B477=\"HLDT/MDPV\",B477=\"HLDT Allowance only\", B477=\"MDPV Allowance only\"), 0.5, IF(B477=\"HDV\", 0.6,   ERROR)))))","v":""},"","","","",""]
[null,null,null,null,null,null,null,null,null,null,null,null,null,null,null,null,null,null,null,null,null,null,{"$f":"IF(A478=\"\",\"\", IF(B478=\"LDV/LDT1\", 0.3,  IF(B478=\"LDT2\", 0.4, IF(OR(B478=\"HLDT/MDPV\",B478=\"HLDT Allowance only\", B478=\"MDPV Allowance only\"), 0.5, IF(B478=\"HDV\", 0.6,   ERROR)))))","v":""},"","","","",""]
[null,null,null,null,null,null,null,null,null,null,null,null,null,null,null,null,null,null,null,null,null,null,{"$f":"IF(A479=\"\",\"\", IF(B479=\"LDV/LDT1\", 0.3,  IF(B479=\"LDT2\", 0.4, IF(OR(B479=\"HLDT/MDPV\",B479=\"HLDT Allowance only\", B479=\"MDPV Allowance only\"), 0.5, IF(B479=\"HDV\", 0.6,   ERROR)))))","v":""},"","","","",""]
[null,null,null,null,null,null,null,null,null,null,null,null,null,null,null,null,null,null,null,null,null,null,{"$f":"IF(A480=\"\",\"\", IF(B480=\"LDV/LDT1\", 0.3,  IF(B480=\"LDT2\", 0.4, IF(OR(B480=\"HLDT/MDPV\",B480=\"HLDT Allowance only\", B480=\"MDPV Allowance only\"), 0.5, IF(B480=\"HDV\", 0.6,   ERROR)))))","v":""},"","","","",""]
[null,null,null,null,null,null,null,null,null,null,null,null,null,null,null,null,null,null,null,null,null,null,{"$f":"IF(A481=\"\",\"\", IF(B481=\"LDV/LDT1\", 0.3,  IF(B481=\"LDT2\", 0.4, IF(OR(B481=\"HLDT/MDPV\",B481=\"HLDT Allowance only\", B481=\"MDPV Allowance only\"), 0.5, IF(B481=\"HDV\", 0.6,   ERROR)))))","v":""},"","","","",""]
[null,null,null,null,null,null,null,null,null,null,null,null,null,null,null,null,null,null,null,null,null,null,{"$f":"IF(A482=\"\",\"\", IF(B482=\"LDV/LDT1\", 0.3,  IF(B482=\"LDT2\", 0.4, IF(OR(B482=\"HLDT/MDPV\",B482=\"HLDT Allowance only\", B482=\"MDPV Allowance only\"), 0.5, IF(B482=\"HDV\", 0.6,   ERROR)))))","v":""},"","","","",""]
[null,null,null,null,null,null,null,null,null,null,null,null,null,null,null,null,null,null,null,null,null,null,{"$f":"IF(A483=\"\",\"\", IF(B483=\"LDV/LDT1\", 0.3,  IF(B483=\"LDT2\", 0.4, IF(OR(B483=\"HLDT/MDPV\",B483=\"HLDT Allowance only\", B483=\"MDPV Allowance only\"), 0.5, IF(B483=\"HDV\", 0.6,   ERROR)))))","v":""},"","","","",""]
[null,null,null,null,null,null,null,null,null,null,null,null,null,null,null,null,null,null,null,null,null,null,{"$f":"IF(A484=\"\",\"\", IF(B484=\"LDV/LDT1\", 0.3,  IF(B484=\"LDT2\", 0.4, IF(OR(B484=\"HLDT/MDPV\",B484=\"HLDT Allowance only\", B484=\"MDPV Allowance only\"), 0.5, IF(B484=\"HDV\", 0.6,   ERROR)))))","v":""},"","","","",""]
[null,null,null,null,null,null,null,null,null,null,null,null,null,null,null,null,null,null,null,null,null,null,{"$f":"IF(A485=\"\",\"\", IF(B485=\"LDV/LDT1\", 0.3,  IF(B485=\"LDT2\", 0.4, IF(OR(B485=\"HLDT/MDPV\",B485=\"HLDT Allowance only\", B485=\"MDPV Allowance only\"), 0.5, IF(B485=\"HDV\", 0.6,   ERROR)))))","v":""},"","","","",""]
[null,null,null,null,null,null,null,null,null,null,null,null,null,null,null,null,null,null,null,null,null,null,{"$f":"IF(A486=\"\",\"\", IF(B486=\"LDV/LDT1\", 0.3,  IF(B486=\"LDT2\", 0.4, IF(OR(B486=\"HLDT/MDPV\",B486=\"HLDT Allowance only\", B486=\"MDPV Allowance only\"), 0.5, IF(B486=\"HDV\", 0.6,   ERROR)))))","v":""},"","","","",""]
[null,null,null,null,null,null,null,null,null,null,null,null,null,null,null,null,null,null,null,null,null,null,{"$f":"IF(A487=\"\",\"\", IF(B487=\"LDV/LDT1\", 0.3,  IF(B487=\"LDT2\", 0.4, IF(OR(B487=\"HLDT/MDPV\",B487=\"HLDT Allowance only\", B487=\"MDPV Allowance only\"), 0.5, IF(B487=\"HDV\", 0.6,   ERROR)))))","v":""},"","","","",""]
[null,null,null,null,null,null,null,null,null,null,null,null,null,null,null,null,null,null,null,null,null,null,{"$f":"IF(A488=\"\",\"\", IF(B488=\"LDV/LDT1\", 0.3,  IF(B488=\"LDT2\", 0.4, IF(OR(B488=\"HLDT/MDPV\",B488=\"HLDT Allowance only\", B488=\"MDPV Allowance only\"), 0.5, IF(B488=\"HDV\", 0.6,   ERROR)))))","v":""},"","","","",""]
[null,null,null,null,null,null,null,null,null,null,null,null,null,null,null,null,null,null,null,null,null,null,{"$f":"IF(A489=\"\",\"\", IF(B489=\"LDV/LDT1\", 0.3,  IF(B489=\"LDT2\", 0.4, IF(OR(B489=\"HLDT/MDPV\",B489=\"HLDT Allowance only\", B489=\"MDPV Allowance only\"), 0.5, IF(B489=\"HDV\", 0.6,   ERROR)))))","v":""},"","","","",""]
[null,null,null,null,null,null,null,null,null,null,null,null,null,null,null,null,null,null,null,null,null,null,{"$f":"IF(A490=\"\",\"\", IF(B490=\"LDV/LDT1\", 0.3,  IF(B490=\"LDT2\", 0.4, IF(OR(B490=\"HLDT/MDPV\",B490=\"HLDT Allowance only\", B490=\"MDPV Allowance only\"), 0.5, IF(B490=\"HDV\", 0.6,   ERROR)))))","v":""},"","","","",""]

{"sheet":"Evap AB&T MY Summary","index":5,"n_rows":53,"n_cols":11,"rows_kept":53,"cut":false,"hidden":false,"merged":[[52,2,52,5],[44,7,47,9],[47,2,47,5],[11,10,13,10],[12,0,13,0],[49,2,49,5],[50,2,50,5],[51,2,51,5],[12,1,13,1],[12,2,13,2],[11,6,12,6],[20,3,20,5],[23,0,23,2],[34,2,34,5],[11,7,13,7],[11,8,13,8],[8,0,8,2],[8,3,8,5],[9,1,9,2],[9,3,9,5],[11,3,11,5],[0,0,0,10],[6,0,6,2],[6,3,6,4],[7,0,7,2],[7,3,7,5],[4,0,4,10],[3,0,3,10],[1,1,1,9],[32,7,35,9],[20,7,21,9],[11,9,13,9],[45,2,45,5],[46,2,46,5],[21,3,21,5],[32,2,32,5],[33,2,33,5],[35,2,35,5],[44,2,44,5]]}
["Example Template - Tier 3 Evaporative Fleet Average (Hot Soak + Diurnal) Credits - AB&T Model Year Summary Table"]
[null,"Manufacturer: _______________________",null,null,null,null,null,null,null,null,"Date:_______________"]
[]
["Purpose and Scope of this Guidance Document          "]
["    This document was prepared by EPA's Office of Transportation and Air Quality (OTAQ).  It is one of several intended to aid regulated parties in reporting Tier 3 and Cold NMHC Averaging, Banking and Trading (AB&T) information and calculating AB&T fleet average credits for light-duty vehicles and certain heavy-duty class 2b and 3 vehicles, ref. 40 CFR 86.1862-04(c).  It contains EPA's recommended format for manufacturers to report to EPA their end-of-year Tier 3 AB&T calculations, credits and other information with respect to the implementation of the AB&T provisions of the EPA Tier 3 final rule (79 FR 23414, April 28, 2014) as amended (80 FR 9078, February 19, 2015; 80 FR 26463, May 8, 2015);  ref. 40 CFR Parts 85, 86, 600, 1065, 1066.  Use of this document is purely optional.\n       This document does not in any way alter or waive the requirements in EPA regulations.  Although the calculations and formulas provided in this document are intended to assist manufacturers in the implementation of EPA regulations, this document does not establish or change the legal rights or obligations of manufacturers or others in complying with EPA regulations, including 40 CFR 86.1862-04(c). If an error or other discrepancy is found in this document, including the calculation formulas, please contact your EPA certification team member or Dave Good at (734) 214-4450 or by email at good.david@epa.gov.  The regulations take precedence."]
[]
["Select Model Year: ",null,null,2019,null,null,null,null,null,null,"OMB Control Number 2060-0104"]
["Select Phase-in Approach: ",null,null,"Primary--(Used for 2017-2022MYs)",null,null,null,null,null,null,"Expires 3-31-2020"]
["Applicable Phase-in Regulations: ",null,null,{"$f":"IF(D8=\"Primary--(Used for 2017-2022MYs)\",\"40 CFR 86.1813-17(a)(5) Table 3\",IF(D8=\"Alternative---(Used for 2017-2022MYs)\",\"40 CFR 86.1813-17(g)(4)\",\"ERROR\"))","v":"40 CFR 86.1813-17(a)(5) Table 3"}]
[null,"Small Volume?",null,"No"]
[]
[null,null,null,"Tier 3 Fleet Average Compliance Level",null,null,"G.  Credit (Debit) \n[Calc from D,E,F]","Date Credits/ Debits were earned","Date Credits will expire","Last Date When Credits can be Traded","Comments"]
["A.  Date of Transaction","B.  Model Year","C. Category","D. Applicable Evap HS+D Standards","E.  Mfr  Evap HS+D Compliance Level","F. \nProduction Volume "]
[null,null,null,"grams/test","grams/test","vehicles","veh-grams/test"]
[]
["2017 Credits (LDV/LDT1 and LDT2 Classes only):"]
["2018-05-01",2017,"LDV/LDT1",{"$f":"IF(C17=\"LDV/LDT1\", 0.3, IF(C17=\"LDT2\", 0.4,IF(C17=\"HLDT/MDPV\", 0.5,IF(C17=\"HDV\", 0.6, \"ERROR\"))))","v":0.3},0.3,21784,{"$f":" IF(E17= \"\", \"ERROR\", IF(F17= \"\", \"ERROR\",astm((astm(D17,3)-(astm(E17,3)))*F17,0)))","v":0},"2017-12-31","-","-","2017 Tier 3 LDV/LDT1 Evap Credits earned; see other spreadsheet. "]
["2018-05-01",2017,"LDT2",{"$f":"IF(C18=\"LDV/LDT1\", 0.3, IF(C18=\"LDT2\", 0.4,IF(C18=\"HLDT/MDPV\", 0.5,IF(C18=\"HDV\", 0.6, \"ERROR\"))))","v":0.4},0.4,41000,{"$f":" IF(E18= \"\", \"ERROR\", IF(F18= \"\", \"ERROR\",astm((astm(D18,3)-(astm(E18,3)))*F18,0)))","v":0},"2017-12-31","-","-","2017 Tier 3 LDT2 Evap Credits earned; see other spreadsheet. "]
[null,2017,"Transfer","-","-","-",null,"-","-","-"]
[]
[null,null,null,"  LDV/LDT1 - Total 2017  Credits Remaining:",null,null,{"$f":"G17","v":0},"    2017 Credits expire Dec 31, 2022;  \n   Debits must be paid off by Dec 31, 2020."]
[null,null,null,"  LDT2      -     Total 2017 Credits Remaining:",null,null,{"$f":"G18","v":0}]
[]
["2018 Credits: "]
["2019-05-01",2018,"LDV/LDT1",{"$f":"IF(C25=\"LDV/LDT1\", 0.3, IF(C25=\"LDT2\", 0.4,IF(C25=\"HLDT/MDPV\", 0.5,IF(C25=\"HDV\", 0.6, \"ERROR\"))))","v":0.3},0.24,48471,{"$f":" IF(E25= \"\", \"ERROR\", IF(F25= \"\", \"ERROR\",astm((astm(D25,3)-(astm(E25,3)))*F25,0)))","v":2908},"2018-12-31",{"$f":"DATE(YEAR(H25)+5,MONTH(H25),DAY(H25))","v":"2023-12-31"},{"$f":"DATE(YEAR(H25)+5,MONTH(H25),DAY(H25))","v":"2023-12-31"}]
["2019-05-01",2018,"LDT2",0.4,0.4,98769,{"$f":" IF(E26= \"\", \"ERROR\", IF(F26= \"\", \"ERROR\",astm((astm(D26,3)-(astm(E26,3)))*F26,0)))","v":0},"2018-12-31","-","-"]
["2019-05-01",2018,"HLDT/MDPV",0.5,0.56000000000000005,28461,{"$f":" IF(E27= \"\", \"ERROR\", IF(F27= \"\", \"ERROR\",astm((astm(D27,3)-(astm(E27,3)))*F27,0)))","v":-1708},"2018-12-31","-","-"]
["2019-01-20",2018,"HLDT/MDPV","Transfer","-","-",500,"2018-12-31",{"$f":"DATE(YEAR(H28)+5,MONTH(H28),DAY(H28))","v":"2023-12-31"},{"$f":"DATE(YEAR(H28)+5,MONTH(H28),DAY(H28))","v":"2023-12-31"},"Purchased 500 HLDV/MDPV Evaporative credits from Manufacturer A (earned on 12/31/2018)"]
["2020-05-01",2019,"HLDT/MDPV","Transfer","-","-",1208,"2019-12-31",{"$f":"DATE(YEAR(H29)+5,MONTH(H29),DAY(H29))","v":"2024-12-31"},{"$f":"DATE(YEAR(H29)+5,MONTH(H29),DAY(H29))","v":"2024-12-31"},"Transferred 1208 HLDV/MDPV 2019 Evaporative credits from 2019 to 2018 model year (earned on 12/31/2019)."]
["2019-05-01",2018,"HDV",{"$f":"IF(C30=\"LDV/LDT1\", 0.3, IF(C30=\"LDT2\", 0.4,IF(C30=\"HLDT/MDPV\", 0.5,IF(C30=\"HDV\", 0.6, \"ERROR\"))))","v":0.6},0.46,54076,{"$f":" IF(E30= \"\", \"ERROR\", IF(F30= \"\", \"ERROR\",astm((astm(D30,3)-(astm(E30,3)))*F30,0)))","v":7571},"2018-12-31",{"$f":"DATE(YEAR(H30)+5,MONTH(H30),DAY(H30))","v":"2023-12-31"},{"$f":"DATE(YEAR(H30)+5,MONTH(H30),DAY(H30))","v":"2023-12-31"}]
["2019-03-04",2018,"HDV","Transfer","-","-",-7000,"2018-12-31","-","-","Sold 7,000 2018 HDV Evaporative Credits  to Manufacturer B (earned on 12/31/2018)."]
[]
[null,null,"          LDV/LDT1   -        Total 2018  Credits Remaining:",null,null,null,{"$f":"G25","v":2908},"     2018 Credits expire Dec 31, 2023;  \n     Debits must be paid off by Dec 31, 2021."]
[null,null,"          LDT2       -             Total 2018 Credits Remaining:",null,null,null,{"$f":"G26","v":0}]
[null,null,"          HLDT/MDPV -      Total 2018 Credits Remaining:",null,null,null,{"$f":"G27+G28+G29","v":0}]
[null,null,"          HDV       -              Total 2018 Credits Remaining:",null,null,null,{"$f":"G30+G31","v":571}]
[]
["2019 Credits: "]
["2020-05-01",2019,"LDV/LDT1",{"$f":"IF(C39=\"LDV/LDT1\", 0.3, IF(C39=\"LDT2\", 0.4,IF(C39=\"HLDT/MDPV\", 0.5,IF(C39=\"HDV\", 0.6, \"ERROR\"))))","v":0.3},{"$f":"Evap!K10","v":0.188},{"$f":"Evap!J10","v":79840},{"$f":" IF(E39= \"\", \"ERROR\", IF(F39= \"\", \"ERROR\",astm((astm(D39,3)-(astm(E39,3)))*F39,0)))","v":8942},"2019-12-31",{"$f":"DATE(YEAR(H39)+5,MONTH(H39),DAY(H39))","v":"2024-12-31"},{"$f":"DATE(YEAR(H39)+5,MONTH(H39),DAY(H39))","v":"2024-12-31"}]
["2020-05-01",2019,"LDT2",0.4,{"$f":"Evap!Q10","v":0.33700000000000002},{"$f":"Evap!P10","v":134000},{"$f":" IF(E40= \"\", \"ERROR\", IF(F40= \"\", \"ERROR\",astm((astm(D40,3)-(astm(E40,3)))*F40,0)))","v":8442},"2019-12-31",{"$f":"DATE(YEAR(H40)+5,MONTH(H40),DAY(H40))","v":"2024-12-31"},{"$f":"DATE(YEAR(H40)+5,MONTH(H40),DAY(H40))","v":"2024-12-31"}]
["2020-05-01",2019,"HLDT/MDPV",0.5,{"$f":"Evap!K15","v":0.48099999999999998},{"$f":"Evap!J15","v":120049},{"$f":" IF(E41= \"\", \"ERROR\", IF(F41= \"\", \"ERROR\",astm((astm(D41,3)-(astm(E41,3)))*F41,0)))","v":2281},"2019-12-31","2024-12-31","2024-12-31"]
["2020-05-01",2019,"HLDT/MDPV","Transfer","-","-",-1208,"2019-12-31","-","-","Transferred 1208 HLDV/MDPV 2019 Evaporative credits from 2019 to 2018 model year (earned on 12/31/2019)."]
["2020-05-01",2019,"HDV",0.6,{"$f":"Evap!Q15","v":0.60099999999999998},{"$f":"Evap!P15","v":116000},{"$f":" IF(E43= \"\", \"ERROR\", IF(F43= \"\", \"ERROR\",astm((astm(D43,3)-(astm(E43,3)))*F43,0)))","v":-116},"2019-12-31","-","-"]
[]
[null,null,"          LDV/LDT1   -        Total 2019  Credits Remaining:",null,null,null,{"$f":"G39","v":8942},"     2019 Credits expire Dec 31, 2024;  \n     Debits must be paid off by Dec 31, 2022."]
[null,null,"          LDT2       -             Total 2019 Credits Remaining:",null,null,null,{"$f":"G40","v":8442}]
[null,null,"          HLDT/MDPV -      Total 2019 Credits Remaining:",null,null,null,{"$f":"G41","v":2281}]
[null,null,"          HDV       -              Total 2019 Credits Remaining:",null,null,null,{"$f":"G43","v":-116}]
[]
["Grand Totals:",null,"     LDV/LDT1   -  Grand Total 2017-2019  Credits Remaining:",null,null,null,{"$f":"G21+G33+G45","v":11850}]
[null,null,"     LDT2       -       Grand Total 2017-2019 Credits Remaining:",null,null,null,{"$f":"G22+G34+G46","v":8442}]
[null,null,"     HLDT/MDPV -Grand Total 2017-2019 Credits Remaining:",null,null,null,{"$f":"G35+G47","v":2281}]
[null,null,"     HDV       -        Grand Total 2017-2019 Credits Remaining:",null,null,null,{"$f":"G36+G48","v":455}]

{"sheet":"Sheet2","index":6,"n_rows":100,"n_cols":11,"rows_kept":100,"cut":false,"hidden":true,"merged":[[41,0,187,7]]}
[0,null,120,120,2015,2010,"No","MY of Early",160,160]
[0.01,null,150,150,2016,2011,"Yes","Allowance",125,125]
[0.02,null,"2b","N/A",2017,2012,null,"Evap Family:",110,70]
[0.03,null,3,null,2018,2013,null,2015,85,50]
[0.04,null,"LDV/LLDT","Test Fuel:",2019,2014,null,2016,70,30]
[0.05,null,"HLDT/MDPV","Phase 2",2020,2015,null,2017,50,20]
[0.06,null,null,"LEV 3",2021,2016,null,"NA","FED SULEV30",0]
[7.0000000000000007E-2,null,"Evap Classes:","Tier 3",2022,2017,null,null,30]
[0.08,null,"LDV/LDT1","NA",2023,2018,null,null,20]
[0.09,null,"LDT2","Not applicable",2024,2019,null,null,0]
[0.1,null,"HLDT/MDPV",null,2025,2020]
[0.11,null,"HDV",null,2026,2021,null,"Class 2b:",395,"(transitional--thru 2021MY only; ref. 86.1816-18(b)(7)(i))"]
[0.12,null,"HLDT Allowance only",null,2027,2022,null,null,340,"(transitional--thru 2021MY only; ref. 86.1816-18(b)(7)(i))"]
[0.13,null,"MDPV Allowance only",null,null,2023,null,null,250]
[0.14000000000000001,null,null,null,null,2024,null,null,150]
[0.15,null,null,null,null,2025,null,"Class 3",630]
[0.16,null,null,null,null,2026,null,null,570,"(transitional--thru 2021MY only; ref. 86.1816-18(b)(7)(i))"]
[0.17,null,null,null,null,2027,null,null,400,"(transitional--thru 2021MY only; ref. 86.1816-18(b)(7)(i))"]
[0.18,null,null,null,null,null,null,null,270]
["N/A",null,null,null,null,null,null,null,230]
[null,null,null,null,null,null,null,"Class 2b or 3:",200]
[null,null,null,null,null,null,null,"Class 2b or 3:",0,null,"HDV Classes:"]
[null,null,null,null,null,null,null,null,"Evap FELs:",null,"2b"]
[null,null,null,null,null,null,null,null,0,null,3]
[null,null,null,null,null,null,null,null,2.5000000000000001E-2,null,4]
[null,null,null,null,null,null,null,null,0.05,null,5]
["Following are valid values for Sheet \"HDV\" HDV Class/Bin combinations",null,null,null,null,null,null,null,7.4999999999999997E-2,null,6]
["2b_395",null,null,null,null,null,null,null,0.1,null,7]
["2b_340",null,null,null,null,null,null,null,0.125,null,8]
["2b_250",null,null,null,null,null,null,null,0.15]
["2b_150",null,null,null,null,null,null,null,0.17499999999999999,null,"Test Data"]
["2b_200",null,null,null,null,null,null,null,0.2,null,"Statement"]
["2b_0",null,null,null,null,null,null,null,0.22500000000000001]
["3_630",null,null,null,null,null,null,null,0.25]
["3_570",null,null,null,null,null,null,null,0.27500000000000002]
["3_400",null,null,null,null,null,null,null,0.3]
["3_270",null,null,null,null,null,null,null,0.32500000000000001]
["3_230",null,null,null,null,null,null,null,0.35]
["3_200",null,null,null,null,null,null,null,0.375]
["3_0",null,null,null,null,null,null,null,0.4]
[null,null,null,null,null,null,null,null,0.42499999999999999]
["                  Evap (2019MY) Spreadsheet - Error Checks in Column Y\n\n=IF(A21=\"\",\"\",\nIF(AND(A21<>\"\",L21=\"Yes\",$C$8>2021),\"ERROR--Can't Use Early Allowances after 2021MY\",\nIF(AND(A21<>\"\",B21=\"HLDT Allowance only\",$C$8=2017),\"Can't Use HLDT Allowance before 2018MY\",\nIF(AND(A21<>\"\",B21=\"MDPV Allowance only\",$C$8=2017),\"Can't Use MDPV Allowance before 2018MY\",\nIF(AND(A21<>\"\",B21=\"HLDT/MDPV\",$C$8=2017),\"Can't Use HLDT/MDPV Allowance before 2018MY\",\nIF(AND(A21<>\"\",B21=\"HDV\",$C$8=2017),\"Can't Use HDV Allowance before 2018MY\",\nIF(AND(A21<>\"\",L21=\"Yes\",J21<>\"Yes\",K21<>\"Yes\",C21>W21),\"ERROR--Early Allowance evaporative family does not comply with Tier 3 standards and is not a 2015 or 2016 Carryover PZEV or Carryover LEV3 Option 1 (Rig Test) Evap family\",\nIF(AND(A21<>\"\",L21=\"Yes\",B21=\"HDV\",O21=\"\"),\"FIX 50-St Prod'n--needed for HDV Allowances\",\nIF(AND(A21<>\"\",B21=\"MDPV Allowance only\",O21=\"\"),\"FIX 50-St Prod'n--needed for MDPV early allowances\",\nIF(AND(A21<>\"\",L21=\"Yes\",B21=\"LDV/LDT1\",N21=\"\"),\"FIX Fed Prod'n--needed for LDV/LDT1 early allowances\",\nIF(AND(A21<>\"\",L21=\"Yes\",B21=\"LDT2\",N21=\"\"),\"FIX Fed Prod'n--needed for LDT2 early allowances\",\nIF(AND(A21<>\"\",L21=\"Yes\",B21=\"HLDT Allowance only\",N21=\"\"),\"FIX Fed Prod'n--needed for HLDT early allowances\",\nIF(AND(A21<>\"\",L21=\"Yes\",B21=\"HLDT/MDPV\"),\"ERROR in Col B--must use HLDT Allowance only or MDPV Allowance only value from Column B menu and corresponding production values for HLDT Allowances or MDPV Allowances as applicable\",\nIF(AND(A21<>\"\",B21=\"HDV\",D21=\"\"),\"ERROR--Column B is HDV but HDV Class in Column E is Blank\",\nIF(AND(A21<>\"\",B21<>\"\",B21<>\"HDV\",D21<>\"\"),\"ERROR--Column B is not HDV but you entered a HDV Class in Column E\",\nIF(AND(A21<>\"\",B21=\"HDV\",D21=4,E21=\"\"),\"ERROR--Column E indicates HDV Class 4-8 but Certification Basis in Column F is Blank\",\nIF(AND(A21<>\"\",B21=\"HDV\",D21=5,E21=\"\"),\"ERROR--Column E indicates HDV Class 4-8 but Certification Basis in Column F is Blank\",\nIF(AND(A21<>\"\",B21=\"HDV\",D21=6,E21=\"\"),\"ERROR--Column E indicates HDV Class 4-8 but Certification Basis in Column F is Blank\",\nIF(AND(A21<>\"\",B21=\"HDV\",D21=7,E21=\"\"),\"ERROR--Column E indicates HDV Class 4-8 but Certification Basis in Column F is Blank\",\nIF(AND(A21<>\"\",B21=\"HDV\",D21=8,E21=\"\"),\"ERROR--Column E indicates HDV Class 4-8 but Certification Basis in Column F is Blank\",\nIF(AND(A21<>\"\",D21=\"2b\",E21=\"Statement\"),\"ERROR in Columns E & F---Can't use Statement for Certification Basis of Class 2b HDVs\",\nIF(AND(A21<>\"\",D21=3,E21=\"Statement\"),\"ERROR in Columns E & F---Can't use Statement for Certification Basis of Class 3 HDVs\",\nIF(AND(A21<>\"\",B21<>\"HDV\",E21=\"Statement\"),\"ERROR in Columns B & F---Can only use Statement as the Certification Basis of Class 4 and above HDVs\",\nIF(AND(A21<>\"\",I21=\"Phase 2\",J21=\"No\"),\"ERROR--Can only use Phase 2 test fuel for 2015-2016 Carryover PZEV Option 1 (Rig Test) Evaporative Families\",\nIF(AND(A21<>\"\",I21=\"NA\",E21<>\"Statement\"),\"ERROR in Columns F & J---Can only use NA for Test Fuel if Certification is based on a Statement\",\nIF(AND(A21<>\"\",J21=\"Yes\",I21<>\"Phase 2\"),\"ERROR--Test fuel must be Phase 2 for 2015-2016 Carryover PZEV Option 1 (Rig test) evaporative families\",\nIF(AND(A21<>\"\",J21=\"Yes\",C21<>0.35,C21<>0.5,C21<>0.75),\"ERROR--FEL must be 0.350, 0.500 or 0.750 for 2015-2016 Carryover PZEV Option 1 (Rig test) evaporative families\",\nIF(AND(A21<>\"\",J21=\"Yes\",B21<>\"LDV/LDT1\",B21<>\"LDT2\",B21<>\"HLDT/MDPV\"),\"ERROR--Vehicle class must be LDV/LDT1 or LDT2 or HLDT/MDPV for 2015-2016 Carryover PZEV Option 1 (Rig test) evaporative families\",\nIF(AND(A21<>\"\",$C$8>2019,J21=\"Yes\",L21<>\"Yes\"),\"ERROR--Can't use Carryover data from 2015-2016 PZEV Option 1 (Rig test) using Phase 2 test fuel after 2019MY (or after 2021MY if used as an Early Allowance)\",\nIF(AND(A21<>\"\",K21=\"Yes\",I21<>\"LEV 3\"),\"ERROR--Test fuel must be LEV 3 for 2015-2016 Carryover LEV3 Option 1 (Rig test) evaporative families\",\nIF(AND(A21<>\"\",K21=\"Yes\",C21<>0.35,C21<>0.5,C21<>0.75),\"ERROR--FEL must be 0.350, 0.500 or 0.750 for 2015-2016 Carryover LEV3 Option 1 (Rig test) evaporative families\",\nIF(AND(A21<>\"\",$C$8>2021,K21=\"Yes\"),\"ERROR--Can't use Carryover data from 2015-2016 CARB LEV3 Option 1 (Rig test) using LEV 3 test fuel after 2021MY\",\nIF(AND(A21<>\"\",B21<>\"LDV/LDT1\",G21=120),\"ERROR--Useful Life must be 150,000 miles for this Tier 3 Evaporative Family\",\nIF(AND(A21<>\"\",L21=\"Yes\",M21<>2015,M21<>2016,M21<>2017),\"FIX Model Year Early Allowance was earned\",\nIF(AND(A21<>\"\",L21=\"No\",M21<>\"\",M21<>\"NA\"),\"Error in cols M & N---column M indicates No Allowance but Column N indicates an allowance was earned\",\nIF(AND(A21<>\"\",L21=\"Yes\",B21<>\"HDV\",B21<>\"HLDT Allowance only\",B21<>\"MDPV Allowance only\",M21=2017),\"ERROR--Early allowances can't be earned in 2017MY for LDV/LDT1 and LDT2 Evaporative Families\",\nIF(AND(A21<>\"\",$C$8=2017,N21=\"\"),\"FIX Federal Prod'n--needed for 2017MY compliance\",\nIF(AND(A21<>\"\",$C$8<>2017,L21=\"No\",O21=\"\"),\"FIX 50-St Prod'n\",\nIF(AND(A21<>\"\",B21=\"HLDT Allowance only\",L21<>\"Yes\"),\"ERROR - Cols B & M--Column B indicates an Allowance is being used but Column M indicates No Allowance\",\nIF(AND(A21<>\"\",B21=\"MDPV Allowance only\",L21<>\"Yes\"),\"ERROR - Cols B & M--Column B indicates an Allowance is being use but Column M indicates No Allowance\",\nIF(AND(A21<>\"\",B21=\"HDV\",D21<> \"2b\", L21=\"Yes\",F21 =\"\"),\"FIX Column G 'HDV also meets ORVR Standards'---needed for HDV Class 3 and above Allowances\",\nIF(AND(A21<>\"\",B21=\"HDV\",D21<> \"2b\", L21=\"Yes\",F21 =\"Yes\"), 2*O21,\nIF(AND(A21<>\"\",L21=\"Yes\",B21=\"LDV/LDT1\"),N21,\nIF(AND(A21<>\"\",L21=\"Yes\",B21=\"LDT2\"),N21,\nIF(AND(A21<>\"\",L21=\"Yes\",B21=\"HLDT Allowance only\"),N21,\nIF(AND(A21<>\"\",L21=\"No\",$C$8=2017),N21,O21))))))))))))))))))))))))))))))))))))))))))))))\n\n\n\n                  Evap (2019MY) Spreadsheet - Error Checks in Column Z\n\n=IF(AND(A21=\"\",N21<>\"\"),\"FIX TEST GROUP\",\nIF(AND(A21=\"\",O21<>\"\"),\"FIX TEST GROUP\",\nIF(A21=\"\",\"\", \nIF(B21=\"\",\"FIX CLASS\",\nIF(C21=\"\",\"FIX FEL\",\nIF(G21=\"\",\"FIX U/L Miles\",\nIF(I21=\"\",\"FIX Test Fuel\",\nIF(J21=\"\",\"FIX PZEV Carryover\",\nIF(K21=\"\",\"FIX CARB Opt 1 Carryover\",\nIF(L21=\"\",\"FIX Allowance Y/N\",\nIF(M21=\"\",\"FIX Allowance MY\",\nIF(Y21=\"\",\"FIX PROD'N in Column Q\",Y21*X21))))))))))))\n\n",null,null,null,null,null,null,null,0.45]
[null,null,null,null,null,null,null,null,0.47499999999999998]
[null,null,null,null,null,null,null,null,0.5]
[null,null,null,null,null,null,null,null,0.52500000000000002]
[null,null,null,null,null,null,null,null,0.55000000000000004]
[null,null,null,null,null,null,null,null,0.57499999999999996]
[null,null,null,null,null,null,null,null,0.6]
[null,null,null,null,null,null,null,null,0.625]
[null,null,null,null,null,null,null,null,0.65]
[null,null,null,null,null,null,null,null,0.67500000000000004]
[null,null,null,null,null,null,null,null,0.7]
[null,null,null,null,null,null,null,null,0.72499999999999998]
[null,null,null,null,null,null,null,null,0.75]
[null,null,null,null,null,null,null,null,0.77500000000000002]
[null,null,null,null,null,null,null,null,0.8]
[null,null,null,null,null,null,null,null,0.82499999999999996]
[null,null,null,null,null,null,null,null,0.85]
[null,null,null,null,null,null,null,null,0.875]
[null,null,null,null,null,null,null,null,0.9]
[null,null,null,null,null,null,null,null,0.92500000000000004]
[null,null,null,null,null,null,null,null,0.95]
[null,null,null,null,null,null,null,null,0.97499999999999998]
[null,null,null,null,null,null,null,null,1]
[null,null,null,null,null,null,null,null,1.0249999999999999]
[null,null,null,null,null,null,null,null,1.05]
[null,null,null,null,null,null,null,null,1.075]
[null,null,null,null,null,null,null,null,1.1000000000000001]
[null,null,null,null,null,null,null,null,1.125]
[null,null,null,null,null,null,null,null,1.1499999999999999]
[null,null,null,null,null,null,null,null,1.175]
[null,null,null,null,null,null,null,null,1.2]
[null,null,null,null,null,null,null,null,1.2250000000000001]
[null,null,null,null,null,null,null,null,1.25]
[null,null,null,null,null,null,null,null,1.2749999999999999]
[null,null,null,null,null,null,null,null,1.3]
[null,null,null,null,null,null,null,null,1.325]
[null,null,null,null,null,null,null,null,1.35]
[null,null,null,null,null,null,null,null,1.375]
[null,null,null,null,null,null,null,null,1.4]
[null,null,null,null,null,null,null,null,1.425]
[null,null,null,null,null,null,null,null,1.345]
[null,null,null,null,null,null,null,null,1.4750000000000001]
[null,null,null,null,null,null,null,null,1.5]
[null,null,null,null,null,null,null,null,1.5249999999999999]
[null,null,null,null,null,null,null,null,1.55]
[null,null,null,null,null,null,null,null,1.575]
[null,null,null,null,null,null,null,null,1.6]
[null,null,null,null,null,null,null,null,1.625]
[null,null,null,null,null,null,null,null,1.65]
[null,null,null,null,null,null,null,null,1.675]
[null,null,null,null,null,null,null,null,1.7]
[null,null,null,null,null,null,null,null,1.7250000000000001]
[null,null,null,null,null,null,null,null,1.75]
[null,null,null,null,null,null,null,null,1.7749999999999999]
[null,null,null,null,null,null,null,null,1.8]
[null,null,null,null,null,null,null,null,1.825]
[null,null,null,null,null,null,null,null,1.85]
[null,null,null,null,null,null,null,null,1.875]
[null,null,null,null,null,null,null,null,1.9]