{"text_format":"1","workbook":"xlsx","n_sheets":9,"sheets":["Instructions","Section 1","Section 2","Section 3","Reference List","Checks","Lists","OutputForCSV","TempOutput"],"not_rendered":{"charts":0,"images":0,"macros":1,"external_links":0,"defined_names":44,"comments":5,"pivot_tables":0},"unopened":[],"bounds":{"document_bytes":16777216,"sheet_cells":100000,"rows_first":2000,"rows_last":500,"rows_between":2000,"halvings":0,"cell_chars":16384,"cell_head_chars":4096},"cells_cut":0,"cells_raw":0,"read":"whole","date_system":"1900"}

{"sheet":"Instructions","index":0,"n_rows":21,"n_cols":3,"rows_kept":21,"cut":false,"hidden":false,"merged":[]}
[]
[null,null,"OMB Control Number: 2060-0170"]
[null,null,"Expiration Date: 4/30/2023"]
[null,null,"U.S. Environmental Protection Agency "]
[null,null,"Stratospheric Ozone Protection Program"]
[]
[null,null,"Class I Producer Quarterly Report (Sec 82.13)"]
[null,null,"Version 4.1"]
[null,null,"Last Updated: July 2020"]
[]
[null,null,"Instructions"]
[null,null,"Complete this form by filling in the data fields that are highlighted in blue.  Guidance on how to complete individual data fields are provided in comment bubbles. Use the arrows to navigate between the tabs. Once completed, use the 'prepare submission' button in Section 3 to generate your CSV file.  "]
[null,null,"Copying and Pasting Data: If data are pasted into this reporting form from another spreadsheet, the formatting of specific cells must be consistent with the requirements of the form in order to be "]
[null,null,"accepted into EPA’s ODS Tracking System. Refer to the Reference List to identify the valid naming scheme for specific data fields. Additionally, select \"Paste As Values\" when pasting data into the form."]
[null,null,"Report Submission: This Excel file, the generated CSV file, and all supporting attachments should be submitted to EPA through the Central Data Exchange (CDX). Refer to EPA's website for additional information on form submission:"]
{"$rows_left_out":7}
{"sheet":"Section 1","index":1,"n_rows":15,"n_cols":9,"rows_kept":15,"cut":false,"hidden":false,"merged":[[7,2,7,3]]}
[]
[null,null,"U.S. Environmental Protection Agency"]
[null,null,"Class I Producer Quarterly Report"]
[]
[null,null,"   Date Prepared:",{"$f":"TODAY()","v":"2020-07-15"}]
[]
[null,null,"Section 1: Report Identification Information "]
[null,null,"Complete all fields below.  No fields may be left blank."]
[null,null,"Company Name: ",null,null,{"$f":"IF($D$9=0,1,0)","v":1}]
[null,null,"Submission Type:",null,null,{"$f":"IF(OR(SubTSelection=Lists!C3,SubTSelection=Lists!C4),0,1)","v":1},null,null,{"$f":"IF(SubTSelection=\"\",\"\",IF(OR(SubTSelection=Lists!C3,SubTSelection=Lists!C4),\"\",\"PLEASE SELECT A VALID SUBMISSION TYPE FROM THE DROPDOWN LIST\"))","v":""}]
[null,null,"Reporting Year:",null,null,{"$f":"IF(OR($D$11=0,$D$11>Lists!$E$3),1,0)","v":1},null,null,{"$f":"IF(D11>Lists!E3,\"PLEASE CHOOSE A CURRENT OR PAST YEAR\",\"\")","v":""}]
[null,null,"Reporting Quarter:",null,null,{"$f":"IF(OR(ReportQtr=0,ReportQtr>Lists!F6),1,0)","v":1},null,null,{"$f":"IF(ReportQtr>Lists!F6,\"PLEASE SELECT A VALID QUARTER FROM THE DROPDOWN LIST\",\"\")","v":""}]
[null,null,null,"x"]
[null,null,null,{"$f":"Lists!C3","v":"Original Submission"}]
[null,null,null,{"$f":"Lists!C4","v":"Re-Submittal"}]
{"$rows_left_out":1}
{"sheet":"Section 2","index":2,"n_rows":47,"n_cols":21,"rows_kept":47,"cut":false,"hidden":false,"merged":[[8,3,8,10],[9,3,9,10]]}
[]
[null,null,null,"U.S. Environmental Protection Agency"]
[null,null,null,"Class I Producer Quarterly Report"]
[]
[null,null,null,"Company Name:",{"$f":"IF('Section 1'!D9=0,\"\",'Section 1'!D9)","v":""}]
[null,null,null,"Reporting Period:",{"$f":"IF(OR([0]!ReportYr=0,[0]!ReportQtr=0),\"\",\"Quarter \"&[0]!ReportQtr&\", \"&[0]!ReportYr)","v":""}]
[]
[null,null,null,"Section 2: Production Data"]
[null,null,null,"In the table below, enter the quantity of each class I controlled substance that was produced during the reporting period.  If no controlled substances were produced, the table may be left blank.  As a reminder, if material was produced for global lab, other essential uses (EU), second party transformation, or second party destruction, a copy of the transformation verification, destruction verification, and/or essential use certification from each company for whom material was produced must be provided to EPA along with the submission of this report."]
[null,null,null,"If copying and pasting data into the table, please refer to the Reference List and the accompanying instructions."]
[null,null,null,"Name of the Class I Chemical Produced","Global Lab","Other EU","In-House Transformation ","Second Party Transformation ","In-House Destruction ","Second Party Destruction ","Gross Production"]
[null,null,null,"Selection","kg","kg","kg","kg","kg","kg","Autopopulated"]
[null,null,null,"CFC-113",1500,0,200,100,0,0,{"$f":"IF(D13=0,\"\",E13+F13+G13+H13+I13+J13)","v":1800},null,null,null,"Active Row?","Duplicates?","Production?","Valid Chem Name","Sec 3 Inclusion - Lab/EU","Sec 3 Inclusion - 2nd Party","NegNumber?"]
[{"$f":"IF(D14=0,\"\",1)","v":""},null,null,null,null,null,null,null,null,null,"",null,null,null,{"$f":"IF(A14=\"\",\"N\",\"Y\")","v":"N"},{"$f":"IF(D14=0,0,IF(COUNTIF($D$14:$D$23,D14)>1,1,0))","v":0},{"$f":"IF(AND(D14<>0,K14=0),1,0)","v":0},{"$f":"IF(D14=0,0,IF(COUNTIF(Lists!$B$3:$B$25,D14)>0,0,1))","v":0},{"$f":"IF(E14>0,IF(COUNTIFS('Section 3'!$D$16:$D$25,D14,'Section 3'!$G$16:$G$25,Lists!$G$3)>0,0,1),IF(F14>0,IF(COUNTIFS('Section 3'!$D$16:$D$25,D14,'Section 3'!$G$16:$G$25,Lists!$G$4)>0,0,1),0))","v":0},{"$f":"IF(H14>0,IF(COUNTIFS('Section 3'!$D$16:$D$25,D14,'Section 3'!$G$16:$G$25,Lists!$G$5)>0,0,1),IF(J14>0,IF(COUNTIFS('Section 3'!$D$16:$D$25,D14,'Section 3'!$G$16:$G$25,Lists!$G$6)>0,0,1),0))","v":0},{"$f":"IF(OR(E14<0,F14<0,G14<0,H14<0,I14<0,J14<0),1,0)","v":0}]
[{"$f":"IF(D15=0,\"\",MAX($A$14:A14)+1)","v":""},null,null,null,null,null,null,null,null,null,"",null,null,null,{"$f":"IF(A15=\"\",\"N\",\"Y\")","v":"N"},{"$f":"IF(D15=0,0,IF(COUNTIF($D$14:$D$23,D15)>1,1,0))","v":0},{"$f":"IF(AND(D15<>0,K15=0),1,0)","v":0},{"$f":"IF(D15=0,0,IF(COUNTIF(Lists!$B$3:$B$25,D15)>0,0,1))","v":0},{"$f":"IF(E15>0,IF(COUNTIFS('Section 3'!$D$16:$D$25,D15,'Section 3'!$G$16:$G$25,Lists!$G$3)>0,0,1),IF(F15>0,IF(COUNTIFS('Section 3'!$D$16:$D$25,D15,'Section 3'!$G$16:$G$25,Lists!$G$4)>0,0,1),0))","v":0},{"$f":"IF(H15>0,IF(COUNTIFS('Section 3'!$D$16:$D$25,D15,'Section 3'!$G$16:$G$25,Lists!$G$5)>0,0,1),IF(J15>0,IF(COUNTIFS('Section 3'!$D$16:$D$25,D15,'Section 3'!$G$16:$G$25,Lists!$G$6)>0,0,1),0))","v":0},{"$f":"IF(OR(E15<0,F15<0,G15<0,H15<0,I15<0,J15<0),1,0)","v":0}]
{"$rows_left_out":33}
{"sheet":"Section 3","index":3,"n_rows":49,"n_cols":19,"rows_kept":49,"cut":false,"hidden":false,"merged":[[8,3,8,6],[11,3,11,6],[9,3,9,6],[10,3,10,6]]}
[]
[null,null,null,"U.S. Environmental Protection Agency"]
[null,null,null,"Class I Producer Quarterly Report"]
[]
[null,null,null,"Company Name:",{"$f":"IF('Section 1'!D9=0,\"\",'Section 1'!D9)","v":""}]
[null,null,null,"Reporting Period:",{"$f":"IF(OR([0]!ReportYr=0,[0]!ReportQtr=0),\"\",\"Quarter \"&[0]!ReportQtr&\", \"&[0]!ReportYr)","v":""}]
[]
[null,null,null,"Section 3: Shipment/Sales Data"]
[null,null,null,"Identify the recipient company(s) of the material produced for second party transformation, second party destruction, global lab, and/or other essential uses (EU), and the amount shipped to or purchased by each company during the quarter. \n"]
[null,null,null,"Note: Due to a potential time lag between the date of production and the date of shipment, it is recognized that for a given quarter the information in Section 3 may not match the information reported in Section 2 for second party transformation and second party destruction; however, it is expected that all material produced for second party transformation and second party destruction will eventually be shipped to a second party and must be reported as such in the applicable quarterly report. "]
[null,null,null,"If copying and pasting data into the table, please refer to the Reference List and the accompanying instructions."]
[null,null,null,"As a reminder, a copy of the transformation verification, destruction verification, or essential use certification from each company for whom material was produced must be provided to EPA along with the submission of this report."]
[null,null,null,"Chemical Name","Recipient Company Name","Quantity","Purpose"]
[null,null,null,"Selection","Text","kg","Selection"]
[null,null,null,"CFC-113","Company A",100,"Transformation",null,null,null,null,"ActiveRow?","Character Check","Sec 2 Inclusion - Lab/EU","Completeness check","Valid Chem Name","Valid Purpose ","Sec 2 Inclusion - 2nd Party","NegNumbers?"]
{"$rows_left_out":35}
{"sheet":"Reference List","index":4,"n_rows":14,"n_cols":7,"rows_kept":14,"cut":false,"hidden":false,"merged":[[6,2,6,6],[5,2,5,6],[8,2,8,6]]}
[]
[null,null,"U.S. Environmental Protection Agency"]
[null,null,"Class I Producer Quarterly Report"]
[null,null,"Reference List"]
[]
[null,null,"Copying and Pasting Data: If data are pasted into this reporting form from another spreadsheet, the formatting of specific cells must be consistent with the requirements of the form in order to be accepted into EPA’s ODS tracking system.  When copying and pasting data into the form, please ensure consistency with the formatting of the list below."]
[null,null,"Chemical Name List: The table below lists the valid chemical names that may be used when entering data into Section 2 and Section 3 of this form. "]
[]
[null,null,"Chemical Name"]
[null,null,"CFC-12","CFC-114","CFC-214","Halon 1211","CH3CCL3"]
[null,null,"CFC-13","CFC-115","CFC-215","Halon 1301","HBFCs"]
[null,null,"CFC-111","CFC-211","CFC-216","Halon 2402"]
[null,null,"CFC-112","CFC-212","CFC-217","CBM"]
[null,null,"CFC-113","CFC-213","Halon 1202","CCL4"]

{"sheet":"Checks","index":5,"n_rows":30,"n_cols":6,"rows_kept":30,"cut":false,"hidden":true,"merged":[]}
[]
[null,"Section","Check Description","Status (1 = Incomplete, 0 = Complete)","Error or Warning?"]
[null,"Section 1","All",{"$f":"IF(SUM('Section 1'!$F$9:$F$12)>0,1,0)","v":1},"Error"]
[null,"Section 2","Duplicates",{"$f":"IF(SUM('Section 2'!P14:P23)>0,1,0)","v":0},"Error"]
[null,"Section 2","Negative Net Production",{"$f":"IF(MIN('Section 2'!$K$14:$K$23)<0,1,0)","v":0},"Error"]
[null,"Section 2","Gross Production Check",{"$f":"IF(SUM('Section 2'!Q14:Q23)>0,1,0)","v":0},"Error"]
[null,"Section 2","Valid Chem Name",{"$f":"IF(SUM('Section 2'!R14:R23)>0,1,0)","v":0},"Error"]
[null,"Section 2","Negative Numbers?",{"$f":"IF(SUM('Section 2'!U14:U23)>0,1,0)","v":0},"Error"]
[null,"Section 2","Error Check",{"$f":"IF(SUM(D4:D8)>0,1,0)","v":0},"Error Check"]
[null,"Section 2","Filled Out?",{"$f":"IF(SUM('Section 2'!K14:K23)>0,0,1)","v":1},"Warning","Only in Data Submission code, not in navigate to section 3 code."]
[null,"Section 3","Valid Chem Name",{"$f":"IF(SUM('Section 3'!P16:P25)>0,1,0)","v":0},"Error"]
[null,"Section 3","Valid Purpose",{"$f":"IF(SUM('Section 3'!Q16:Q25)>0,1,0)","v":0},"Error"]
[null,"Section 3","Complete?",{"$f":"IF(SUM('Section 3'!O16:O25)>0,1,0)","v":0},"Error"]
[null,"Section 3","In Sec 2: also in Sec 3? - Lab/EU",{"$f":"IF(SUM('Section 2'!S14:S23)>0,1,0)","v":0},"Error"]
[null,"Section 3","Sec 3 reflected in Sec 2? - Lab/EU",{"$f":"IF(SUM('Section 3'!N16:N25)>0,1,0)","v":0},"Error"]
{"$rows_left_out":16}
{"sheet":"Lists","index":6,"n_rows":31,"n_cols":19,"rows_kept":31,"cut":false,"hidden":true,"merged":[]}
[null,null,null,null,null,null,null,null,"Variables for Data Submission"]
[null,"Chemical Name","Submission Type","Reporting Year","Current Year","Reporting Quarter","Purpose",null,null,"Row #",null,"Incorrect Capitalizations","Correct Spelling",null,"Invalid Character","Replacement Character",null,"Date for CSV Title","Form Name for CSV Title"]
[null,"CBM","Original Submission",2018,{"$f":"YEAR(TODAY())","v":2020},1,"Global Lab",null,"Sec2End",{"$f":"IF(MAX(OutputForCSV!A2:A11)=0,1,MAX(OutputForCSV!A2:A11))","v":1},null,"cfc","CFC",null,"À","A",null,{"$f":"MONTH(SubDate)&\"-\"&DAY(SubDate)&\"-\"&YEAR(SubDate)","v":"7-15-2020"},"Class I Producer"]
[null,"CCL4","Re-Submittal",2019,null,2,"Other EU",null,"Sec3Start",{"$f":"OutputForCSV!A12","v":""},null,"CCl4","CCL4",null,"Á","A"]
[null,"CFC-11",null,2020,null,3,"Transformation",null,"Sec3End",{"$f":"MAX(OutputForCSV!A12:A21)","v":0},null,"cbm","CBM",null,"Ã","A"]
[null,"CFC-12",null,2021,null,4,"Destruction",null,"MaxTempRow",{"$f":"IF(MAX(TempOutput!A2:A21)=0,1,MAX(TempOutput!A2:A21))","v":4},null,"HBFCS","HBFCs",null,"Ä","A"]
[null,"CFC-13",null,2022,null,null,null,null,"Sec3PasteRow",{"$f":"IF(J3=0,2,J3+1)","v":2},null,"ch3ccl3","CH3CCL3",null,"Â","A"]
[null,"CFC-111",null,2023,null,null,null,null,null,null,null,"CH3BR","CH3Br",null,"Å","A"]
[null,"CFC-112",null,2024,null,null,null,null,null,null,null,"HALON","Halon",null,"È","E"]
[null,"CFC-113",null,2025,null,null,null,null,null,null,null,null,null,null,"É","E"]
[null,"CFC-114",null,2026,null,null,null,null,null,null,null,null,null,null,"Ê","E"]
[null,"CFC-115",null,2027,null,null,null,null,null,null,null,null,null,null,"Ë","E"]
[null,"CFC-211",null,2028,null,null,null,null,null,null,null,null,null,null,"Ì","I"]
[null,"CFC-212",null,2029,null,null,null,null,null,null,null,null,null,null,"Í","I"]
[null,"CFC-213",null,null,null,null,null,null,null,null,null,null,null,null,"Í","I"]
{"$rows_left_out":17}
{"sheet":"OutputForCSV","index":7,"n_rows":22,"n_cols":12,"rows_kept":22,"cut":false,"hidden":true,"merged":[]}
["Row #","Entry",1,"PROD1","4",{"$f":"[0]!SubDate","v":"2020-07-15"},{"$f":"'Section 1'!D9","v":0},{"$f":"[0]!SubTSelection","v":0},{"$f":"'Section 1'!D11","v":0},{"$f":"'Section 1'!D12","v":0},null,"LastColumn"]
[{"$f":"IF(D2=\"\",\"\",ROWS($A$1:A2))","v":""},1,{"$f":"IF(D2=\"\",\"\",2)","v":""},{"$f":"IFERROR(VLOOKUP($B2,'Section 2'!$A$14:$K$23,COLUMNS('Section 2'!$A$14:D$14),0),\"\")","v":""},{"$f":"IFERROR(VLOOKUP($B2,'Section 2'!$A$14:$K$23,COLUMNS('Section 2'!$A$14:E$14),0),\"\")","v":""},{"$f":"IFERROR(VLOOKUP($B2,'Section 2'!$A$14:$K$23,COLUMNS('Section 2'!$A$14:F$14),0),\"\")","v":""},{"$f":"IFERROR(VLOOKUP($B2,'Section 2'!$A$14:$K$23,COLUMNS('Section 2'!$A$14:G$14),0),\"\")","v":""},{"$f":"IFERROR(VLOOKUP($B2,'Section 2'!$A$14:$K$23,COLUMNS('Section 2'!$A$14:H$14),0),\"\")","v":""},{"$f":"IFERROR(VLOOKUP($B2,'Section 2'!$A$14:$K$23,COLUMNS('Section 2'!$A$14:I$14),0),\"\")","v":""},{"$f":"IFERROR(VLOOKUP($B2,'Section 2'!$A$14:$K$23,COLUMNS('Section 2'!$A$14:J$14),0),\"\")","v":""},{"$f":"IFERROR(VLOOKUP($B2,'Section 2'!$A$14:$K$23,COLUMNS('Section 2'!$A$14:K$14),0),\"\")","v":""}]
[{"$f":"IF(D3=\"\",\"\",ROWS($A$1:A3))","v":""},2,{"$f":"IF(D3=\"\",\"\",2)","v":""},{"$f":"IFERROR(VLOOKUP($B3,'Section 2'!$A$14:$K$23,COLUMNS('Section 2'!$A$14:D$14),0),\"\")","v":""},{"$f":"IFERROR(VLOOKUP($B3,'Section 2'!$A$14:$K$23,COLUMNS('Section 2'!$A$14:E$14),0),\"\")","v":""},{"$f":"IFERROR(VLOOKUP($B3,'Section 2'!$A$14:$K$23,COLUMNS('Section 2'!$A$14:F$14),0),\"\")","v":""},{"$f":"IFERROR(VLOOKUP($B3,'Section 2'!$A$14:$K$23,COLUMNS('Section 2'!$A$14:G$14),0),\"\")","v":""},{"$f":"IFERROR(VLOOKUP($B3,'Section 2'!$A$14:$K$23,COLUMNS('Section 2'!$A$14:H$14),0),\"\")","v":""},{"$f":"IFERROR(VLOOKUP($B3,'Section 2'!$A$14:$K$23,COLUMNS('Section 2'!$A$14:I$14),0),\"\")","v":""},{"$f":"IFERROR(VLOOKUP($B3,'Section 2'!$A$14:$K$23,COLUMNS('Section 2'!$A$14:J$14),0),\"\")","v":""},{"$f":"IFERROR(VLOOKUP($B3,'Section 2'!$A$14:$K$23,COLUMNS('Section 2'!$A$14:K$14),0),\"\")","v":""}]
[{"$f":"IF(D4=\"\",\"\",ROWS($A$1:A4))","v":""},3,"",{"$f":"IFERROR(VLOOKUP($B4,'Section 2'!$A$14:$K$23,COLUMNS('Section 2'!$A$14:D$14),0),\"\")","v":""},{"$f":"IFERROR(VLOOKUP($B4,'Section 2'!$A$14:$K$23,COLUMNS('Section 2'!$A$14:E$14),0),\"\")","v":""},{"$f":"IFERROR(VLOOKUP($B4,'Section 2'!$A$14:$K$23,COLUMNS('Section 2'!$A$14:F$14),0),\"\")","v":""},{"$f":"IFERROR(VLOOKUP($B4,'Section 2'!$A$14:$K$23,COLUMNS('Section 2'!$A$14:G$14),0),\"\")","v":""},{"$f":"IFERROR(VLOOKUP($B4,'Section 2'!$A$14:$K$23,COLUMNS('Section 2'!$A$14:H$14),0),\"\")","v":""},{"$f":"IFERROR(VLOOKUP($B4,'Section 2'!$A$14:$K$23,COLUMNS('Section 2'!$A$14:I$14),0),\"\")","v":""},{"$f":"IFERROR(VLOOKUP($B4,'Section 2'!$A$14:$K$23,COLUMNS('Section 2'!$A$14:J$14),0),\"\")","v":""},{"$f":"IFERROR(VLOOKUP($B4,'Section 2'!$A$14:$K$23,COLUMNS('Section 2'!$A$14:K$14),0),\"\")","v":""}]
[{"$f":"IF(D5=\"\",\"\",ROWS($A$1:A5))","v":""},4,"",{"$f":"IFERROR(VLOOKUP($B5,'Section 2'!$A$14:$K$23,COLUMNS('Section 2'!$A$14:D$14),0),\"\")","v":""},{"$f":"IFERROR(VLOOKUP($B5,'Section 2'!$A$14:$K$23,COLUMNS('Section 2'!$A$14:E$14),0),\"\")","v":""},{"$f":"IFERROR(VLOOKUP($B5,'Section 2'!$A$14:$K$23,COLUMNS('Section 2'!$A$14:F$14),0),\"\")","v":""},{"$f":"IFERROR(VLOOKUP($B5,'Section 2'!$A$14:$K$23,COLUMNS('Section 2'!$A$14:G$14),0),\"\")","v":""},{"$f":"IFERROR(VLOOKUP($B5,'Section 2'!$A$14:$K$23,COLUMNS('Section 2'!$A$14:H$14),0),\"\")","v":""},{"$f":"IFERROR(VLOOKUP($B5,'Section 2'!$A$14:$K$23,COLUMNS('Section 2'!$A$14:I$14),0),\"\")","v":""},{"$f":"IFERROR(VLOOKUP($B5,'Section 2'!$A$14:$K$23,COLUMNS('Section 2'!$A$14:J$14),0),\"\")","v":""},{"$f":"IFERROR(VLOOKUP($B5,'Section 2'!$A$14:$K$23,COLUMNS('Section 2'!$A$14:K$14),0),\"\")","v":""}]
[{"$f":"IF(D6=\"\",\"\",ROWS($A$1:A6))","v":""},5,"",{"$f":"IFERROR(VLOOKUP($B6,'Section 2'!$A$14:$K$23,COLUMNS('Section 2'!$A$14:D$14),0),\"\")","v":""},{"$f":"IFERROR(VLOOKUP($B6,'Section 2'!$A$14:$K$23,COLUMNS('Section 2'!$A$14:E$14),0),\"\")","v":""},{"$f":"IFERROR(VLOOKUP($B6,'Section 2'!$A$14:$K$23,COLUMNS('Section 2'!$A$14:F$14),0),\"\")","v":""},{"$f":"IFERROR(VLOOKUP($B6,'Section 2'!$A$14:$K$23,COLUMNS('Section 2'!$A$14:G$14),0),\"\")","v":""},{"$f":"IFERROR(VLOOKUP($B6,'Section 2'!$A$14:$K$23,COLUMNS('Section 2'!$A$14:H$14),0),\"\")","v":""},{"$f":"IFERROR(VLOOKUP($B6,'Section 2'!$A$14:$K$23,COLUMNS('Section 2'!$A$14:I$14),0),\"\")","v":""},{"$f":"IFERROR(VLOOKUP($B6,'Section 2'!$A$14:$K$23,COLUMNS('Section 2'!$A$14:J$14),0),\"\")","v":""},{"$f":"IFERROR(VLOOKUP($B6,'Section 2'!$A$14:$K$23,COLUMNS('Section 2'!$A$14:K$14),0),\"\")","v":""}]
[{"$f":"IF(D7=\"\",\"\",ROWS($A$1:A7))","v":""},6,"",{"$f":"IFERROR(VLOOKUP($B7,'Section 2'!$A$14:$K$23,COLUMNS('Section 2'!$A$14:D$14),0),\"\")","v":""},{"$f":"IFERROR(VLOOKUP($B7,'Section 2'!$A$14:$K$23,COLUMNS('Section 2'!$A$14:E$14),0),\"\")","v":""},{"$f":"IFERROR(VLOOKUP($B7,'Section 2'!$A$14:$K$23,COLUMNS('Section 2'!$A$14:F$14),0),\"\")","v":""},{"$f":"IFERROR(VLOOKUP($B7,'Section 2'!$A$14:$K$23,COLUMNS('Section 2'!$A$14:G$14),0),\"\")","v":""},{"$f":"IFERROR(VLOOKUP($B7,'Section 2'!$A$14:$K$23,COLUMNS('Section 2'!$A$14:H$14),0),\"\")","v":""},{"$f":"IFERROR(VLOOKUP($B7,'Section 2'!$A$14:$K$23,COLUMNS('Section 2'!$A$14:I$14),0),\"\")","v":""},{"$f":"IFERROR(VLOOKUP($B7,'Section 2'!$A$14:$K$23,COLUMNS('Section 2'!$A$14:J$14),0),\"\")","v":""},{"$f":"IFERROR(VLOOKUP($B7,'Section 2'!$A$14:$K$23,COLUMNS('Section 2'!$A$14:K$14),0),\"\")","v":""}]
[{"$f":"IF(D8=\"\",\"\",ROWS($A$1:A8))","v":""},7,"",{"$f":"IFERROR(VLOOKUP($B8,'Section 2'!$A$14:$K$23,COLUMNS('Section 2'!$A$14:D$14),0),\"\")","v":""},{"$f":"IFERROR(VLOOKUP($B8,'Section 2'!$A$14:$K$23,COLUMNS('Section 2'!$A$14:E$14),0),\"\")","v":""},{"$f":"IFERROR(VLOOKUP($B8,'Section 2'!$A$14:$K$23,COLUMNS('Section 2'!$A$14:F$14),0),\"\")","v":""},{"$f":"IFERROR(VLOOKUP($B8,'Section 2'!$A$14:$K$23,COLUMNS('Section 2'!$A$14:G$14),0),\"\")","v":""},{"$f":"IFERROR(VLOOKUP($B8,'Section 2'!$A$14:$K$23,COLUMNS('Section 2'!$A$14:H$14),0),\"\")","v":""},{"$f":"IFERROR(VLOOKUP($B8,'Section 2'!$A$14:$K$23,COLUMNS('Section 2'!$A$14:I$14),0),\"\")","v":""},{"$f":"IFERROR(VLOOKUP($B8,'Section 2'!$A$14:$K$23,COLUMNS('Section 2'!$A$14:J$14),0),\"\")","v":""},{"$f":"IFERROR(VLOOKUP($B8,'Section 2'!$A$14:$K$23,COLUMNS('Section 2'!$A$14:K$14),0),\"\")","v":""}]
[{"$f":"IF(D9=\"\",\"\",ROWS($A$1:A9))","v":""},8,"",{"$f":"IFERROR(VLOOKUP($B9,'Section 2'!$A$14:$K$23,COLUMNS('Section 2'!$A$14:D$14),0),\"\")","v":""},{"$f":"IFERROR(VLOOKUP($B9,'Section 2'!$A$14:$K$23,COLUMNS('Section 2'!$A$14:E$14),0),\"\")","v":""},{"$f":"IFERROR(VLOOKUP($B9,'Section 2'!$A$14:$K$23,COLUMNS('Section 2'!$A$14:F$14),0),\"\")","v":""},{"$f":"IFERROR(VLOOKUP($B9,'Section 2'!$A$14:$K$23,COLUMNS('Section 2'!$A$14:G$14),0),\"\")","v":""},{"$f":"IFERROR(VLOOKUP($B9,'Section 2'!$A$14:$K$23,COLUMNS('Section 2'!$A$14:H$14),0),\"\")","v":""},{"$f":"IFERROR(VLOOKUP($B9,'Section 2'!$A$14:$K$23,COLUMNS('Section 2'!$A$14:I$14),0),\"\")","v":""},{"$f":"IFERROR(VLOOKUP($B9,'Section 2'!$A$14:$K$23,COLUMNS('Section 2'!$A$14:J$14),0),\"\")","v":""},{"$f":"IFERROR(VLOOKUP($B9,'Section 2'!$A$14:$K$23,COLUMNS('Section 2'!$A$14:K$14),0),\"\")","v":""}]
[{"$f":"IF(D10=\"\",\"\",ROWS($A$1:A10))","v":""},9,"",{"$f":"IFERROR(VLOOKUP($B10,'Section 2'!$A$14:$K$23,COLUMNS('Section 2'!$A$14:D$14),0),\"\")","v":""},{"$f":"IFERROR(VLOOKUP($B10,'Section 2'!$A$14:$K$23,COLUMNS('Section 2'!$A$14:E$14),0),\"\")","v":""},{"$f":"IFERROR(VLOOKUP($B10,'Section 2'!$A$14:$K$23,COLUMNS('Section 2'!$A$14:F$14),0),\"\")","v":""},{"$f":"IFERROR(VLOOKUP($B10,'Section 2'!$A$14:$K$23,COLUMNS('Section 2'!$A$14:G$14),0),\"\")","v":""},{"$f":"IFERROR(VLOOKUP($B10,'Section 2'!$A$14:$K$23,COLUMNS('Section 2'!$A$14:H$14),0),\"\")","v":""},{"$f":"IFERROR(VLOOKUP($B10,'Section 2'!$A$14:$K$23,COLUMNS('Section 2'!$A$14:I$14),0),\"\")","v":""},{"$f":"IFERROR(VLOOKUP($B10,'Section 2'!$A$14:$K$23,COLUMNS('Section 2'!$A$14:J$14),0),\"\")","v":""},{"$f":"IFERROR(VLOOKUP($B10,'Section 2'!$A$14:$K$23,COLUMNS('Section 2'!$A$14:K$14),0),\"\")","v":""}]
[{"$f":"IF(D11=\"\",\"\",ROWS($A$1:A11))","v":""},10,"",{"$f":"IFERROR(VLOOKUP($B11,'Section 2'!$A$14:$K$23,COLUMNS('Section 2'!$A$14:D$14),0),\"\")","v":""},{"$f":"IFERROR(VLOOKUP($B11,'Section 2'!$A$14:$K$23,COLUMNS('Section 2'!$A$14:E$14),0),\"\")","v":""},{"$f":"IFERROR(VLOOKUP($B11,'Section 2'!$A$14:$K$23,COLUMNS('Section 2'!$A$14:F$14),0),\"\")","v":""},{"$f":"IFERROR(VLOOKUP($B11,'Section 2'!$A$14:$K$23,COLUMNS('Section 2'!$A$14:G$14),0),\"\")","v":""},{"$f":"IFERROR(VLOOKUP($B11,'Section 2'!$A$14:$K$23,COLUMNS('Section 2'!$A$14:H$14),0),\"\")","v":""},{"$f":"IFERROR(VLOOKUP($B11,'Section 2'!$A$14:$K$23,COLUMNS('Section 2'!$A$14:I$14),0),\"\")","v":""},{"$f":"IFERROR(VLOOKUP($B11,'Section 2'!$A$14:$K$23,COLUMNS('Section 2'!$A$14:J$14),0),\"\")","v":""},{"$f":"IFERROR(VLOOKUP($B11,'Section 2'!$A$14:$K$23,COLUMNS('Section 2'!$A$14:K$14),0),\"\")","v":""}]
[{"$f":"IF(D12=\"\",\"\",ROWS($A$1:A12))","v":""},1,{"$f":"IF(D12=\"\",\"\",3)","v":""},{"$f":"IFERROR(VLOOKUP($B12,'Section 3'!$A$16:$G$25,COLUMNS('Section 3'!$A$16:D$16),0),\"\")","v":""},{"$f":"IFERROR(VLOOKUP($B12,'Section 3'!$A$16:$G$25,COLUMNS('Section 3'!$A$16:E$16),0),\"\")","v":""},{"$f":"IFERROR(VLOOKUP($B12,'Section 3'!$A$16:$G$25,COLUMNS('Section 3'!$A$16:F$16),0),\"\")","v":""},{"$f":"IFERROR(IF(VLOOKUP($B12,'Section 3'!$A$16:$G$25,COLUMNS('Section 3'!$A$16:G$16),0)=\"Other EU\",\"Other EU\",PROPER(VLOOKUP($B12,'Section 3'!$A$16:$G$25,COLUMNS('Section 3'!$A$16:G$16),0))),\"\")","v":""}]
[{"$f":"IF(D13=\"\",\"\",ROWS($A$1:A13))","v":""},2,{"$f":"IF(D13=\"\",\"\",3)","v":""},{"$f":"IFERROR(VLOOKUP($B13,'Section 3'!$A$16:$G$25,COLUMNS('Section 3'!$A$16:D$16),0),\"\")","v":""},{"$f":"IFERROR(VLOOKUP($B13,'Section 3'!$A$16:$G$25,COLUMNS('Section 3'!$A$16:E$16),0),\"\")","v":""},{"$f":"IFERROR(VLOOKUP($B13,'Section 3'!$A$16:$G$25,COLUMNS('Section 3'!$A$16:F$16),0),\"\")","v":""},{"$f":"IFERROR(IF(VLOOKUP($B13,'Section 3'!$A$16:$G$25,COLUMNS('Section 3'!$A$16:G$16),0)=\"Other EU\",\"Other EU\",PROPER(VLOOKUP($B13,'Section 3'!$A$16:$G$25,COLUMNS('Section 3'!$A$16:G$16),0))),\"\")","v":""}]
[{"$f":"IF(D14=\"\",\"\",ROWS($A$1:A14))","v":""},3,"",{"$f":"IFERROR(VLOOKUP($B14,'Section 3'!$A$16:$G$25,COLUMNS('Section 3'!$A$16:D$16),0),\"\")","v":""},{"$f":"IFERROR(VLOOKUP($B14,'Section 3'!$A$16:$G$25,COLUMNS('Section 3'!$A$16:E$16),0),\"\")","v":""},{"$f":"IFERROR(VLOOKUP($B14,'Section 3'!$A$16:$G$25,COLUMNS('Section 3'!$A$16:F$16),0),\"\")","v":""},{"$f":"IFERROR(IF(VLOOKUP($B14,'Section 3'!$A$16:$G$25,COLUMNS('Section 3'!$A$16:G$16),0)=\"Other EU\",\"Other EU\",PROPER(VLOOKUP($B14,'Section 3'!$A$16:$G$25,COLUMNS('Section 3'!$A$16:G$16),0))),\"\")","v":""}]
[{"$f":"IF(D15=\"\",\"\",ROWS($A$1:A15))","v":""},4,"",{"$f":"IFERROR(VLOOKUP($B15,'Section 3'!$A$16:$G$25,COLUMNS('Section 3'!$A$16:D$16),0),\"\")","v":""},{"$f":"IFERROR(VLOOKUP($B15,'Section 3'!$A$16:$G$25,COLUMNS('Section 3'!$A$16:E$16),0),\"\")","v":""},{"$f":"IFERROR(VLOOKUP($B15,'Section 3'!$A$16:$G$25,COLUMNS('Section 3'!$A$16:F$16),0),\"\")","v":""},{"$f":"IFERROR(IF(VLOOKUP($B15,'Section 3'!$A$16:$G$25,COLUMNS('Section 3'!$A$16:G$16),0)=\"Other EU\",\"Other EU\",PROPER(VLOOKUP($B15,'Section 3'!$A$16:$G$25,COLUMNS('Section 3'!$A$16:G$16),0))),\"\")","v":""}]
{"$rows_left_out":8}
{"sheet":"TempOutput","index":8,"n_rows":21,"n_cols":10,"rows_kept":21,"cut":false,"hidden":true,"merged":[]}
["MaxRow",1,"PROD1","4","2020-06-18","blah","Original Submission",2019,1]
[{"$f":"IF(OR(B2=\"\",B2=0),\"\",ROWS($A$1:A2))","v":2},2,"cfc-113",1,1,3,0,0,0,5]
[{"$f":"IF(OR(B3=\"\",B3=0),\"\",ROWS($A$1:A3))","v":3},3,"cfc-113","Company A",1,"Global Lab"]
[{"$f":"IF(OR(B4=\"\",B4=0),\"\",ROWS($A$1:A4))","v":4},3,"Cfc-113","Company B",1,"Other EU"]
[{"$f":"IF(OR(B5=\"\",B5=0),\"\",ROWS($A$1:A5))","v":""}]
[{"$f":"IF(OR(B6=\"\",B6=0),\"\",ROWS($A$1:A6))","v":""}]
[{"$f":"IF(OR(B7=\"\",B7=0),\"\",ROWS($A$1:A7))","v":""}]
[{"$f":"IF(OR(B8=\"\",B8=0),\"\",ROWS($A$1:A8))","v":""}]
[{"$f":"IF(OR(B9=\"\",B9=0),\"\",ROWS($A$1:A9))","v":""}]
[{"$f":"IF(OR(B10=\"\",B10=0),\"\",ROWS($A$1:A10))","v":""}]
[{"$f":"IF(OR(B11=\"\",B11=0),\"\",ROWS($A$1:A11))","v":""}]
[{"$f":"IF(OR(B12=\"\",B12=0),\"\",ROWS($A$1:A12))","v":""}]
[{"$f":"IF(OR(B13=\"\",B13=0),\"\",ROWS($A$1:A13))","v":""}]
[{"$f":"IF(OR(B14=\"\",B14=0),\"\",ROWS($A$1:A14))","v":""}]
[{"$f":"IF(OR(B15=\"\",B15=0),\"\",ROWS($A$1:A15))","v":""}]
{"$rows_left_out":6}