{"text_format":"1","workbook":"xlsx","n_sheets":10,"sheets":["Instructions","Section 1","Section 2","Section 3","Summary","Reference List","Lists","Checks","OutputForCSV","TempOutput"],"not_rendered":{"charts":0,"images":0,"macros":1,"external_links":0,"defined_names":43,"comments":5,"pivot_tables":0},"unopened":[],"bounds":{"document_bytes":16777216,"sheet_cells":100000,"rows_first":2000,"rows_last":500,"rows_between":2000,"halvings":0,"cell_chars":16384,"cell_head_chars":4096},"cells_cut":0,"cells_raw":0,"read":"whole","date_system":"1900"}

{"sheet":"Instructions","index":0,"n_rows":21,"n_cols":3,"rows_kept":21,"cut":false,"hidden":false,"merged":[]}
[]
[null,null,"OMB Control Number: 2060-0170"]
[null,null,"Expiration Date: 4/30/2023"]
[null,null,"U.S. Environmental Protection Agency "]
[null,null,"Stratospheric Ozone Protection Program"]
[]
[null,null,"Class II Producer Quarterly Report \n(Sec 82.24)"]
[null,null,"Version 4.1"]
[null,null,"Last Updated: July 2020"]
[]
{"$rows_left_out":12}
{"sheet":"Section 1","index":1,"n_rows":15,"n_cols":9,"rows_kept":15,"cut":false,"hidden":false,"merged":[[7,2,7,3]]}
[]
[null,null,"U.S. Environmental Protection Agency"]
[null,null,"Class II Producer Quarterly Report"]
[]
[null,null,"   Date Prepared:",{"$f":"TODAY()","v":"2020-07-15"}]
[]
[null,null,"Section 1: Report Identification Information "]
[null,null,"Complete all fields below.  No fields may be left blank."]
[null,null,"Company Name: ",null,null,{"$f":"IF($D$9=0,1,0)","v":1}]
[null,null,"Submission Type:",null,null,{"$f":"IF(OR(SubTSelection=Lists!C3,SubTSelection=Lists!C4),0,1)","v":1},null,null,{"$f":"IF(SubTSelection=\"\",\"\",IF(OR(SubTSelection=Lists!C3,SubTSelection=Lists!C4),\"\",\"PLEASE SELECT A VALID SUBMISSION TYPE FROM THE DROPDOWN LIST\"))","v":""}]
{"$rows_left_out":6}
{"sheet":"Section 2","index":2,"n_rows":62,"n_cols":20,"rows_kept":62,"cut":false,"hidden":false,"merged":[[8,3,8,10],[9,3,9,10]]}
[]
[null,null,null,"U.S. Environmental Protection Agency"]
[null,null,null,"Class II Producer Quarterly Report"]
[]
[null,null,null,"Company Name:",{"$f":"IF('Section 1'!D9=0,\"\",'Section 1'!D9)","v":""}]
[null,null,null,"Reporting Period:",{"$f":"IF(OR('Section 1'!D11=0,'Section 1'!D12=0),\"\",\"Quarter \"&'Section 1'!D12&\", \"&'Section 1'!D11)","v":""}]
[]
[null,null,null,"Section 2: Production Data"]
[null,null,null,"In the table below, enter the quantity of each class II controlled substance that was produced during the reporting period.  If no controlled substances were produced, the table may be left blank.  As a reminder, if material was produced for second party transformation or second party destruction, a copy of the transformation and/or destruction verification from each company for whom material was produced must be provided to EPA along with the submission of this report.\n"]
[null,null,null,"If copying and pasting data into the table, please refer to the Reference List and the accompanying instructions."]
{"$rows_left_out":53}
{"sheet":"Section 3","index":3,"n_rows":64,"n_cols":18,"rows_kept":64,"cut":false,"hidden":false,"merged":[[8,3,8,6],[11,3,11,6],[9,3,9,6],[10,3,10,6]]}
[]
[null,null,null,"U.S. Environmental Protection Agency"]
[null,null,null,"Class II Producer Quarterly Report"]
[]
[null,null,null,"Company Name:",{"$f":"IF('Section 1'!D9=0,\"\",'Section 1'!D9)","v":""}]
[null,null,null,"Reporting Period:",{"$f":"IF(OR('Section 1'!D11=0,'Section 1'!D12=0),\"\",\"Quarter \"&'Section 1'!D12&\", \"&'Section 1'!D11)","v":""}]
[]
[null,null,null,"Section 3: Shipment/Sales Data"]
[null,null,null,"Identify the recipient company(s) of the material produced for second party transformation or second party destruction, and the amount shipped to each company during the quarter. "]
[null,null,null,"Note: Due to a potential time lag between the date of production and the date of shipment, it is recognized that for a given quarter the information in Section 3 may not match the information reported in Section 2; however, it is expected that all material produced for second party transformation or second party destruction will eventually be shipped to a second party and must be reported as such in the applicable quarterly report."]
{"$rows_left_out":55}
{"sheet":"Summary","index":4,"n_rows":18,"n_cols":7,"rows_kept":18,"cut":false,"hidden":false,"merged":[[9,3,10,3],[8,3,8,6],[9,4,9,5]]}
[]
[null,null,null,"U.S. Environmental Protection Agency"]
[null,null,null,"Class II Producer Quarterly Report"]
[]
[null,null,null,"Company Name:",{"$f":"IF('Section 1'!D9=0,\"\",'Section 1'!D9)","v":""}]
[null,null,null,"Reporting Period:",{"$f":"IF(OR('Section 1'!D11=0,'Section 1'!D12=0),\"\",\"Quarter \"&'Section 1'!D12&\", \"&'Section 1'!D11)","v":""}]
[]
[null,null,null,"Allowance Summary"]
[null,null,null,"The values in the table below are calculated based on data entered in Section 2 for chemicals that have allowances.  If the totals appear to be incorrect, please return to Section 2 to review your data."]
[null,null,null,"Chemical Name","Allowances Expended (kg)"]
{"$rows_left_out":9}
{"sheet":"Reference List","index":5,"n_rows":18,"n_cols":7,"rows_kept":18,"cut":false,"hidden":false,"merged":[[6,2,6,6],[5,2,5,6],[8,2,8,6]]}
[]
[null,null,"U.S. Environmental Protection Agency"]
[null,null,"Class II Producer Quarterly Report"]
[null,null,"Reference List"]
[]
[null,null,"Copying and Pasting Data: If data are pasted into this reporting form from another spreadsheet, the formatting of specific cells must be consistent with the requirements of the form in order to be accepted into EPA’s ODS tracking system.  When copying and pasting data into the form, please ensure consistency with the formatting of the list below."]
[null,null,"Chemical Name List: The table below lists the valid chemical names that may be used when entering data into Section 2 and Section 3 of this form. "]
[]
[null,null,"Chemical Name"]
[null,null,"HCFC-21","HCFC-124a","HCFC-142b","HCFC-231 ","HCFC-251"]
{"$rows_left_out":9}
{"sheet":"Lists","index":6,"n_rows":44,"n_cols":24,"rows_kept":44,"cut":false,"hidden":true,"merged":[]}
[null,null,null,null,null,null,null,null,null,null,null,null,null,null,null,null,null,null,null,null,null,null,"Variables for Data Submission"]
[null,"Chemical Name","Submission Type","Reporting Year","Current Year","Reporting Quarter","Purpose","Date for CSV Title","Form Name for CSV Title",null,"Incorrect Capitalizations","Correct Capitalization",null,"Invalid Character","Replacement Character",null,"Form Type","Form Code",null,"Selected?","Chem List with Allowances",null,null,"Row #"]
[null,"HCFC-21","Original Submission",2018,{"$f":"YEAR(TODAY())","v":2020},1,"Transformation",{"$f":"MONTH(SubDate)&\"-\"&DAY(SubDate)&\"-\"&YEAR(SubDate)","v":"7-15-2020"},"Class II Producer",null,"hcfc","HCFC",null,"À","A",null,"Class I Producer","PROD1",null,{"$f":"IF(COUNTIF('Section 2'!$D$14:$D$23,U3)>0,1,0)","v":0},"HCFC-123",null,"Sec2End",{"$f":"IF(MAX(OutputForCSV!A2:A11)=0,1,MAX(OutputForCSV!A2:A11))","v":1}]
[null,"HCFC-22","Re-Submittal",2019,null,2,"Destruction",null,null,null,"123A","123a",null,"Á","A",null,"MeBr Producer","PROD3",null,{"$f":"IF(COUNTIF('Section 2'!$D$14:$D$23,U4)>0,MAX($T$3:T3)+1,0)","v":0},"HCFC-124",null,"Sec3Start",{"$f":"OutputForCSV!A12","v":""}]
[null,"HCFC-31",null,2020,null,3,null,null,null,null,"123B","123b",null,"Ã","A",null,"Class II Producer","PROD2",null,null,null,null,"Sec3End",{"$f":"MAX(OutputForCSV!A12:A21)","v":0}]
[null,"HCFC-121",null,2021,null,4,null,null,null,null,"124A","124a",null,"Ä","A",null,"Class I Importer","IMPT1",null,null,null,null,"MaxTempRow",{"$f":"IF(MAX(TempOutput!A2:A21)=0,1,MAX(TempOutput!A2:A21))","v":4}]
[null,"HCFC-122",null,2022,null,null,null,null,null,null,"132B","132b",null,"Â","A",null,"MeBr Importer","IMPT3",null,null,null,null,"Sec3PasteRow",{"$f":"IF(X3=0,2,X3+1)","v":2}]
[null,"HCFC-123",null,2023,null,null,null,null,null,null,"133A","133a",null,"Å","A",null,"Class II Importer","IMPT2"]
[null,"HCFC-123a",null,2024,null,null,null,null,null,null,"141A","141a",null,"È","E",null,"Class I Exporter","EXPT1"]
[null,"HCFC-123b",null,2025,null,null,null,null,null,null,"141B","141b",null,"É","E",null,"MeBr Exporter","EXPT3"]
{"$rows_left_out":35}
{"sheet":"Checks","index":7,"n_rows":25,"n_cols":4,"rows_kept":25,"cut":false,"hidden":true,"merged":[]}
[]
[null,"Section","Check Description","Status (1 = Incomplete, 0 = Complete)"]
[null,"Section 1","All",{"$f":"IF(SUM('Section 1'!F9:F12)>0,1,0)","v":1}]
[null,"Section 2","Duplicates",{"$f":"IF(SUM('Section 2'!P14:P23)>0,1,0)","v":0}]
[null,"Section 2","Negative Net Production",{"$f":"IF(MIN('Section 2'!$K$14:$K$23)<0,1,0)","v":0}]
[null,"Section 2","Gross Production Check",{"$f":"IF(SUM('Section 2'!Q14:Q23)>0,1,0)","v":0}]
[null,"Section 2","Valid Chem Name",{"$f":"IF(SUM('Section 2'!S14:S23)>0,1,0)","v":0}]
[null,"Section 2","Negative Numbers?",{"$f":"IF(SUM('Section 2'!T14:T23)>0,1,0)","v":0}]
[null,"Section 2","Error Check",{"$f":"IF(SUM(D4:D8)>0,1,0)","v":0}]
[null,"Section 2","Filled Out?",{"$f":"IF(SUM('Section 2'!E14:E23)>0,0,1)","v":1}]
{"$rows_left_out":16}
{"sheet":"OutputForCSV","index":8,"n_rows":22,"n_cols":12,"rows_kept":22,"cut":false,"hidden":true,"merged":[]}
["Row #","Entry",1,"PROD2","4",{"$f":"'Section 1'!D5","v":"2020-07-15"},{"$f":"'Section 1'!D9","v":0},{"$f":"'Section 1'!D10","v":0},{"$f":"'Section 1'!D11","v":0},{"$f":"'Section 1'!D12","v":0},null,"LastColumn"]
[{"$f":"IF(D2=\"\",\"\",ROWS($A$1:A2))","v":""},1,{"$f":"IF(D2=\"\",\"\",2)","v":""},{"$f":"IFERROR(VLOOKUP($B2,'Section 2'!$A$14:$K$23,COLUMNS('Section 2'!$A$14:D$14),0),\"\")","v":""},{"$f":"IFERROR(VLOOKUP($B2,'Section 2'!$A$14:$K$23,COLUMNS('Section 2'!$A$14:E$14),0),\"\")","v":""},{"$f":"IFERROR(VLOOKUP($B2,'Section 2'!$A$14:$K$23,COLUMNS('Section 2'!$A$14:F$14),0),\"\")","v":""},{"$f":"IFERROR(VLOOKUP($B2,'Section 2'!$A$14:$K$23,COLUMNS('Section 2'!$A$14:G$14),0),\"\")","v":""},{"$f":"IFERROR(VLOOKUP($B2,'Section 2'!$A$14:$K$23,COLUMNS('Section 2'!$A$14:H$14),0),\"\")","v":""},{"$f":"IFERROR(VLOOKUP($B2,'Section 2'!$A$14:$K$23,COLUMNS('Section 2'!$A$14:I$14),0),\"\")","v":""},{"$f":"IFERROR(VLOOKUP($B2,'Section 2'!$A$14:$K$23,COLUMNS('Section 2'!$A$14:J$14),0),\"\")","v":""}]
[{"$f":"IF(D3=\"\",\"\",ROWS($A$1:A3))","v":""},2,{"$f":"IF(D3=\"\",\"\",2)","v":""},{"$f":"IFERROR(VLOOKUP($B3,'Section 2'!$A$14:$K$23,COLUMNS('Section 2'!$A$14:D$14),0),\"\")","v":""},{"$f":"IFERROR(VLOOKUP($B3,'Section 2'!$A$14:$K$23,COLUMNS('Section 2'!$A$14:E$14),0),\"\")","v":""},{"$f":"IFERROR(VLOOKUP($B3,'Section 2'!$A$14:$K$23,COLUMNS('Section 2'!$A$14:F$14),0),\"\")","v":""},{"$f":"IFERROR(VLOOKUP($B3,'Section 2'!$A$14:$K$23,COLUMNS('Section 2'!$A$14:G$14),0),\"\")","v":""},{"$f":"IFERROR(VLOOKUP($B3,'Section 2'!$A$14:$K$23,COLUMNS('Section 2'!$A$14:H$14),0),\"\")","v":""},{"$f":"IFERROR(VLOOKUP($B3,'Section 2'!$A$14:$K$23,COLUMNS('Section 2'!$A$14:I$14),0),\"\")","v":""},{"$f":"IFERROR(VLOOKUP($B3,'Section 2'!$A$14:$K$23,COLUMNS('Section 2'!$A$14:J$14),0),\"\")","v":""}]
[{"$f":"IF(D4=\"\",\"\",ROWS($A$1:A4))","v":""},3,"",{"$f":"IFERROR(VLOOKUP($B4,'Section 2'!$A$14:$K$23,COLUMNS('Section 2'!$A$14:D$14),0),\"\")","v":""},{"$f":"IFERROR(VLOOKUP($B4,'Section 2'!$A$14:$K$23,COLUMNS('Section 2'!$A$14:E$14),0),\"\")","v":""},{"$f":"IFERROR(VLOOKUP($B4,'Section 2'!$A$14:$K$23,COLUMNS('Section 2'!$A$14:F$14),0),\"\")","v":""},{"$f":"IFERROR(VLOOKUP($B4,'Section 2'!$A$14:$K$23,COLUMNS('Section 2'!$A$14:G$14),0),\"\")","v":""},{"$f":"IFERROR(VLOOKUP($B4,'Section 2'!$A$14:$K$23,COLUMNS('Section 2'!$A$14:H$14),0),\"\")","v":""},{"$f":"IFERROR(VLOOKUP($B4,'Section 2'!$A$14:$K$23,COLUMNS('Section 2'!$A$14:I$14),0),\"\")","v":""},{"$f":"IFERROR(VLOOKUP($B4,'Section 2'!$A$14:$K$23,COLUMNS('Section 2'!$A$14:J$14),0),\"\")","v":""}]
[{"$f":"IF(D5=\"\",\"\",ROWS($A$1:A5))","v":""},4,"",{"$f":"IFERROR(VLOOKUP($B5,'Section 2'!$A$14:$K$23,COLUMNS('Section 2'!$A$14:D$14),0),\"\")","v":""},{"$f":"IFERROR(VLOOKUP($B5,'Section 2'!$A$14:$K$23,COLUMNS('Section 2'!$A$14:E$14),0),\"\")","v":""},{"$f":"IFERROR(VLOOKUP($B5,'Section 2'!$A$14:$K$23,COLUMNS('Section 2'!$A$14:F$14),0),\"\")","v":""},{"$f":"IFERROR(VLOOKUP($B5,'Section 2'!$A$14:$K$23,COLUMNS('Section 2'!$A$14:G$14),0),\"\")","v":""},{"$f":"IFERROR(VLOOKUP($B5,'Section 2'!$A$14:$K$23,COLUMNS('Section 2'!$A$14:H$14),0),\"\")","v":""},{"$f":"IFERROR(VLOOKUP($B5,'Section 2'!$A$14:$K$23,COLUMNS('Section 2'!$A$14:I$14),0),\"\")","v":""},{"$f":"IFERROR(VLOOKUP($B5,'Section 2'!$A$14:$K$23,COLUMNS('Section 2'!$A$14:J$14),0),\"\")","v":""}]
[{"$f":"IF(D6=\"\",\"\",ROWS($A$1:A6))","v":""},5,"",{"$f":"IFERROR(VLOOKUP($B6,'Section 2'!$A$14:$K$23,COLUMNS('Section 2'!$A$14:D$14),0),\"\")","v":""},{"$f":"IFERROR(VLOOKUP($B6,'Section 2'!$A$14:$K$23,COLUMNS('Section 2'!$A$14:E$14),0),\"\")","v":""},{"$f":"IFERROR(VLOOKUP($B6,'Section 2'!$A$14:$K$23,COLUMNS('Section 2'!$A$14:F$14),0),\"\")","v":""},{"$f":"IFERROR(VLOOKUP($B6,'Section 2'!$A$14:$K$23,COLUMNS('Section 2'!$A$14:G$14),0),\"\")","v":""},{"$f":"IFERROR(VLOOKUP($B6,'Section 2'!$A$14:$K$23,COLUMNS('Section 2'!$A$14:H$14),0),\"\")","v":""},{"$f":"IFERROR(VLOOKUP($B6,'Section 2'!$A$14:$K$23,COLUMNS('Section 2'!$A$14:I$14),0),\"\")","v":""},{"$f":"IFERROR(VLOOKUP($B6,'Section 2'!$A$14:$K$23,COLUMNS('Section 2'!$A$14:J$14),0),\"\")","v":""}]
[{"$f":"IF(D7=\"\",\"\",ROWS($A$1:A7))","v":""},6,"",{"$f":"IFERROR(VLOOKUP($B7,'Section 2'!$A$14:$K$23,COLUMNS('Section 2'!$A$14:D$14),0),\"\")","v":""},{"$f":"IFERROR(VLOOKUP($B7,'Section 2'!$A$14:$K$23,COLUMNS('Section 2'!$A$14:E$14),0),\"\")","v":""},{"$f":"IFERROR(VLOOKUP($B7,'Section 2'!$A$14:$K$23,COLUMNS('Section 2'!$A$14:F$14),0),\"\")","v":""},{"$f":"IFERROR(VLOOKUP($B7,'Section 2'!$A$14:$K$23,COLUMNS('Section 2'!$A$14:G$14),0),\"\")","v":""},{"$f":"IFERROR(VLOOKUP($B7,'Section 2'!$A$14:$K$23,COLUMNS('Section 2'!$A$14:H$14),0),\"\")","v":""},{"$f":"IFERROR(VLOOKUP($B7,'Section 2'!$A$14:$K$23,COLUMNS('Section 2'!$A$14:I$14),0),\"\")","v":""},{"$f":"IFERROR(VLOOKUP($B7,'Section 2'!$A$14:$K$23,COLUMNS('Section 2'!$A$14:J$14),0),\"\")","v":""}]
[{"$f":"IF(D8=\"\",\"\",ROWS($A$1:A8))","v":""},7,"",{"$f":"IFERROR(VLOOKUP($B8,'Section 2'!$A$14:$K$23,COLUMNS('Section 2'!$A$14:D$14),0),\"\")","v":""},{"$f":"IFERROR(VLOOKUP($B8,'Section 2'!$A$14:$K$23,COLUMNS('Section 2'!$A$14:E$14),0),\"\")","v":""},{"$f":"IFERROR(VLOOKUP($B8,'Section 2'!$A$14:$K$23,COLUMNS('Section 2'!$A$14:F$14),0),\"\")","v":""},{"$f":"IFERROR(VLOOKUP($B8,'Section 2'!$A$14:$K$23,COLUMNS('Section 2'!$A$14:G$14),0),\"\")","v":""},{"$f":"IFERROR(VLOOKUP($B8,'Section 2'!$A$14:$K$23,COLUMNS('Section 2'!$A$14:H$14),0),\"\")","v":""},{"$f":"IFERROR(VLOOKUP($B8,'Section 2'!$A$14:$K$23,COLUMNS('Section 2'!$A$14:I$14),0),\"\")","v":""},{"$f":"IFERROR(VLOOKUP($B8,'Section 2'!$A$14:$K$23,COLUMNS('Section 2'!$A$14:J$14),0),\"\")","v":""}]
[{"$f":"IF(D9=\"\",\"\",ROWS($A$1:A9))","v":""},8,"",{"$f":"IFERROR(VLOOKUP($B9,'Section 2'!$A$14:$K$23,COLUMNS('Section 2'!$A$14:D$14),0),\"\")","v":""},{"$f":"IFERROR(VLOOKUP($B9,'Section 2'!$A$14:$K$23,COLUMNS('Section 2'!$A$14:E$14),0),\"\")","v":""},{"$f":"IFERROR(VLOOKUP($B9,'Section 2'!$A$14:$K$23,COLUMNS('Section 2'!$A$14:F$14),0),\"\")","v":""},{"$f":"IFERROR(VLOOKUP($B9,'Section 2'!$A$14:$K$23,COLUMNS('Section 2'!$A$14:G$14),0),\"\")","v":""},{"$f":"IFERROR(VLOOKUP($B9,'Section 2'!$A$14:$K$23,COLUMNS('Section 2'!$A$14:H$14),0),\"\")","v":""},{"$f":"IFERROR(VLOOKUP($B9,'Section 2'!$A$14:$K$23,COLUMNS('Section 2'!$A$14:I$14),0),\"\")","v":""},{"$f":"IFERROR(VLOOKUP($B9,'Section 2'!$A$14:$K$23,COLUMNS('Section 2'!$A$14:J$14),0),\"\")","v":""}]
[{"$f":"IF(D10=\"\",\"\",ROWS($A$1:A10))","v":""},9,"",{"$f":"IFERROR(VLOOKUP($B10,'Section 2'!$A$14:$K$23,COLUMNS('Section 2'!$A$14:D$14),0),\"\")","v":""},{"$f":"IFERROR(VLOOKUP($B10,'Section 2'!$A$14:$K$23,COLUMNS('Section 2'!$A$14:E$14),0),\"\")","v":""},{"$f":"IFERROR(VLOOKUP($B10,'Section 2'!$A$14:$K$23,COLUMNS('Section 2'!$A$14:F$14),0),\"\")","v":""},{"$f":"IFERROR(VLOOKUP($B10,'Section 2'!$A$14:$K$23,COLUMNS('Section 2'!$A$14:G$14),0),\"\")","v":""},{"$f":"IFERROR(VLOOKUP($B10,'Section 2'!$A$14:$K$23,COLUMNS('Section 2'!$A$14:H$14),0),\"\")","v":""},{"$f":"IFERROR(VLOOKUP($B10,'Section 2'!$A$14:$K$23,COLUMNS('Section 2'!$A$14:I$14),0),\"\")","v":""},{"$f":"IFERROR(VLOOKUP($B10,'Section 2'!$A$14:$K$23,COLUMNS('Section 2'!$A$14:J$14),0),\"\")","v":""}]
{"$rows_left_out":13}
{"sheet":"TempOutput","index":9,"n_rows":510,"n_cols":9,"rows_kept":510,"cut":false,"hidden":true,"merged":[]}
["MaxRow",1,"PROD2","4","2020-06-23","blah","Original Submission",2019,1]
[{"$f":"IF(OR(B2=\"\",B2=0),\"\",ROWS($A$1:A2))","v":2},2,"hcfc-124",2,0,2,0,0,0]
[{"$f":"IF(OR(B3=\"\",B3=0),\"\",ROWS($A$1:A3))","v":3},2,"hcfc-142B",2,2,0,0,0,0]
[{"$f":"IF(OR(B4=\"\",B4=0),\"\",ROWS($A$1:A4))","v":4},3,"hcfc-124","Company A",1,"Transformation"]
[{"$f":"IF(OR(B5=\"\",B5=0),\"\",ROWS($A$1:A5))","v":""}]
[{"$f":"IF(OR(B6=\"\",B6=0),\"\",ROWS($A$1:A6))","v":""}]
[{"$f":"IF(OR(B7=\"\",B7=0),\"\",ROWS($A$1:A7))","v":""}]
[{"$f":"IF(OR(B8=\"\",B8=0),\"\",ROWS($A$1:A8))","v":""}]
[{"$f":"IF(OR(B9=\"\",B9=0),\"\",ROWS($A$1:A9))","v":""}]
[{"$f":"IF(OR(B10=\"\",B10=0),\"\",ROWS($A$1:A10))","v":""}]
{"$rows_left_out":500}