{"text_format":"1","workbook":"xlsx","n_sheets":10,"sheets":["Benefits_Interface","Canopy Cover Benefit","Green Roof Benefit","EnergySavings by State","AvoidedEmissions_UCTrees","ElectricityPriceByState","BenefitPerTon_Regression","SCC_Regression","GDP Implicit Price Deflator","AVERT_2017"],"not_rendered":{"charts":0,"images":0,"macros":1,"external_links":1,"defined_names":93,"comments":3,"pivot_tables":0},"unopened":[],"bounds":{"document_bytes":16777216,"sheet_cells":100000,"rows_first":2000,"rows_last":500,"rows_between":2000,"halvings":0,"cell_chars":16384,"cell_head_chars":4096},"cells_cut":0,"cells_raw":0,"read":"whole","date_system":"1900"}

{"sheet":"Benefits_Interface","index":0,"n_rows":158,"n_cols":16,"rows_kept":158,"cut":false,"hidden":false,"merged":[[1,2,2,11],[3,1,3,11],[4,2,4,11],[11,4,11,7],[12,4,12,7],[64,4,64,5],[64,7,64,8],[74,4,74,5],[74,7,74,8],[79,7,79,8],[80,4,80,5],[80,7,80,8],[100,4,100,5],[100,7,100,8],[65,4,66,5],[65,7,65,8],[66,7,66,8],[72,4,72,5],[72,7,72,8],[73,4,73,5],[73,7,73,8],[108,4,108,5],[108,7,108,8],[109,4,109,5],[109,7,109,8],[110,4,110,5],[110,7,110,8],[101,4,101,5],[101,7,101,8],[102,4,102,5],[102,7,102,8],[107,4,107,5],[107,7,107,8],[114,4,114,5],[114,7,114,8],[115,4,115,5],[115,7,115,8],[116,4,116,5],[116,7,116,8],[111,4,111,5],[111,7,111,8],[112,4,112,5],[112,7,112,8],[113,4,113,5],[113,7,113,8],[120,4,120,5],[120,7,120,8],[121,4,121,5],[121,7,121,8],[122,4,122,5],[122,7,122,8],[117,4,117,5],[117,7,117,8],[118,4,118,5],[118,7,118,8],[119,4,119,5],[119,7,119,8],[126,4,126,5],[126,7,126,8],[127,4,127,5],[127,7,127,8],[128,4,128,5],[128,7,128,8],[123,4,123,5],[123,7,123,8],[124,4,124,5],[124,7,124,8],[125,4,125,5],[125,7,125,8],[132,4,132,5],[132,7,132,8],[133,4,133,5],[133,7,133,8],[134,4,134,5],[134,7,134,8],[129,4,129,5],[129,7,129,8],[130,4,130,5],[130,7,130,8],[131,4,131,5],[131,7,131,8],[138,4,138,5],[138,7,138,8],[139,4,139,5],[139,7,139,8],[140,4,140,5],[140,7,140,8],[135,4,135,5],[135,7,135,8],[136,4,136,5],[136,7,136,8],[137,4,137,5],[137,7,137,8],[146,4,146,5],[146,7,146,8],[147,4,147,5],[147,7,147,8],[148,4,148,5],[148,7,148,8],[141,4,141,5],[141,7,141,8],[142,4,142,5],[142,7,142,8],[143,4,143,5],[143,7,143,8],[154,7,154,8],[155,4,156,5],[155,7,155,8],[149,4,149,5],[151,4,151,5],[151,7,151,8],[152,4,152,5],[152,7,152,8],[153,4,153,5],[153,7,153,8]]}
[]
[null,null,"Benefit Calculations"]
[]
[null,"ScenCompare will calculate benefits related to outcomes targeted by a management practice (direct benefits) and ",null,null,null,null,null,null,null,null,null,null,null,null,null,"DROP DOWN LISTS - DO NOT REMOVE!"]
[null,null,"benefits that arise from other outcomes of implementing the management practice selected to meet the target (co-benefits).",null,null,null,null,null,null,null,null,null,null,null,null,"Daily"]
[null,"1. Study Characteristics",null,null,null,null,null,null,null,null,null,null,null,null,null,"Monthly"]
[null,null,null,null,null,null,null,null,null,null,null,null,null,null,null,"Annually"]
[null,"1A. ","Specify the year of the analysis.",null,"Specify the dollar year in which you'd like to evaluate benefits."]
[null,null,2017,null,"$2017"]
[]
{"$rows_left_out":149}
{"sheet":"Canopy Cover Benefit","index":1,"n_rows":62,"n_cols":9,"rows_kept":62,"cut":false,"hidden":false,"merged":[]}
["Benefits from Canopy Cover -- ILLUSTRATIVE SAMPLE CALCULATIONS ** NOT TO BE DISTRIBUTED BROADLY"]
[]
[null,"Carbon Sequestration Benefits from Canopy Cover"]
[null,"Increase in acres canopy cover (acres)",{"$f":"Benefits_Interface!$G$147","v":59.16}]
[null,"Rate of carbon sequestration (metric ton/acre)",0.77,"https://www.epa.gov/energy/greenhouse-gases-equivalencies-calculator-calculations-and-references#_ftn1"]
[null,"Total carbon sequestration (metric tons)",{"$f":"C4*C5","v":45.553199999999997}]
[null,"Social cost of carbon ($/metric ton) (global; 2017$)",{"$f":"SCC_Regression!B5*('GDP Implicit Price Deflator'!BU8/'GDP Implicit Price Deflator'!BK8)","v":44.855918167279725}]
[null,"Social cost of carbon ($/metric ton) (domestic; 2017$)",{"$f":"SCC_Regression!C5*('GDP Implicit Price Deflator'!BU8/'GDP Implicit Price Deflator'!BT8)","v":6.3905996264556055}]
[null,"Annual benefits, global (2017$)",{"$f":"C7*C6","v":2043.3306114577267}]
[null,"Annual benefits, domestic (2017$)",{"$f":"C6*C8","v":291.11226290385747}]
{"$rows_left_out":53}
{"sheet":"Green Roof Benefit","index":2,"n_rows":32,"n_cols":9,"rows_kept":32,"cut":false,"hidden":false,"merged":[[3,12,3,15],[4,12,4,15]]}
["Green roof calculator outputs",null,null,null,"Regional Emission rates (AVERT) - Uniform EE (2017)"]
["Electrical savings (kWh)",{"$f":"Benefits_Interface!$G$153","v":100000},null,null,"Region","SO2 (lbs/MWh)","NOx (lbs/MWh)","CO2 (tons/MWh)","PM2.5 (lbs/MWh)"]
["Electrical savings (MWh)",{"$f":"B2/1000","v":100},null,null,"Northeast",{"$f":"AVERT_2017!E29","v":0.28309122537265902},{"$f":"AVERT_2017!K16","v":0.43103012510669703},{"$f":"AVERT_2017!E16*0.0005","v":0.57013693872728743},{"$f":"AVERT_2017!K29","v":4.5166520502734703E-2}]
[null,null,null,null,"Great Lakes/Mid-Atlantic",{"$f":"AVERT_2017!E30","v":1.2549787840850701},{"$f":"AVERT_2017!K17","v":0.98590615073606291},{"$f":"AVERT_2017!E17*0.0005","v":0.85447029800999219},{"$f":"AVERT_2017!K30","v":0.21038508533316702}]
["Avoided Pollutants",null,null,null,"Southeast",{"$f":"AVERT_2017!E31","v":0.788492001199248},{"$f":"AVERT_2017!K18","v":0.93052642990953249},{"$f":"AVERT_2017!E18*0.0005","v":0.76703788068093992},{"$f":"AVERT_2017!K31","v":0.10451385980316499}]
["SO2 (lbs): ",{"$f":"$B$3*INDEX(F$3:F$12,MATCH(Benefits_Interface!$G$154,'Green Roof Benefit'!$E$3:$E$12,0))","v":125.49787840850701},null,null,"Lower Midwest",{"$f":"AVERT_2017!E32","v":1.8776048387896001},{"$f":"AVERT_2017!K19","v":1.202439471233435},{"$f":"AVERT_2017!E19*0.0005","v":0.92757905597601154},{"$f":"AVERT_2017!K32","v":9.891248930513985E-2}]
["NO2 (lbs):",{"$f":"$B$3*INDEX(G$3:G$12,MATCH(Benefits_Interface!$G$154,'Green Roof Benefit'!$E$3:$E$12,0))","v":98.590615073606287},null,null,"Upper Midwest",{"$f":"AVERT_2017!E33","v":2.02860038682077},{"$f":"AVERT_2017!K20","v":1.3807234878788051},{"$f":"AVERT_2017!E20*0.0005","v":1.0045022619890651},{"$f":"AVERT_2017!K33","v":9.855173382644114E-2}]
["CO2 (short tons):",{"$f":"$B$3*INDEX(H$3:H$12,MATCH(Benefits_Interface!$G$154,'Green Roof Benefit'!$E$3:$E$12,0))","v":85.447029800999218},null,null,"Rocky Mountains",{"$f":"AVERT_2017!E34","v":0.60044089608265905},{"$f":"AVERT_2017!K21","v":1.42313617262887},{"$f":"AVERT_2017!E21*0.0005","v":0.86893085056215547},{"$f":"AVERT_2017!K34","v":3.6387188497506745E-2}]
["PM2.5 (lbs):",{"$f":"$B$3*INDEX(I$3:I$12,MATCH(Benefits_Interface!$G$154,'Green Roof Benefit'!$E$3:$E$12,0))","v":21.038508533316701},null,null,"Texas",{"$f":"AVERT_2017!E35","v":1.3172687069506199},{"$f":"AVERT_2017!K22","v":0.65331796964456301},{"$f":"AVERT_2017!E22*0.0005","v":0.69755844427000091},{"$f":"AVERT_2017!K35","v":7.633690172792984E-2}]
[null,null,null,null,"Southwest",{"$f":"AVERT_2017!E36","v":0.2431762626984065},{"$f":"AVERT_2017!K23","v":0.98662668042475943},{"$f":"AVERT_2017!E23*0.0005","v":0.68242104085324151},{"$f":"AVERT_2017!K36","v":7.5400756039452455E-2}]
{"$rows_left_out":23}
{"sheet":"EnergySavings by State","index":3,"n_rows":53,"n_cols":2,"rows_kept":53,"cut":false,"hidden":false,"merged":[]}
["State","Energy Savings\n$/ha tree cover (2009$)"]
["Alabama",204.79328030026295]
["Arkansas",263.21213460639615]
["Arizona",692.10025693720843]
["California",407.99730384889978]
["Colorado",148.4335766526533]
["Connecticut",402.20514793396421]
["District of Columbia",1811.4282245615602]
["Delaware",1183.1739727516524]
["Florida",627.75152643371541]
{"$rows_left_out":44}
{"sheet":"AvoidedEmissions_UCTrees","index":4,"n_rows":50,"n_cols":12,"rows_kept":50,"cut":false,"hidden":false,"merged":[[0,0,0,4],[0,7,0,11]]}
["Avoided Emissions from Power Plants (Metric Tons)\nNowak et al. (2017)",null,null,null,null,"Nowak et al. (2012)",null,"Avoided Emissions from Power Plants \n(Metric Tons/ha)"]
["State","NOx","SO2","PM2.5","CO2","UC tree cover (ha)",null,"State","NOx","SO2","PM2.5","CO2"]
["AL",593,3164,225,833000,701000,null,"AL",{"$f":"B3/F3","v":8.4593437945791725E-4},{"$f":"C3/F3","v":4.5135520684736093E-3},{"$f":"D3/F3","v":3.2097004279600568E-4},{"$f":"E3/F3","v":1.18830242510699}]
["AR",614,1244,16,549000,259000,null,"AR",{"$f":"B4/F4","v":2.3706563706563707E-3},{"$f":"C4/F4","v":4.8030888030888034E-3},{"$f":"D4/F4","v":6.1776061776061777E-5},{"$f":"E4/F4","v":2.1196911196911197}]
["AZ",1356,742,70,1237000,277000,null,"AZ",4.8953068592057763E-3,2.6787003610108302E-3,2.527075812274368E-4,4.465703971119134]
["CA",262,184,390,728000,870000,null,"CA",3.0114942528735634E-4,2.1149425287356321E-4,4.4827586206896552E-4,0.83678160919540234]
["CO",249,187,3,171000,130000,null,"CO",1.9153846153846155E-3,1.4384615384615384E-3,2.3076923076923076E-5,1.3153846153846154]
["CT",201,207,56,318000,337000,null,"CT",5.9643916913946593E-4,6.1424332344213646E-4,1.6617210682492583E-4,0.94362017804154308]
["DE",333,1167,39,292000,32000,null,"DE",1.0406250000000001E-2,3.6468750000000001E-2,1.21875E-3,9.125]
["FL",2709,5810,769,3157000,813000,null,"FL",3.3321033210332103E-3,7.1463714637146373E-3,9.4587945879458799E-4,3.8831488314883149]
{"$rows_left_out":41}
{"sheet":"ElectricityPriceByState","index":5,"n_rows":68,"n_cols":19,"rows_kept":68,"cut":false,"hidden":false,"merged":[[4,0,5,0],[4,1,4,18]]}
["Average retail price of electricity (cents per kilowatthour)"]
["https://www.eia.gov/electricity/data/browser/#/topic/7?agg=1,0&geo=vvvvvvvvvvvvo&endsec=8&freq=A&start=2001&end=2018&ctype=linechart&ltype=pin&rtype=s&maptype=0&rse=0&pin="]
["Source: U.S. Energy Information Administration"]
[]
["State/Region","Average retail price of residential electricity (cents per kilowatthour)"]
[null,2001,2002,2003,2004,2005,2006,2007,2008,2009,2010,2011,2012,2013,2014,2015,2016,2017,2018]
["United States",8.58,8.44,8.7200000000000006,8.9499999999999993,9.4499999999999993,10.4,10.65,11.26,11.51,11.54,11.72,11.88,12.13,12.52,12.65,12.55,12.89,12.87]
["New England",12.08,11.23,11.68,11.91,13.44,15.98,16.7,17.649999999999999,17.48,16.23,15.89,15.71,16.22,17.82,19.43,18.809999999999999,19.41,20.6]
["Connecticut",10.9,10.96,11.31,11.63,13.64,16.86,19.11,19.54,20.329999999999998,19.25,18.11,17.34,17.55,19.75,20.94,20.010000000000002,20.29,21.2]
["Maine",13.13,12.74,12.37,12.16,13.23,13.8,16.52,16.239999999999998,15.64,15.72,15.38,14.66,14.35,15.27,15.61,15.83,15.97,16.84]
{"$rows_left_out":59}
{"sheet":"BenefitPerTon_Regression","index":6,"n_rows":20,"n_cols":7,"rows_kept":20,"cut":false,"hidden":false,"merged":[[1,0,2,0],[1,1,1,3],[1,4,1,6]]}
["Based on \"Electricity generating units\" Sector (3% discount rate); 2015$"]
["Year","Low",null,null,"High"]
[null,"PM2.5","SO2","NOx","PM2.5","SO2","NOx"]
[2016,140000,40000,6000,330000,92000,14000]
[2017,142866.81715575606,40446.9525959366,6020.0902934537153,333069.97742663696,92361.173814898357,13880.361173814919]
[2018,145846.50112866797,41108.352144469507,6107.9006772009016,338623.02483070083,93602.708803611808,14031.602708803606]
[2019,148826.18510157987,41769.751693002181,6195.7110609480878,344176.07223476283,94844.243792324793,14182.844243792351]
[2020,150000,42000,6200,350000,96000,14000]
[2021,154785.55304740369,43092.550790067529,6371.3318284424313,355282.16704289056,97327.313769751694,14485.327313769783]
[2022,157765.2370203156,43753.950338600436,6459.1422121896176,360835.21444695257,98568.848758464679,14636.56884875847]
{"$rows_left_out":11}
{"sheet":"SCC_Regression","index":7,"n_rows":42,"n_cols":3,"rows_kept":42,"cut":false,"hidden":false,"merged":[]}
["3% average values"]
["Year","Global\n(2007$)","Domestic\n(2016$)"]
[2015,36,6]
[2016,37.507142857142753,6.1357142857143003]
[2017,38.430952380952249,6.2714285714286007]
[2018,39.354761904761745,6.407142857142901]
[2019,40.27857142857124,6.5428571428571445]
[2020,42,7]
[2021,42.126190476190459,6.8142857142857451]
[2022,43.049999999999955,6.9500000000000455]
{"$rows_left_out":33}
{"sheet":"GDP Implicit Price Deflator","index":8,"n_rows":35,"n_cols":73,"rows_kept":35,"cut":false,"hidden":false,"merged":[[0,0,0,72],[1,0,1,72],[2,0,2,72],[3,0,3,72]]}
["Table 1.1.9. Implicit Price Deflators for Gross Domestic Product"]
["[Index numbers, 2012=100]"]
["Bureau of Economic Analysis"]
["Last Revised on: July 27, 2018 - Next Release Date August 29, 2018"]
[]
["Line","",1947,1948,"1949","1950","1951","1952","1953","1954","1955","1956","1957","1958","1959","1960","1961","1962","1963","1964","1965","1966","1967","1968","1969","1970","1971","1972","1973","1974","1975","1976","1977","1978","1979","1980","1981","1982","1983","1984","1985","1986","1987","1988","1989","1990","1991","1992","1993","1994","1995","1996",1997,1998,1999,2000,2001,2002,2003,2004,2005,2006,2007,2008,2009,2010,2011,2012,2013,2014,2015,2016,2017]
["Line","","","","","","","","","","","","","","","","","","","","","","","","","","","","","","","","","","","","","","","","","","","","","","","","","","","","","","","","","","","","","","","","","","","","","","","",""]
["1","        Gross domestic product",12.266999999999999,12.956,12.935,13.095000000000001,14.023999999999999,14.266,14.439,14.573,14.819000000000001,15.324,15.832000000000001,16.192,16.414000000000001,16.638000000000002,16.815000000000001,17.02,17.215,17.477,17.797999999999998,18.295999999999999,18.827000000000002,19.628,20.591000000000001,21.677,22.776,23.760999999999999,25.062999999999999,27.318000000000001,29.849,31.491,33.448,35.801000000000002,38.771000000000001,42.273000000000003,46.273000000000003,49.131999999999998,51.055999999999997,52.898000000000003,54.570999999999998,55.67,57.045999999999999,59.058999999999997,61.374000000000002,63.670999999999999,65.825000000000003,67.325000000000003,68.92,70.391999999999996,71.867999999999995,73.183000000000007,74.444999999999993,75.283000000000001,76.37,78.078000000000003,79.790000000000006,81.052000000000007,82.557000000000002,84.78,87.421000000000006,90.066000000000003,92.486000000000004,94.284999999999997,95.004000000000005,96.111000000000004,98.117999999999995,100,101.755,103.68,104.789,105.935,107.94799999999999]
["2","Personal consumption expenditures",12.516999999999999,13.225,13.122,13.278,14.182,14.473000000000001,14.663,14.787000000000001,14.845000000000001,15.14,15.6,15.968999999999999,16.207000000000001,16.472999999999999,16.643999999999998,16.838999999999999,17.04,17.286999999999999,17.536000000000001,17.978999999999999,18.431000000000001,19.152000000000001,20.015000000000001,20.951000000000001,21.841000000000001,22.585999999999999,23.802,26.28,28.47,30.032,31.986000000000001,34.210999999999999,37.250999999999998,41.262,44.957999999999998,47.456000000000003,49.473999999999997,51.343000000000004,53.134,54.29,55.963999999999999,58.151000000000003,60.69,63.354999999999997,65.472999999999999,67.218000000000004,68.891999999999996,70.33,71.811000000000007,73.346000000000004,74.623000000000005,75.215999999999994,76.337999999999994,78.234999999999999,79.738,80.789000000000001,82.358000000000004,84.411000000000001,86.811999999999998,89.174000000000007,91.438000000000002,94.18,94.093999999999994,95.704999999999998,98.131,100,101.346,102.86799999999999,103.126,104.235,106.07299999999999]
["3","    Goods",21.957000000000001,23.251999999999999,22.709,22.78,24.619,24.856000000000002,24.742000000000001,24.648,24.503,24.919,25.699000000000002,26.283999999999999,26.417999999999999,26.625,26.725000000000001,26.863,27.085999999999999,27.381,27.669,28.277999999999999,28.777000000000001,29.78,30.934000000000001,32.113999999999997,33.079000000000001,33.926000000000002,35.948999999999998,40.436,43.703000000000003,45.412999999999997,47.837000000000003,50.773000000000003,55.573999999999998,61.796999999999997,66.388999999999996,68.197999999999993,69.429000000000002,70.742000000000004,71.876999999999995,71.540999999999997,73.841999999999999,75.787999999999997,78.703999999999994,81.927000000000007,83.93,84.942999999999998,85.680999999999997,86.552000000000007,87.361000000000004,88.320999999999998,88.218999999999994,86.893000000000001,87.349000000000004,89.081999999999994,89.015000000000001,88.165999999999997,88.054000000000002,89.292000000000002,91.084000000000003,92.305999999999997,93.331000000000003,96.122,93.811999999999998,95.183000000000007,98.772999999999996,100,99.406999999999996,98.938999999999993,95.888999999999996,94.34,94.632000000000005]
{"$rows_left_out":26}
{"sheet":"AVERT_2017","index":9,"n_rows":46,"n_cols":11,"rows_kept":46,"cut":false,"hidden":false,"merged":[[3,0,3,4],[26,6,26,10]]}
["2017 AVERT Emission Factors"]
[]
["National Emission Factors"]
["National Weighted Averages (lb/MWh)"]
[" ","Wind","Utility PV","Portfolio EE","Uniform EE"]
["Avoided CO2 Rate",1485.0040306744493,1486.1476865589939,1592.1159595294362,1597.681215354813]
["Avoided NOx Rate",0.88448944837642496,0.93630380515226497,0.98686949367578802,0.96303462290875952]
["Avoided SO2 Rate",0.99530156272411752,0.96294669220088491,1.0473950047377549,1.0718438097366949]
["Avoided PM2.5 Rate",0.1076863597881715,0.108857389095979,0.116630196296614,0.11621650705011399]
["National factors presented here reflect a weighted average of the avoided emission rates of AVERT’s 10 regions. Averages are weighted by the fraction of 2017 fossil generation in each region."]
{"$rows_left_out":36}