{"text_format":"1","workbook":"xlsx","n_sheets":11,"sheets":["Cover Page","Read Me","Dashboard","Bridge Table","RR","Health Data","Dermal Exposure","Dermal Crosswalk","Inhalation Exposure","List Values","Exposure Factors"],"not_rendered":{"charts":4,"images":0,"macros":1,"external_links":0,"defined_names":150,"comments":0,"pivot_tables":0},"unopened":[],"bounds":{"document_bytes":16777216,"sheet_cells":100000,"rows_first":2000,"rows_last":500,"rows_between":2000,"halvings":0,"cell_chars":16384,"cell_head_chars":4096},"cells_cut":0,"cells_raw":0,"read":"whole","date_system":"1900"}

{"sheet":"Cover Page","index":0,"n_rows":12,"n_cols":1,"rows_kept":12,"cut":false,"hidden":false,"merged":[]}
[]
["Final Risk Evaluation for 1,4-Dioxane"]
[]
[]
[]
[]
{"$rows_left_out":7}
{"sheet":"Read Me","index":1,"n_rows":10,"n_cols":2,"rows_kept":10,"cut":false,"hidden":false,"merged":[[3,0,3,1],[4,0,4,1],[0,0,0,1],[1,0,1,1]]}
["Risk Evaluation for 1,4-Dioxane"]
["Supplemental File on 1,4-Dioxane Risk Calculations, December 2020"]
["Description of this workbook:"]
["The risk calculator for 1,4-dioxane contains the following spreadsheets: 1) Dashboard, 2) Bridge Table, 3) Risk Results (RR), 4) Health Data, 5) Dermal Exposure, 6) Dermal Crosswalk, 7) Inhalation Exposure, 8) List Values, and 9) Exposure Factors. The workbook is designed so that the user need only to use/change inputs the first three spreadsheets (i.e. the Dashboard, the Bridge Table, and the RR), which have tabs colored green and contain the results of the risk calculator. The remaining spreadsheets contain data storage and calculation spreadsheets. "]
[]
["Key Worksheets","Description"]
{"$rows_left_out":5}
{"sheet":"Dashboard","index":2,"n_rows":69,"n_cols":18,"rows_kept":69,"cut":false,"hidden":false,"merged":[[0,0,0,12],[16,3,17,3],[16,4,17,4],[16,6,16,7],[22,6,22,7],[16,5,17,5],[22,5,23,5],[3,12,3,13],[4,12,4,13],[8,13,9,13],[12,12,13,12],[10,12,11,12],[8,12,9,12],[2,12,2,13],[22,8,22,9],[2,6,2,7],[8,2,9,2],[8,3,9,3],[10,3,11,3],[12,3,13,3],[5,5,5,6],[16,2,17,2],[16,8,16,9],[31,3,32,3],[24,12,25,12],[24,1,25,1],[24,2,25,2],[31,2,32,2],[24,3,25,3],[31,12,32,12],[22,4,23,4],[18,1,19,1],[18,2,19,2],[22,3,23,3],[22,2,23,2],[18,3,19,3],[31,13,32,13],[31,15,32,15],[29,8,29,9],[22,14,23,14],[24,13,25,13],[22,15,23,15],[22,12,23,12],[22,13,23,13],[16,14,17,14],[16,15,17,15],[18,12,19,12],[18,13,19,13],[29,6,29,7],[16,12,17,12],[16,13,17,13]]}
[]
[]
[null,null,"Condition of Use",null,null,null,"Personal Protective Equipment (PPE)",null,null,null,null,null,"Dermal"]
[null,null,"Select the Condition of Use (select)",null,null,null,"Respirator Protection Factor (Select)","Glove Protection Factor (Select)",null,null,null,null,"Worker Type\n(select)"]
[null,null,"Repackaging (Bottle)",null,null,null,10,5,null,null,null,null,"Average Adult Worker"]
[]
{"$rows_left_out":64}
{"sheet":"Bridge Table","index":3,"n_rows":166,"n_cols":25,"rows_kept":166,"cut":false,"hidden":false,"merged":[[5,1,6,1],[5,2,6,2],[5,3,6,3],[0,0,0,15],[143,10,144,10],[143,11,144,11],[143,12,144,12],[151,10,152,10],[151,11,152,11],[151,12,152,12],[123,10,124,10],[123,11,124,11],[123,12,124,12],[119,10,120,10],[119,11,120,11],[119,12,120,12],[131,10,132,10],[131,11,132,11],[131,12,132,12],[129,12,130,12],[127,10,128,10],[127,11,128,11],[129,10,130,10],[129,11,130,11],[133,10,134,10],[133,11,134,11],[133,12,134,12],[141,10,142,10],[141,11,142,11],[141,12,142,12],[137,12,138,12],[139,10,140,10],[139,11,140,11],[139,12,140,12],[137,10,138,10],[89,10,90,10],[89,11,90,11],[89,12,90,12],[113,10,114,10],[113,11,114,11],[113,12,114,12],[121,10,122,10],[121,11,122,11],[121,12,122,12],[91,10,92,10],[91,11,92,11],[91,12,92,12],[93,10,94,10],[93,11,94,11],[93,12,94,12],[101,10,102,10],[101,11,102,11],[101,12,102,12],[109,10,110,10],[109,11,110,11],[109,12,110,12],[21,12,22,12],[23,10,24,10],[23,11,24,11],[23,12,24,12],[31,10,32,10],[31,11,32,11],[31,12,32,12],[33,10,34,10],[33,11,34,11],[33,12,34,12],[145,8,146,8],[87,9,88,9],[87,10,88,10],[87,11,88,11],[87,12,88,12],[117,9,118,9],[117,10,118,10],[117,11,118,11],[117,12,118,12],[105,8,106,8],[137,11,138,11],[91,9,92,9],[93,9,94,9],[101,9,102,9],[103,9,104,9],[111,9,112,9],[113,9,114,9],[121,9,122,9],[123,9,124,9],[141,9,142,9],[143,9,144,9],[127,8,130,8],[135,8,136,8],[129,9,130,9],[137,8,140,8],[139,9,140,9],[141,8,144,8],[137,9,138,9],[115,8,116,8],[107,4,116,4],[117,4,126,4],[117,8,120,8],[119,9,120,9],[125,8,126,8],[131,8,134,8],[127,7,130,7],[125,7,126,7],[121,8,124,8],[107,6,116,6],[131,9,132,9],[133,9,134,9],[137,6,146,6],[137,4,146,4],[127,4,136,4],[137,5,146,5],[145,7,146,7],[141,7,144,7],[137,7,140,7],[89,9,90,9],[85,8,86,8],[87,4,96,4],[87,8,90,8],[95,8,96,8],[91,7,94,7],[91,8,94,8],[87,7,90,7],[89,5,90,5],[85,7,86,7],[77,4,86,4],[79,5,80,5],[87,6,96,6],[91,5,96,5],[57,4,66,4],[57,8,60,8],[59,9,60,9],[67,4,76,4],[69,9,70,9],[67,8,70,8],[75,8,76,8],[77,8,80,8],[79,9,80,9],[67,6,76,6],[77,6,86,6],[75,7,76,7],[71,5,76,5],[69,5,70,5],[67,5,68,5],[65,7,66,7],[59,5,66,5],[57,6,66,6],[57,5,58,5],[135,7,136,7],[127,6,136,6],[131,7,134,7],[87,5,88,5],[105,7,106,7],[127,5,136,5],[117,5,126,5],[117,6,126,6],[121,7,124,7],[117,7,120,7],[115,7,116,7],[107,5,116,5],[111,7,114,7],[95,7,96,7],[15,8,16,8],[47,5,48,5],[17,5,18,5],[15,7,16,7],[17,8,20,8],[25,8,26,8],[35,7,36,7],[27,4,36,4],[25,7,26,7],[47,4,56,4],[47,8,50,8],[55,7,56,7],[35,8,36,8],[21,7,24,7],[21,8,24,8],[17,7,20,7],[2,10,2,15],[17,4,26,4],[17,6,26,6],[19,5,26,5],[7,5,16,5],[7,6,16,6],[9,9,10,9],[7,8,10,8],[29,5,36,5],[7,4,16,4],[29,12,30,12],[31,7,34,7],[31,8,34,8],[27,5,28,5],[27,7,30,7],[27,9,28,9],[27,10,28,10],[27,11,28,11],[27,12,28,12],[27,6,36,6],[31,9,32,9],[33,9,34,9],[27,8,30,8],[29,9,30,9],[49,12,50,12],[51,7,54,7],[51,8,54,8],[47,7,50,7],[37,4,46,4],[37,5,46,5],[37,6,46,6],[49,5,56,5],[47,6,56,6],[47,9,48,9],[47,10,48,10],[47,11,48,11],[47,12,48,12],[49,9,50,9],[53,9,54,9],[51,9,52,9],[53,12,54,12],[45,7,46,7],[45,8,46,8],[51,10,52,10],[51,11,52,11],[51,12,52,12],[53,10,54,10],[53,11,54,11],[155,7,156,7],[147,6,156,6],[147,4,156,4],[149,10,150,10],[149,11,150,11],[149,12,150,12],[151,5,154,5],[151,7,154,7],[151,8,154,8],[147,5,148,5],[147,7,150,7],[147,9,148,9],[147,10,148,10],[147,11,148,11],[147,12,148,12],[149,5,150,5],[155,8,156,8],[147,8,150,8],[149,9,150,9],[151,9,152,9],[153,9,154,9],[153,10,154,10],[153,11,154,11],[153,12,154,12],[111,8,114,8],[107,7,110,7],[107,9,108,9],[107,10,108,10],[107,11,108,11],[107,12,108,12],[107,8,110,8],[109,9,110,9],[111,10,112,10],[111,11,112,11],[111,12,112,12],[97,4,106,4],[101,5,104,5],[101,7,104,7],[101,8,104,8],[97,12,98,12],[103,10,104,10],[103,11,104,11],[103,12,104,12],[99,5,100,5],[99,10,100,10],[99,11,100,11],[99,12,100,12],[99,9,100,9],[97,8,100,8],[97,5,98,5],[97,7,100,7],[97,9,98,9],[97,10,98,10],[97,11,98,11],[97,6,106,6],[79,10,80,10],[79,11,80,11],[79,12,80,12],[81,5,84,5],[81,7,84,7],[81,8,84,8],[77,5,78,5],[77,7,80,7],[77,9,78,9],[77,10,78,10],[77,11,78,11],[77,12,78,12],[81,9,82,9],[83,9,84,9],[81,10,82,10],[81,11,82,11],[81,12,82,12],[83,10,84,10],[83,11,84,11],[83,12,84,12],[69,10,70,10],[69,11,70,11],[69,12,70,12],[71,7,74,7],[71,8,74,8],[67,7,70,7],[67,9,68,9],[67,10,68,10],[67,11,68,11],[67,12,68,12],[71,9,72,9],[73,9,74,9],[71,10,72,10],[71,11,72,11],[71,12,72,12],[73,10,74,10],[73,11,74,11],[73,12,74,12],[59,10,60,10],[59,11,60,11],[59,12,60,12],[61,7,64,7],[61,8,64,8],[57,7,60,7],[57,9,58,9],[57,10,58,10],[57,11,58,11],[57,12,58,12],[61,9,62,9],[63,9,64,9],[61,10,62,10],[61,11,62,11],[61,12,62,12],[63,10,64,10],[63,11,64,11],[63,12,64,12],[39,12,40,12],[41,7,44,7],[41,8,44,8],[37,7,40,7],[37,9,38,9],[37,10,38,10],[37,11,38,11],[37,12,38,12],[43,9,44,9],[41,9,42,9],[37,8,40,8],[39,9,40,9],[41,10,42,10],[41,11,42,11],[41,12,42,12],[43,10,44,10],[43,11,44,11],[43,12,44,12],[49,10,50,10],[49,11,50,11],[17,9,18,9],[17,10,18,10],[17,11,18,11],[21,9,22,9],[23,9,24,9],[29,10,30,10],[29,11,30,11],[19,9,20,9],[21,10,22,10],[21,11,22,11],[39,10,40,10],[39,11,40,11],[11,10,12,10],[11,11,12,11],[11,12,12,12],[13,10,14,10],[13,11,14,11],[13,12,14,12],[17,12,18,12],[19,10,20,10],[19,11,20,11],[19,12,20,12],[5,17,5,19],[5,4,6,4],[5,5,6,5],[5,6,6,6],[5,7,6,7],[5,8,6,8],[5,9,6,9],[127,9,128,9],[127,12,128,12],[105,5,106,5],[9,11,10,11],[9,12,10,12],[11,7,14,7],[11,8,14,8],[5,10,5,12],[5,13,5,15],[7,7,10,7],[7,9,8,9],[7,10,8,10],[7,11,8,11],[7,12,8,12],[9,10,10,10],[13,9,14,9],[11,9,12,9]]}
[]
[null,"Summary of Risk Estimates for Inhalation and Dermal Exposures to Workers by Condition of Use"]
[null,null,null,null,null,null,null,null,null,null,"Benchmarks"]
[null,null,null,null,null,null,null,null,null,null,{"$f":"'Health Data'!I7","v":300},{"$f":"'Health Data'!I9","v":30},{"$f":"'Health Data'!P10","v":1E-4},{"$f":"K4","v":300},{"$f":"L4","v":30},{"$f":"M4","v":1E-4},null,null,null,"Respirator APF =",10]
[null,null,null,null,null,null,null,null,null,null,null,null,null,null,null,null,null,null,null,"Glove PF =",5]
[null,"OES Group","Population","Exposure Route","Life Cycle Stage/ Category","Subcategory","Occupational Exposure Scenario","Population","Exposure Route and Duration","Exposure Level","Risk Estimates for No PPE",null,null,"Risk Estimates with PPE",null,null,null,"Select the PPE APF or PF for Each OES, Receptor, and Endpoint"]
{"$rows_left_out":161}
{"sheet":"RR","index":4,"n_rows":65,"n_cols":24,"rows_kept":65,"cut":false,"hidden":false,"merged":[[30,19,31,19],[24,4,25,4],[26,4,27,4],[22,7,23,7],[22,17,23,17],[28,19,29,19],[24,17,25,17],[26,7,27,7],[26,17,27,17],[24,7,25,7],[20,17,21,17],[20,10,20,15],[30,1,31,1],[30,7,31,7],[30,17,31,17],[28,1,29,1],[28,7,29,7],[28,17,29,17],[28,2,29,2],[30,2,31,2],[30,3,31,3],[28,3,29,3],[30,4,31,4],[28,5,29,5],[28,4,29,4],[30,5,31,5],[20,19,21,19],[20,18,21,18],[0,6,0,20],[8,18,9,18],[20,20,20,23],[3,8,3,9],[4,8,4,9],[20,9,21,9],[8,17,9,17],[19,11,19,12],[10,17,11,17],[12,17,13,17],[16,17,17,17],[14,17,15,17],[20,7,21,7],[20,8,21,8],[22,2,23,2],[22,3,23,3],[22,5,23,5],[22,4,23,4],[22,1,23,1],[24,2,27,2],[24,3,27,3],[24,5,25,5],[26,1,27,1],[24,1,25,1],[26,5,27,5],[20,3,21,4],[20,2,21,2],[10,8,11,8],[12,8,13,8],[8,7,9,7],[8,8,9,8],[20,5,21,5]]}
[]
[]
[null,null,null,null,null,null,null,"Condition of Use","Inhalation Exposure",null,null,null,null,null,null,null,null,"Dermal"]
[null,null,null,null,null,null,null,"Select the Condition of Use (select)","Exposure Type \n(select)",null,null,null,null,null,null,null,null,"Worker Type\n(select)"]
[null,null,null,null,null,null,null,"Manufacturing","Worker",null,null,null,null,null,null,null,null,"Average Adult Worker"]
[]
{"$rows_left_out":60}
{"sheet":"Health Data","index":5,"n_rows":25,"n_cols":17,"rows_kept":25,"cut":false,"hidden":false,"merged":[[0,0,0,12],[20,13,20,15],[19,13,19,14],[18,13,18,14],[12,13,12,14],[4,5,4,8],[7,1,9,1],[10,1,11,1],[10,2,11,2],[4,13,4,15],[5,2,5,3],[4,9,4,10]]}
[]
[]
[null,"Look-up Values and Risk Parameter Values"]
[null,null,null,null,null,null,"Inhalation","Dermal",null,"Inhalation","Dermal"]
[null,null,null,null,null,"Acute and Chronic, Non-Cancer Parameters",null,null,null,"Cancer Parameters",null,null,null,"Look-up Table Values"]
[null,null,"Toxicity Endpoint",null,"Study","Code","HEC (mg/m3)","HED (mg/kg-d)","Benchmark MOE","IUR (mg/m3)-1","CSF (mg/kg-d)-1",null,null,null,"Exposure Percentiles","Target Cancer Risk Level"]
{"$rows_left_out":20}
{"sheet":"Dermal Exposure","index":6,"n_rows":11,"n_cols":18,"rows_kept":11,"cut":false,"hidden":false,"merged":[[0,0,0,8],[3,17,5,17],[3,12,5,12],[3,8,5,8],[3,3,5,3],[3,4,5,4],[2,0,2,5],[8,0,8,5],[2,6,2,12],[3,7,5,7],[2,13,2,16],[3,14,4,14],[3,16,4,16],[3,10,5,10],[3,11,5,11],[3,6,5,6],[3,13,4,13],[3,9,5,9],[3,15,4,15]]}
[]
[]
["For Dashboard",null,null,null,null,null,"Dermal Calculation Numbers",null,null,null,null,null,null,"Calculated Doses"]
[null,null,null,"Exposure Category","Exposure Level",null,"Max Yderm","Calculated Fraction Absorbed, Fabs","Exposure Frequency (EF)\n(days/yr)","Exposure Frequency (FT)\n(event/day)","2-Hand Surface Area (cm2)","Body Weight (kg)","Quantity Remaining on Skin (Qu) \n(mg/cm2-event)","Potential Dose Rate","Acute Retained Dose","Chronic Retained Dose, Non-Cancer","Chronic Retained Dose, Cancer","Notes"]
[]
["Look-up Name","Condition of Use ","Worker Type",null,null,"Bin",null,null,null,null,null,null,null,"APDRexp (mg/day)","ADD1,4-Dioxane (mg/kg-day)","CRD1,4-Dioxane (mg/kg-day)","CRD1,4-Dioxane (mg/kg-day)"]
{"$rows_left_out":6}
{"sheet":"Dermal Crosswalk","index":7,"n_rows":16,"n_cols":18,"rows_kept":16,"cut":false,"hidden":false,"merged":[[2,10,2,13],[3,7,3,8],[3,5,3,6],[2,14,2,17],[0,0,0,12]]}
[]
[]
[null,null,null,null,null,null,null,null,null,null,"Calculated High-End Doses",null,null,null,"Calculated Central Tendency Doses"]
[null,null,null,null,null,"High-End",null,"Central Tendency",null,null,"Potential Dose Rate","Acute Retained Dose","Chronic Retained Dose, Non-Cancer","Chronic Retained Dose, Cancer","Potential Dose Rate","Acute Retained Dose","Chronic Retained Dose, Non-Cancer","Chronic Retained Dose, Cancer"]
["OES","Look-up Name","Condition of Use ","Bin","Max Yderm","Qu (mg/cm2-event)","Surface Area (cm2)","Qu (mg/cm2-event)","Surface Area (cm2)","Fraction Absorbed, fabs","APDRexp (mg/day)","ARD1,4-Dioxane (mg/kg-day)","CRD1,4-Dioxane (mg/kg-day)","CRD1,4-Dioxane (mg/kg-day)","APDRexp (mg/day)","ARD1,4-Dioxane (mg/kg-day)","CRD1,4-Dioxane (mg/kg-day)","CRD1,4-Dioxane (mg/kg-day)"]
[1,"Manufacturing","Manufacturing",1,1,2.1,{"$f":"'Exposure Factors'!$C$8","v":1070},1.4,{"$f":"'Exposure Factors'!$C$7","v":535},0.78284413395563768,{"$f":"F6*G6*$E6*$J6","v":1759.0507689983178},{"$f":"K6/BW_default","v":21.988134612478973},{"$f":"(L6*VLOOKUP($A6,'Inhalation Exposure'!$B$6:$F$19,5,FALSE)*WY_HE_default)/(EF*WY_HE_default)","v":21.14243712738363},{"$f":"(L6*VLOOKUP($A6,'Inhalation Exposure'!$B$6:$F$19,5,FALSE)*WY_HE_default)/(EF*LT)","v":10.842275449940322},{"$f":"H6*I6*$E6*$J6","v":586.35025633277257},{"$f":"O6/BW_default","v":7.3293782041596574},{"$f":"(P6*VLOOKUP($A6,'Inhalation Exposure'!$B$6:$G$19,6,FALSE)*WY_CT_default)/(EF*WY_CT_default)","v":7.0474790424612088},{"$f":"(P6*VLOOKUP($A6,'Inhalation Exposure'!$B$6:$G$19,6,FALSE)*WY_CT_default)/(EF*LT)","v":2.8009211579012496}]
{"$rows_left_out":11}
{"sheet":"Inhalation Exposure","index":8,"n_rows":37,"n_cols":19,"rows_kept":37,"cut":false,"hidden":false,"merged":[[13,30,16,30],[13,28,16,28],[13,29,16,29],[2,13,2,14],[3,7,3,8],[3,9,3,10],[3,11,3,12],[3,13,3,14],[2,7,2,8],[2,9,2,10],[2,11,2,12],[0,0,0,15],[3,29,5,29],[3,30,5,30],[3,28,5,28],[2,5,2,6],[3,5,3,6]]}
[]
[]
[null,null,null,null,null,"Exposure Frequency",null,"Eight Hour  TWA Exposures",null,"24-hr Acute Exposures",null,"Chronic, Non-Cancer Exposures",null,"Chronic, Cancer Exposures"]
[null,null,null,null,null,"(day/yr)",null,"C8-hr TWA (mg/m3)",null,"AEC24-hr TWA (mg/m3)",null,"ADC8-hr TWA (mg/m3)",null,"LADC8-hr TWA (mg/m3)"]
[null,"OES Group","Condition of Use","Category","Exposure Scenario","High End","Central Tendency","High End","Central Tendency","High End","Central Tendency","High End","Central Tendency","High End","Central Tendency","8 hr Data Points","Total Datapoints","Sources & Notes","Data Type"]
[null,1,"Manufacturing","Worker","8-hr",250,250,7.7344999999999988,0.41500000000000004,null,null,7.4370192307692298,0.39903846153846162,3.8138560157790922,0.15859220907297833,30,30,"BASF, 2017; BASF, 2016","Monitoring Data"]
{"$rows_left_out":32}
{"sheet":"List Values","index":9,"n_rows":36,"n_cols":11,"rows_kept":36,"cut":false,"hidden":false,"merged":[[0,0,0,7]]}
[]
[]
[null,"Conditions of Use",null,null,"Exposure Data Types",null,null,"Dermal Exposure Scenario"]
[null,"Manufacturing",null,null,"Monitoring Data",null,null,5]
[null,"Repackaging (Bottle)",null,null,"Modeled Data",null,null,10]
[null,"Repackaging (Drum)",null,null,null,null,null,20]
{"$rows_left_out":31}
{"sheet":"Exposure Factors","index":10,"n_rows":23,"n_cols":5,"rows_kept":23,"cut":false,"hidden":false,"merged":[[22,1,22,4],[11,1,11,4],[0,0,0,11]]}
[]
[]
[null,"Exposure Factors"]
[]
[null,null,"Average Adult Worker","Woman of Childbearing Age","Characterization of Value"]
[null,"Body Weight, BW (kg)",80,{"$f":"AVERAGE(65.9,71.9,74.8,77.1)","v":72.425000000000011}]
{"$rows_left_out":17}