{"text_format":"1","workbook":"xlsx","n_sheets":27,"sheets":["Title Page","Index","INPUT","OUTPUT","Air and Packing Reference","Critical Design Assumptions","O&M Assumptions","Indirect Assumptions","Offgas Assumptions","Onda","Tower Design","Retrofit","Chemical Use","Offgas","Pumps Pipe Structure","Instrumentation and Control","O&M","HVAC","Indirect","Henry's Reference","Standard Inputs","Design Macros","Cost Equations","Cost Coefficients","Cost Data","Engineering Data","Lookup Tables"],"not_rendered":{"charts":0,"images":0,"macros":1,"external_links":0,"defined_names":1179,"comments":17,"pivot_tables":0},"unopened":[],"bounds":{"document_bytes":16777216,"sheet_cells":100000,"rows_first":2000,"rows_last":500,"rows_between":2000,"halvings":0,"cell_chars":16384,"cell_head_chars":4096},"cells_cut":0,"cells_raw":0,"read":"whole","date_system":"1900"}

{"sheet":"Title Page","index":0,"n_rows":12,"n_cols":1,"rows_kept":12,"cut":false,"hidden":false,"merged":[]}
["US EPA, Office of Water, Office of Ground Water & Drinking Water"]
["Work Breakdown Structure (WBS) Model for Packed Tower Aeration (PTA) Treatment"]
["Release Date: August 12, 2014"]
["· This model is designed to assist EPA in estimating national compliance costs for drinking water regulations."]
["· As such, the costs are intended to be representative of typical facilities."]
["· The costs, however, do not account for all of the site-specific factors that could affect the cost of any given individual facility."]
["· Use of this model requires Excel 2007."]
["· The model should be opened as Read-only, so that any changes you make are saved under a new file name."]
["· To function properly, macros (\"active content\") must be enabled. If a security warning appears, click \"options\" and \"enable this content.\""]
["· For further information see the following document distributed with this file:"]
["USEPA. 2014. Work Breakdown Structure-Based Cost Models for Drinking Water Treatment Technologies. Office of Water."]
["· To begin using the model, go to the INPUT sheet."]

{"sheet":"Index","index":1,"n_rows":251,"n_cols":2,"rows_kept":251,"cut":false,"hidden":false,"merged":[]}
["INDEX"]
["This page provides an index to all user-adjustable inputs and assumptions.  Click on a variable name to go directly to the adjustable cells."]
[]
["User-adjustable Input or Assumption","Variable Name and Link"]
["Acceleration of gravity","G"]
["Access space for each pump","space_pumps"]
["Additional height added per tower","r_xtraheight_I"]
["Additional pump head required","add_head"]
["Administrative LOE as a percent of average technical labor ","Clerical_percent"]
["Air conditioning EER","EER"]
["Air pipe length per tower","air_L"]
["Alkalinity as CaCO3","alk_ppm"]
["Alternate packing unit cost","alt_pack_cost"]
["Always include NEPA compliance costs?","include_NEPA"]
["Annual cooling degree days","cool_DD"]
["Annual heating degree days","heat_DD"]
["Average Flow (including bypass)","Qwa_in"]
["Basin excavation depth above which deeper boreholes are needed","bore_need"]
["Basin excavation depth above which deeper boreholes are needed","deep_bore_need"]
["Bedding depth below pipe","bedding_depth"]
["Bedding depth surrounding the pipe","bedding_pct"]
["Blower efficiency","BLOW_EFF"]
["Boiling point of contaminant","Tb_in"]
["Boiling point of new contaminant","r_Tb_in"]
["Borehole depth for deep clearwells","bore_depth_max"]
["Borehole depth for shallow clearwells","bore_depth_min"]
["Borehole depth with no clearwell","bore_depth_nobasin"]
["Borehole needed every x square feet","hole_per_sf"]
["Boreholes per job","hole_per_job"]
["Buffer space around other sides of buildings","non_fire_buffer"]
["Builder's risk insurance percentage","br_ins_pct"]
["Building height","Building_height"]
["Chemical storage required","cstore_days"]
["Chemical tank mixer horsepower","cmix_hp_per"]
["Clearwell detention time","AW_Det"]
["Coefficient of passive pressure","Coeff_Kp"]
["Component level","component_level_I"]
["Computer workstations per x operators","workstation_ratio"]
["Concrete pad thickness","pad_thick"]
["Concrete pad thickness for small systems","pad_thick_small"]
["Concrete thickness","conc_thick"]
["Contaminant removal input type","Units_rem_I"]
["Cooling table for buildings 500 square feet or greater","cooling_table"]
["Cooling table for buildings less than 500 ft2","cooling_table_shed"]
["Cooling ventilation/infiltration load","cool_viload"]
["Corrosion control chemical chosen","chem_type"]
["Cost estimating method","curve"]
["Cost for parts & maintenance for PTA towers","PTA_maintenance"]
["Cost for parts & maintenance for pumps and blowers","pump_maintenance"]
["Critical surface tension of packing","SP"]
["Days per year of chemical feed","chem_freq"]
["Density of air","PA"]
["Density of water","PW"]
["Design Flow (including bypass)","Qw_in"]
["Design safety factor for standby power","std_safety_factor"]
["Dosage of sodium hexametaphosphate","sh_dose"]
["Dosage of tetrasodium polyphosphate","tp_dose"]
["Drive controllers per blower","S_blower"]
["Drive controllers per booster pump","S_booster_pump"]
["Drive controllers per catalytic oxidizer","S_CO"]
["Drive controllers per chemical metering pump","S_cm_pump"]
["Drive controllers per mixer","S_mix"]
["Drive controllers per thermal oxidizer","S_TO"]
["Electric resistance heating efficiency","resist_eff"]
["Electrical percentage","elect_pct"]
["Engineering percentage for large systems","eng_pct_large"]
["Engineering percentage for medium systems","eng_pct_medium"]
["Engineering percentage for small systems","eng_pct_small"]
["Ethernet modules","plc_ethernet "]
["Financing percentage","finance_pct"]
["Financing percentage for small systems","finance_pct_small"]
["Fire truck buffer requirements","fire_buffer"]
["Flow meters for air line per tower","fm_air"]
["Flow meters for influent and treated water line","tot_fm_in"]
["Flow meters for process line per tower","fm_proc"]
["Force Constant for Air","E_KA"]
["Freeboard","freeboard"]
["Freeboard above packing material","Free_Board_Col"]
["Friction factor","CF"]
["Frost depth","frost"]
["GAC bed life","og_opt3"]
["Gas law constant","R_C"]
["H2SO4 mg/meq","H2SO4_molwt"]
["H2SO4 solution strength","H2SO4_strength"]
["HCl mg/meq","hcl_molwt"]
["HCl quantity to trigger RMP requirement","HCl_quant_RMP"]
["HCl solution strength","hcl_strength"]
["HCl strength to trigger RMP requirement","HCl_strength_RMP"]
["Heat pump cooling mode EER","hp_EER"]
["Heat pump heating coefficient of performance","COP"]
["Heat recovery type","og_opt1_I"]
["Heating oil heat content","diesel_heat_content"]
["Heating table for buildings 500 square feet or greater","heating_table"]
["Heating table for buildings less than 500 ft2","heating_table_shed"]
["Heating ventilation/infiltration load","heat_viload"]
["Henry's coefficient","Henry"]
["Henry's coefficient for new contaminant","r_Henry"]
["High/low alarms per chemical tank","alarm_chem"]
["Hours per media changeout","uloe_throwaway"]
["I/O port table","port_table"]
["Include a separate day tank if daily volume is x or greater","day_tank_needed"]
["Include architectural fee for small systems?","include_arch_small"]
["Include architectural fee?","include_arch"]
["Include buildings in total capital cost?","include_buildings"]
["Include concrete pad in total capital cost?","include_pad"]
["Include construction management cost?","include_cm"]
["Include contingency costs for high cost systems?","include_conting_high"]
["Include contingency costs for low cost systems?","include_conting_low"]
["Include contingency costs for medium cost systems?","include_conting_medium"]
["Include cooling in standby power","need_cool"]
["Include geotechnical costs for high cost systems?","include_geo_high"]
["Include geotechnical costs for low cost systems?","include_geo_low"]
["Include geotechnical costs for medium cost systems?","include_geo_medium"]
["Include heating in standby power","need_heat"]
["Include land costs?","include_land"]
["Include performance bond cost?","include_bond"]
["Include permit costs?","include_permits"]
["Include pilot study costs?","include_pilot"]
["Include sitework costs?","include_sitework"]
["Include standby power costs for small systems?","include_standby_small"]
["Include standby power costs?","include_standby"]
["Include yard piping costs?","include_yardpipe"]
["Influent concentration","Influent_conc"]
["Influent concentration of new contaminant","r_influent_conc_I"]
["Initial water pH","pHo"]
["Installation, Transportatation, and O&P percentage","inst_pct"]
["Instrumentation and control percentage","i_c_pct"]
["Legal percentage","legal_pct"]
["Lighting power per sf, high-quality buildings","lighting_power_high"]
["Lighting power per sf, low-quality buildings and sheds","lighting_power_low"]
["Lighting power per sf, mid-quality buildings","lighting_power_mid"]
["Linear feet bored per day","hole_per_day"]
["Maintenance LOE for chemical supply systems","uloe_chem_maint"]
["Maintenance LOE for instruments (includes calibration)","uloe_inst_maint"]
["Maintenance LOE for pumps","uloe_pump_maint"]
["Maintenance LOE for valves","uloe_valve_maint"]
["Mangerial LOE as a percent of average technical labor ","Manager_percent"]
["Maximum access space per tower or tank","max_space_vessels"]
["Maximum packing height","Max_pack_std"]
["Maximum packing height for difficult contaminants","Max_pack_MTBE"]
["Maximum packing height to diameter ratio","Max_d_rat_cda"]
["Maximum tower area","Max_Area_cda"]
["Melting point of contaminant","Tm_in"]
["Melting point of new contaminant","r_Tm_in"]
["Mid-efficiency oil furnace efficiency","diesel_eff"]
["Minimum average flow as percentage of design","min_avg_flow"]
["Minimum number of boreholes","min_holes"]
["Minimum number of towers","min_col"]
["Minimum packing height to diameter ratio","Min_d_rat_cda"]
["Minimum standby power generator size","min_standby"]
["Minimum tower area","Min_Area_cda"]
["Minimum trench depth to top of pipe","min_trench_depth"]
["Minutes per 100 sf per day","uloe_fp"]
["Minutes per instrument per day","uloe_inst"]
["Minutes per pump, blower, and offgas unit per day","uloe_pump"]
["Minutes per valve per week","uloe_valve"]
["Miscellaneous allowance percentage","misc_pct"]
["Mobilization percentage for large systems","mob_pct_large"]
["Mobilization percentage for medium systems","mob_pct_medium"]
["Mobilization percentage for small systems","mob_pct_small"]
["Molar volume of contaminant","Mv_in"]
["Molar volume of gas at STP","GO"]
["Molar volume of new contaminant","r_Mv_in"]
["Molecular Radius of Air","RA"]
["Molecular weight of air","MWA"]
["Molecular weight of contaminant","Mw_in"]
["Molecular weight of new contaminant","r_Mw_in"]
["NaOH solution strength","naoh_strength"]
["Natural gas condensing furnace efficiency","gas_eff"]
["Natural gas non-condensing furnace efficiency","gas_non_eff"]
["Number of blowers","parallel_I"]
["Number of booster pumps","num_pumps_I"]
["Number of check valves on acid line per chemical pump","HCl_chv_pump"]
["Number of check valves on bypass line","tot_bp_chv"]
["Number of check valves on caustic line per chemical pump","NaOH_chv_pump"]
["Number of check valves on corrosion chemical line per chemical pump","chem_chv_pump"]
["Number of check valves on influent line","tot_in_chv"]
["Number of CPUs","plc_cpu"]
["Number of electrical enclosures","elec_encl"]
["Number of manual valves on influent and treated water line","tot_man_valves"]
["Number of mechanical ventilation days per year (large system)","fan_days_large"]
["Number of mechanical ventilation days per year (medium system)","fan_days_medium"]
["Number of mechanical ventilation days per year (small system)","fan_days_small"]
["Number of redundant blowers","NRD_blower"]
["Number of redundant booster pumps","NRD_pump"]
["Number of redundant chemical metering pumps","NRD_cm_pump"]
["Number of redundant columns to be added","NRD_I"]
["Number of redundant towers for small systems","NRD_small"]
["Number of shifts","shifts_day"]
["Off-gas pollution control technology","Offgas_Tech_I"]
["Office space per employee","space_office"]
["Office space per employee for small systems","space_office_small"]
["Operating Pressure","Op_Press"]
["Operating temperature","T"]
["Operator interfaces","plc_interface"]
["Overdesign sensitivity","P_REM_INC"]
["Overexcavation","overexcavate"]
["Packing size","Packing_Size"]
["Percent of Total Flow that is Bypassed","bp_pct"]
["Percent removal or effluent concentration","Rem_I"]
["Percent removal or effluent concentration for retrofit","r_rem_I"]
["pH meters","pH_controls"]
["Pipe length from water source to the boundary of the 10 foot buffer","yard_in"]
["Pipe length the boundary of the 10 foot buffer to distribution network","yard_out"]
["Pressure drop across the fan","Fan_pressure_drop"]
["Printers per x computer workstations","printer_ratio"]
["Pump efficiency","PUMP_EFF"]
["Recording operating paramenters for automated systems","uloe_inst_auto"]
["Reduction factor","Reduction"]
["Redundancy frequency for large systems","redund_freq"]
["Removal input type for new contaminant","r_units_rem_I"]
["Retrofit","retrofit_I"]
["R-value for ceilings","R_ceiling"]
["R-value for walls","R_wall"]
["Safety factor (Henry's)","SF_Henry"]
["Safety factor (Kla)","SF_Kla"]
["Safety factor for pumps","pump_safety_factor"]
["Sales tax percentage","tax_pct"]
["Sodium hexametaphospate solution strength","sh_strength"]
["Soil density","soil_dens"]
["Spacing between liquid redistribution rings","ring_space"]
["Specific gravity of sodium hexametaphosphate solution","sh_spgr"]
["Specific gravity of tetrasodium polyphosphate solution","tp_spgr"]
["Spent GAC regeneration","og_opt2_I"]
["Standard oil furnace efficiency","diesel_non_eff"]
["Standard Pressure","P_S"]
["Standard pressure","PS"]
["Standard temperature","TS"]
["Surface area of packing","AP"]
["Surface tension of water","SW"]
["System automation","manual_I"]
["Target pH for treatment","pHf_selected"]
["TDS monitors","num_TDS"]
["Technology complexity factor","complexity"]
["Temperature meters","temp_meters"]
["Test pit depth","pit_depth"]
["Test pit length","pit_length"]
["Test pit width","pit_width"]
["Tetrasodium polyphospate solution strength","tp_strength"]
["Trench inside angle","trench_angle"]
["Turbidity meters","turb_meters"]
["Turbidity meters (for small systems <1 MGD)","turb_meters_small"]
["Type of acid","acid_type"]
["UPSs","ups"]
["Valve table","valve_table"]
["Ventilation air change rate for chemical storage","Air_changes_chem_storage"]
["Ventilation air change rate for offices","Air_changes_office"]
["Ventilation air change rate for pump room","Air_changes_pump"]
["Viscosity of air","UA"]
["Viscosity of water","UW"]
["VOC release at which air pollution control system is needed","max_VOC_release"]

{"sheet":"INPUT","index":2,"n_rows":114,"n_cols":9,"rows_kept":114,"cut":false,"hidden":false,"merged":[]}
["PACKED TOWER AERATION (PTA) SYSTEM DESIGN AND COST INPUT"]
[]
[null,null,null,null,"STEP 1"]
[null,null,null,null,"Select Contaminant"]
[]
[]
[null,null,null,null,"STEP 2",null,null,{"$f":"IF(OR('Standard Inputs'!AV9,'Standard Inputs'!AV17,'Standard Inputs'!AV25,'Standard Inputs'!AV33,'Standard Inputs'!AV41,'Standard Inputs'!AV49,'Standard Inputs'!AV57,'Standard Inputs'!AV65,'Standard Inputs'!AV73,'Standard Inputs'!AV81,'Standard Inputs'!AV89,'Standard Inputs'!AV97,'Standard Inputs'!AV105,'Standard Inputs'!AV113,'Standard Inputs'!AV121,'Standard Inputs'!AV129),\"<- Using this design\",IF(OR('Standard Inputs'!AW9,'Standard Inputs'!AW17,'Standard Inputs'!AW25,'Standard Inputs'!AW33,'Standard Inputs'!AW41,'Standard Inputs'!AW49,'Standard Inputs'!AW57,'Standard Inputs'!AW65,'Standard Inputs'!AW73,'Standard Inputs'!AW81,'Standard Inputs'!AW89,'Standard Inputs'!AW97,'Standard Inputs'!AW105,'Standard Inputs'!AW113,'Standard Inputs'!AW121,'Standard Inputs'!AW129),\"<- You modified this design\",\"\"))","v":"<- Using this design"},{"$f":"IF(contam=16,\" Note: standard designs not defined for other contaminants.  Use manual input or set designs on Standard Inputs page.\",\"\")","v":""}]
[null,null,null,null,"Select one of the eight standard designs at right",null,null,{"$f":"IF(OR('Standard Inputs'!AV10,'Standard Inputs'!AV18,'Standard Inputs'!AV26,'Standard Inputs'!AV34,'Standard Inputs'!AV42,'Standard Inputs'!AV50,'Standard Inputs'!AV58,'Standard Inputs'!AV66,'Standard Inputs'!AV74,'Standard Inputs'!AV82,'Standard Inputs'!AV90,'Standard Inputs'!AV98,'Standard Inputs'!AV106,'Standard Inputs'!AV114,'Standard Inputs'!AV122,'Standard Inputs'!AV130),\"<- Using this design\",IF(OR('Standard Inputs'!AW10,'Standard Inputs'!AW18,'Standard Inputs'!AW26,'Standard Inputs'!AW34,'Standard Inputs'!AW42,'Standard Inputs'!AW50,'Standard Inputs'!AW58,'Standard Inputs'!AW66,'Standard Inputs'!AW74,'Standard Inputs'!AW82,'Standard Inputs'!AW90,'Standard Inputs'!AW98,'Standard Inputs'!AW106,'Standard Inputs'!AW114,'Standard Inputs'!AW122,'Standard Inputs'!AW130),\"<- You modified this design\",\"\"))","v":""}]
[null,null,null,null,null,null,null,{"$f":"IF(OR('Standard Inputs'!AV11,'Standard Inputs'!AV19,'Standard Inputs'!AV27,'Standard Inputs'!AV35,'Standard Inputs'!AV43,'Standard Inputs'!AV51,'Standard Inputs'!AV59,'Standard Inputs'!AV67,'Standard Inputs'!AV75,'Standard Inputs'!AV83,'Standard Inputs'!AV91,'Standard Inputs'!AV99,'Standard Inputs'!AV107,'Standard Inputs'!AV115,'Standard Inputs'!AV123,'Standard Inputs'!AV131),\"<- Using this design\",IF(OR('Standard Inputs'!AW11,'Standard Inputs'!AW19,'Standard Inputs'!AW27,'Standard Inputs'!AW35,'Standard Inputs'!AW43,'Standard Inputs'!AW51,'Standard Inputs'!AW59,'Standard Inputs'!AW67,'Standard Inputs'!AW75,'Standard Inputs'!AW83,'Standard Inputs'!AW91,'Standard Inputs'!AW99,'Standard Inputs'!AW107,'Standard Inputs'!AW115,'Standard Inputs'!AW123,'Standard Inputs'!AW131),\"<- You modified this design\",\"\"))","v":""}]
[null,null,null,null,"OR",null,null,{"$f":"IF(OR('Standard Inputs'!AV12,'Standard Inputs'!AV20,'Standard Inputs'!AV28,'Standard Inputs'!AV36,'Standard Inputs'!AV44,'Standard Inputs'!AV52,'Standard Inputs'!AV60,'Standard Inputs'!AV68,'Standard Inputs'!AV76,'Standard Inputs'!AV84,'Standard Inputs'!AV92,'Standard Inputs'!AV100,'Standard Inputs'!AV108,'Standard Inputs'!AV116,'Standard Inputs'!AV124,'Standard Inputs'!AV132),\"<- Using this design\",IF(OR('Standard Inputs'!AW12,'Standard Inputs'!AW20,'Standard Inputs'!AW28,'Standard Inputs'!AW36,'Standard Inputs'!AW44,'Standard Inputs'!AW52,'Standard Inputs'!AW60,'Standard Inputs'!AW68,'Standard Inputs'!AW76,'Standard Inputs'!AW84,'Standard Inputs'!AW92,'Standard Inputs'!AW100,'Standard Inputs'!AW108,'Standard Inputs'!AW116,'Standard Inputs'!AW124,'Standard Inputs'!AW132),\"<- You modified this design\",\"\"))","v":""}]
[null,null,null,null,null,null,null,{"$f":"IF(OR('Standard Inputs'!AV13,'Standard Inputs'!AV21,'Standard Inputs'!AV29,'Standard Inputs'!AV37,'Standard Inputs'!AV45,'Standard Inputs'!AV53,'Standard Inputs'!AV61,'Standard Inputs'!AV69,'Standard Inputs'!AV77,'Standard Inputs'!AV85,'Standard Inputs'!AV93,'Standard Inputs'!AV101,'Standard Inputs'!AV109,'Standard Inputs'!AV117,'Standard Inputs'!AV125,'Standard Inputs'!AV133),\"<- Using this design\",IF(OR('Standard Inputs'!AW13,'Standard Inputs'!AW21,'Standard Inputs'!AW29,'Standard Inputs'!AW37,'Standard Inputs'!AW45,'Standard Inputs'!AW53,'Standard Inputs'!AW61,'Standard Inputs'!AW69,'Standard Inputs'!AW77,'Standard Inputs'!AW85,'Standard Inputs'!AW93,'Standard Inputs'!AW101,'Standard Inputs'!AW109,'Standard Inputs'!AW117,'Standard Inputs'!AW125,'Standard Inputs'!AW133),\"<- You modified this design\",\"\"))","v":""}," See model documentation for more information on standard designs"]
[null,null,null,null,"Select \"CLEAR FOR MANUAL ENTRY\"",null,null,{"$f":"IF(OR('Standard Inputs'!AV14,'Standard Inputs'!AV22,'Standard Inputs'!AV30,'Standard Inputs'!AV38,'Standard Inputs'!AV46,'Standard Inputs'!AV54,'Standard Inputs'!AV62,'Standard Inputs'!AV70,'Standard Inputs'!AV78,'Standard Inputs'!AV86,'Standard Inputs'!AV94,'Standard Inputs'!AV102,'Standard Inputs'!AV110,'Standard Inputs'!AV118,'Standard Inputs'!AV126,'Standard Inputs'!AV134),\"<- Using this design\",IF(OR('Standard Inputs'!AW14,'Standard Inputs'!AW22,'Standard Inputs'!AW30,'Standard Inputs'!AW38,'Standard Inputs'!AW46,'Standard Inputs'!AW54,'Standard Inputs'!AW62,'Standard Inputs'!AW70,'Standard Inputs'!AW78,'Standard Inputs'!AW86,'Standard Inputs'!AW94,'Standard Inputs'!AW102,'Standard Inputs'!AW110,'Standard Inputs'!AW118,'Standard Inputs'!AW126,'Standard Inputs'!AW134),\"<- You modified this design\",\"\"))","v":""}]
[null,null,null,null,null,null,null,{"$f":"IF(OR('Standard Inputs'!AV15,'Standard Inputs'!AV23,'Standard Inputs'!AV31,'Standard Inputs'!AV39,'Standard Inputs'!AV47,'Standard Inputs'!AV55,'Standard Inputs'!AV63,'Standard Inputs'!AV71,'Standard Inputs'!AV79,'Standard Inputs'!AV87,'Standard Inputs'!AV95,'Standard Inputs'!AV103,'Standard Inputs'!AV111,'Standard Inputs'!AV119,'Standard Inputs'!AV127,'Standard Inputs'!AV135),\"<- Using this design\",IF(OR('Standard Inputs'!AW15,'Standard Inputs'!AW23,'Standard Inputs'!AW31,'Standard Inputs'!AW39,'Standard Inputs'!AW47,'Standard Inputs'!AW55,'Standard Inputs'!AW63,'Standard Inputs'!AW71,'Standard Inputs'!AW79,'Standard Inputs'!AW87,'Standard Inputs'!AW95,'Standard Inputs'!AW103,'Standard Inputs'!AW111,'Standard Inputs'!AW119,'Standard Inputs'!AW127,'Standard Inputs'!AW135),\"<- You modified this design\",\"\"))","v":""}]
[null,null,null,null,null,null,null,{"$f":"IF(OR('Standard Inputs'!AV16,'Standard Inputs'!AV24,'Standard Inputs'!AV32,'Standard Inputs'!AV40,'Standard Inputs'!AV48,'Standard Inputs'!AV56,'Standard Inputs'!AV64,'Standard Inputs'!AV72,'Standard Inputs'!AV80,'Standard Inputs'!AV88,'Standard Inputs'!AV96,'Standard Inputs'!AV104,'Standard Inputs'!AV112,'Standard Inputs'!AV120,'Standard Inputs'!AV128,'Standard Inputs'!AV136),\"<- Using this design\",IF(OR('Standard Inputs'!AW16,'Standard Inputs'!AW24,'Standard Inputs'!AW32,'Standard Inputs'!AW40,'Standard Inputs'!AW48,'Standard Inputs'!AW56,'Standard Inputs'!AW64,'Standard Inputs'!AW72,'Standard Inputs'!AW80,'Standard Inputs'!AW88,'Standard Inputs'!AW96,'Standard Inputs'!AW104,'Standard Inputs'!AW112,'Standard Inputs'!AW120,'Standard Inputs'!AW128,'Standard Inputs'!AW136),\"<- You modified this design\",\"\"))","v":""}]
[null,null,null,null,null,null,null,{"$f":"IF(COUNTIF(H7:H14,\"\")=8,\"Using a manual design\",\"\")","v":""},{"$f":"IF(COUNTIF(H7:H14,\"\")=16,\"Fill in all gold cells below\",\"\")","v":""}]
[null,null,null,null,"STEP 3:"]
[null,null,null,null,"(Optional for standard designs)"]
[null,null,{"$f":"AND(C32,C42,C49,C54,C70,C81,C97,C114)","v":true},null,"Enter or change values in the gold and blue cells below, under \"Manual Inputs\"",null,{"$f":"IF(ERRORNOTE<>\"\",ERRORNOTE,IF(C18,IF('Standard Inputs'!AV139,\"Input Complete -- Results Ready\",\"Input Complete--Press 'Run Design Program, Generate Results'\"),\"Input Incomplete--Check for Error Messages Below\"))","v":"Input Complete -- Results Ready"}]
[]
[null,null,null,null,"STEP 4:",null,null,null,"Results summary (see OUTPUT sheet for details)"]
[null,null,true,null,{"$f":"IF(input_status=\"input complete -- results ready\",\"Results are ready (no need to click button)\",\"Click here to generate results -->\")","v":"Results are ready (no need to click button)"},null,null,null,{"$f":"\"Direct Capital Cost: \" & IF(Missing_Cost,\"Missing cost!\",IF(cost_buildup_error,\"Cost buildup error!\",IF(input_status=\"input complete -- results ready\",IF(ISERROR(direct_cost),\"Calculation error!\",TEXT(direct_cost,\"$0,0\")),\"Input incomplete\")))","v":"Direct Capital Cost: $190,058"}]
[null,null,null,null,null,null,null,null,{"$f":"\"Total Capital Cost: \" & IF(Missing_Cost,\"Missing cost!\",IF(cost_buildup_error,\"Cost buildup error!\",IF(input_status=\"input complete -- results ready\",IF(ISERROR(system_cost),\"Calculation error!\",TEXT(system_cost,\"$0,0\")),\"Input incomplete\")))","v":"Total Capital Cost: Calculation error!"}]
[null,null,null,null,null,null,null,null,{"$f":"\"Annual O&M Cost: \"&IF(input_status=\"input complete -- results ready\",IF(ISERROR(om_cost),\"Calculation error!\",TEXT(om_cost,\"$0,0\")),\"Input incomplete\")","v":"Annual O&M Cost: $13,980"}]
[null,null,null,null,"MANUAL INPUTS",null,null,null,{"$f":"\"Annualized Cost: \"&IF(Missing_Cost,\"Missing Price!\",IF(cost_buildup_error,\"Cost buildup error!\",IF(input_status=\"input complete -- results ready\",IF(ISERROR(Annualized_Cost),\"Calculation error!\",TEXT(Annualized_Cost,\"$0,0\")&\" (\"&useful_life&\" years at \"&Discount_rate*100&\"%)\"),\"Input incomplete\")))","v":"Annualized Cost: Calculation error!"}]
[null,null,null,null,"Cells in gold are required; cells in blue are optional",null,null,null,{"$f":"IF(Missing_Cost,\"A price is not available for at least one required component. See Use? column on OUTPUT sheet.\",IF(cost_buildup_error,\"There is an Excel error in the price for at least one component. Please see the Use? column on OUTPUT sheet.\",IF(warning_details<>\"\",warning_details,\"\")))","v":""}]
[null,"Used?","Valid input?","Invalid reason?",null,null,null,"Select units"]
[null,null,null,null,"Design Flow (including bypass)","Qw_in",0.03,"MGD"]
[null,null,null,null,"Average Flow (including bypass)","Qwa_in",7.0000000000000001E-3,"MGD"]
[null,null,null,null,"For information:"]
[null,null,null,null,"Treatment system design flow",null,{"$f":"IF(ISERROR(design_flow),\"\",IF(df_units=\"gpm\",Design_Flow_Rate,IF(df_units=\"cubic meters/second\",QW, design_flow)))","v":0.03},{"$f":"IF(df_units=\"\",\"\",df_units)","v":"MGD"}]
[null,null,null,null,"Bypass design flow",null,{"$f":"IF(ISERROR(design_flow),\"\",IF(df_units=\"gpm\",bp_flow_rate, bp_flow_rate*60*24/10^6))","v":0},{"$f":"IF(df_units=\"\",\"\",df_units)","v":"MGD"},{"$f":"\"Current bypass percentage is \"&TEXT(bp_pct,\"0%\")&\".  Go to Critical Design Assumptions (link below) to change this value.\"","v":"Current bypass percentage is 0%.  Go to Critical Design Assumptions (link below) to change this value."}]
[null,null,{"$f":"IF(OR(df_units=\"\",af_units=\"\"),FALSE,IF(OR(average_flow>design_flow,average_flow<min_avg_flow*design_flow),FALSE,IF(OR(QW_IN=0,QWA_IN=0),FALSE,TRUE)))","v":true},{"$f":"IF(OR(df_units=\"\",af_units=\"\"),\"Choose units for design and average flow\",IF(average_flow>design_flow,\"The average flow should not be greater than the design flow\",IF(average_flow<design_flow*min_avg_flow,\"The average flow must be at least \" & min_avg_flow & \" times design flow\",IF(OR(QW_IN=0,QWA_IN=0),\"Input incomplete\",\"OK\"))))","v":"OK"},null," ",null,{"$f":"IF(C32,\"System Size Inputs OK\",D32)","v":"System Size Inputs OK"},"Adjust bypass percentage"]
[]
[null,null,null,null,"Influent concentration","Influent_conc",5,{"$f":"IF(contam=2,\"pCi/L\",\"ug/L\")","v":"ug/L"}]
[null,null,null,null,"Contaminant removal input type","Units_rem_I","effluent concentration","<--- pick one"]
[null,null,null,null,{"$f":"IF(Units_rem=1,\"Percent removal \", IF(Units_rem=2,\"Effluent concentration\",\"\"))","v":"Effluent concentration"},"Rem_I",0.5,{"$f":"IF(Units_rem=1,\"decimal between 0 and 1\",IF(contam=2,\"pCi/L\",\"ug/L\"))","v":"ug/L"}]
[null,null,null,null,"For information:"]
[null,null,null,null,{"$f":"IF(Units_rem=2,\"Percent Removal\", IF(Units_rem=1,\"Effluent concentration\",\"\"))","v":"Percent Removal"},null,{"$f":"IF(OR(Influent_conc=\"\",Units_rem_I=\"\"),\"\",IF(Units_rem=1,Influent_conc*(1-Rem_I),IF(Units_rem=2,TEXT(1-(Rem_I/Influent_conc),\"0.0%\"))))","v":"90.0%"},{"$f":"IF(Units_rem_I=\"effluent concentration\",\"\",IF(contam=2,\"pCi/L\",\"ug/L\"))","v":""}]
[]
[null,null,null,null,"Safety factor (Kla)","SF_Kla",1.4,"decimal greater than 1.0","Typical values are 1.2 to 1.4."]
[null,null,null,null,"Safety factor (Henry's)","SF_Henry",1.4,"decimal greater than 1.0","Typical values are 1.2 to 1.4."]
[null,null,{"$f":"IF(OR(Influent_conc=\"\",Units_rem_I=\"\",Rem_I=\"\",SF_KLA=\"\",SF_HENRY=\"\"),FALSE,IF(AND(Units_rem=1,Rem_I>=1),FALSE,IF(AND(Units_rem=2,Rem_I>=Influent_conc),FALSE,TRUE)))","v":true},{"$f":"IF(OR(Influent_conc=\"\",Units_rem_I=\"\",Rem_I=\"\",SF_KLA=\"\",SF_HENRY=\"\"),\"Removal Inputs Incomplete\",IF(AND(Units_rem=1,Rem_I>=1),\"Set percent removal to a decimal greater than 0 and less than 1\",IF(AND(Units_rem=2,Rem_I>=Influent_conc),\"Set effluent concentration less than influent concentration\",\"OK\")))","v":"OK"},null,null,null,{"$f":"IF(C42,\"Removal Inputs OK\",D42)","v":"Removal Inputs OK"}]
[]
[null,null,null,null,"Henry's coefficient","Henry",0.187,"atm m3/m3",{"$f":"\"Note: units for Henry's law constant MUST be atm m3/m3 at \"&OP_PRESS&\" atm and the operating temperature selected below.  For information on converting units, adjusting for temperature, and example coefficients for various contaminants, see the sheet 'Henry's Reference' (link below).\"","v":"Note: units for Henry's law constant MUST be atm m3/m3 at 1 atm and the operating temperature selected below.  For information on converting units, adjusting for temperature, and example coefficients for various contaminants, see the sheet 'Henry's Reference' (link below)."}]
[null,null,null,null,"Molecular weight of contaminant","Mw_in",131.38999999999999,"kg/kilomole","Henry's Coefficient Reference Sheet"]
[null,null,null,null,"Molar volume of contaminant","Mv_in",0.10199999999999999,"m3/kilomole"]
[null,null,null,null,"Boiling point of contaminant","Tb_in",359.7,"degrees Kelvin","If unknown, enter melting point instead"]
[null,null,null,null,"Melting point of contaminant","Tm_in",null,{"$f":"IF(NOT(ISBLANK(TB_IN)),\"not required\",\"degrees Kelvin\")","v":"not required"},"Required only if boiling point is not available"]
[null,null,{"$f":"IF(OR(HENRY=\"\",MW_IN=\"\",MV_IN=\"\",AND(TB_IN=\"\",TM_IN=\"\")),FALSE,TRUE)","v":true},{"$f":"IF(OR(HENRY=\"\",MW_IN=\"\",MV_IN=\"\",AND(TB_IN=\"\",TM_IN=\"\")),\"Contaminant inputs incomplete\",\"OK\")","v":"OK"},null,null,null,{"$f":"IF(C49,\"Contaminant Inputs OK\",D49)","v":"Contaminant Inputs OK"}]
[]
[null,null,null,null,"Operating temperature","T",283,"degrees Kelvin","Equilibrium operating temperature.  283 degrees K (10 degrees C) is typical of groundwater. If changed, also change air density and viscosity below, and change Henry's constant above.  See sheets \"Air Reference\" (link below) and \"Henry's Reference\" (link above) for information on changing these values."]
[null,null,null,null,"Density of air","PA",1.2470000000000001,"kg/m3","Adjust density and viscosity to match temperature using info on air reference sheet for other operating temperatures (see link below)."]
[null,null,null,null,"Viscosity of air","UA",1.7900000000000001E-5,"kg/m-sec","Air Reference Sheet"]
[null,null,{"$f":"IF(OR(T=\"\",PA=\"\",UA=\"\"),FALSE,TRUE)","v":true},{"$f":"IF(C54,\"OK\",\"Operating parameter inputs incomplete\")","v":"OK"},null,null,null,{"$f":"IF(C54,\"Operating Parameter Inputs OK\",D54)","v":"Operating Parameter Inputs OK"}]
[]
[null,null,{"$f":"NOT(Packing_size=\"\")","v":true},null,"Packing size","Packing_Size",2,"inches","Model default inputs are 2 inch tripacks"]
[null,null,{"$f":"NOT(AP=\"\")","v":true},null,"Surface area of packing","AP",157,"m2/m3","See packing reference sheet (link below) for alternate values for different packing materials"]
[null,null,{"$f":"NOT(SP=\"\")","v":true},null,"Critical surface tension of packing","SP",3.3000000000000002E-2,"kg/sec2","Packing Reference Sheet"]
[null,null,{"$f":"NOT(CF=\"\")","v":true},null,"Friction factor","CF",15]
[null,null,null,null,"Alternate packing unit cost","alt_pack_cost",null,"$/cubic meter","Optional. If a packing material other than the default is used, enter a unit cost here."]
[null,null,null,null,"Design program results (for information):",null,null,null,"Design program is using the following constraints:"]
[null,null,null,null,"Number of Columns (including redundancy)",null,{"$f":"IF(ISERROR(TOT_COL),\"\",TOT_COL)","v":2},"units",{"$f":"\"Minimum packing height to diameter ratio: \"&MIN_D_RAT&\"x column diameter\"","v":"Minimum packing height to diameter ratio: 1.5x column diameter"}]
[null,null,null,null,"Tower Height",null,{"$f":"IF(ISERROR(Shell_Height),\"\",ROUND(Shell_Height*3.3,1))","v":14.5},"ft",{"$f":"\"Maximum packing height to diameter ratio: \"&MAX_D_RAT&\"x column diameter\"","v":"Maximum packing height to diameter ratio: 10x column diameter"}]
[null,null,null,null,"Tower Diameter",null,{"$f":"IF(ISERROR(D),\"\",ROUND(D*3.3,0))","v":1},"ft",{"$f":"\"Maximum packing height: \"&MAX_PACK&\" meters (\"&MAX_PACK*3.28&\" feet)\"","v":"Maximum packing height: 6.1 meters (20.008 feet)"}]
[null,null,null,null,"Air-To-Water Ratio",null,{"$f":"RATIO&\":1\"","v":"93:1"},null,{"$f":"\"Maximum column area: \"&MAX_AREA&\" sq. meters (\"&TEXT(MAX_AREA*(3.28^2),\"0.0\")&\" sq. feet)\"","v":"Maximum column area: 7.258 sq. meters (78.1 sq. feet)"}]
[null,null,null,null,"Liquid Loading Rate",null,{"$f":"L_LOAD","v":6.5861483130000027E-3},"m3/m2 - sec",{"$f":"\"Minimum column area: \"&MIN_AREA&\" sq. meters (\"&TEXT(MIN_AREA*(3.28^2),\"0.0\")&\" sq. feet)\"","v":"Minimum column area: 0.01825 sq. meters (0.2 sq. feet)"}]
[null,null,null,null,"Air Loading Rate",null,{"$f":"G_LOAD","v":0.61251179310900028},"m3/m2 - sec","Adjust column design program constraints"]
[]
[null,null,{"$f":"NOT(AW_DET=\"\")","v":true},null,"Clearwell detention time","AW_Det",5,"minutes","Guidance: 5 to 10 minutes. Enter 0 to remove clearwell (e.g., use existing clearwell)"]
[null,null,{"$f":"IF(NOT(AND(C56:C59,C69)),FALSE,TRUE)","v":true},{"$f":"IF(NOT(C70),\"Tower Design Inputs Incomplete\",\"OK\")","v":"OK"},null,null,null,{"$f":"IF(C70,\"Tower Design Inputs OK\",D70)","v":"Tower Design Inputs OK"}]
[]
[null,null,{"$f":"IF(contam=2,TRUE,NOT(max_VOC_release=\"\"))","v":true},null,"VOC release at which air pollution control system is needed","max_VOC_release",1,{"$f":"IF(contam=2,\"not required\",\"lbs/day\")","v":"lbs/day"},{"$f":"IF(contam=2,\"\",\"CMRP (2000) states 1 lb/day is the maximum emission level for all VOCs for California South Coast AQMD, but other districts may require different emissions standards based on location of the site and regional ambient air quality.\")","v":"CMRP (2000) states 1 lb/day is the maximum emission level for all VOCs for California South Coast AQMD, but other districts may require different emissions standards based on location of the site and regional ambient air quality."}]
[null,null,null,null,"For information:",null,{"$f":"IF(contam=2,\"Available off-gas control options not relevant for radon\",IF(max_VOC_release=\"\",\"\",IF(VOC_Release>max_VOC_release,\"Off-gas control system may be required if contaminant is a regulated VOC\",\"Off-gas control system may not be required\")))","v":"Off-gas control system may not be required"}]
[]
[null,null,{"$f":"IF(contam=2,TRUE,NOT(Offgas_Tech_I=\"\"))","v":true},null,"Off-gas pollution control technology","Offgas_Tech_I","none",{"$f":"IF(contam=2,\"not required\",\"<--- pick one\")","v":"<--- pick one"}]
[null,{"$f":"OR(Offgas_Tech=2,Offgas_Tech=3)","v":false},{"$f":"IF(B76,NOT(og_opt1_I=\"\"),TRUE)","v":true},null,"Heat recovery type","og_opt1_I","none",{"$f":"IF(NOT(B76),\"not required\",\"<--- pick one\")","v":"not required"}]
[null,{"$f":"Offgas_Tech=1","v":false},{"$f":"IF(B77,NOT(og_opt2_I=\"\"),TRUE)","v":true},null,"Spent GAC regeneration","og_opt2_I",null,{"$f":"IF(NOT(B77),\"not required\",\"<--- pick one\")","v":"not required"}]
[null,{"$f":"Offgas_Tech=1","v":false},{"$f":"IF(B77,IF(contam=1,TRUE,NOT(og_opt3=\"\")),TRUE)","v":true},null,{"$f":"\"GAC bed life\"&IF(contam=1,\" (optional)\",\"\")","v":"GAC bed life"},"og_opt3",null,{"$f":"IF(NOT(B78),\"not required\",\"months\")","v":"not required"},{"$f":"IF(AND(Offgas_Tech=1,contam=1),\"Leave blank to use default calculation\",\"\")","v":""}]
[null,null,null,null,{"$f":"IF(AND(Offgas_Tech=1,og_opt3=\"\",contam=1),\"For information:\",\"\")","v":""}]
[null,null,null,null,{"$f":"IF(AND(Offgas_Tech=1,og_opt3=\"\",contam=1),\"Calculated GAC bed life\",\"\")","v":""},null,{"$f":"IF(AND(Offgas_Tech=1,og_opt3=\"\",contam=1),bed_life,\"\")","v":""},{"$f":"IF(AND(Offgas_Tech=1,og_opt3=\"\",contam=1),\"months\",\"\")","v":""}]
[null,null,{"$f":"IF(NOT(AND(C72,C75:C78)),FALSE,TRUE)","v":true},{"$f":"IF(NOT(C81),\"Offgas Inputs Incomplete\",\"OK\")","v":"OK"},null,null,null,{"$f":"IF(C81,\"Off-gas Inputs OK\",D81)","v":"Off-gas Inputs OK"}]
[]
[null,null,null,null,"Number of booster pumps","num_pumps_I",null,"pumps","Enter 0 to exclude booster pumps (e.g., use existing pumps). Leave blank to accept model default calculations (which always include pumps for this technology)"]
[null,null,{"$f":"IF(ISERROR(QP),FALSE,IF(QP>max_pump_size,FALSE,TRUE))","v":true},{"$f":"IF(C84=FALSE,\"Warning: insufficient number of pumps\",\"\")","v":""},"For information: # of booster pumps",null,{"$f":"IF(ISERROR(NUM_OF_PUMPS),\"\",NUM_OF_PUMPS)","v":2},"pumps"]
[]
[null,null,null,null,"Number of blowers","parallel_I",null,"blowers","Designs should always include at least one blower. Leave blank to accept model default calculations."]
[null,null,{"$f":"IF(ISERROR(Q_BLOWER),FALSE,IF(Q_BLOWER>max_blow_size,FALSE,TRUE))","v":true},{"$f":"IF(C87=FALSE,\"Warning: insufficient number of blowers\",\"\")","v":""},"For information: # of blowers",null,{"$f":"IF(ISERROR(PARALLEL),\"\",PARALLEL)","v":2},"blowers"]
[]
[null,null,null,null,"Number of redundant columns to be added","NRD_I",null,"units","Leave blank to accept redundancy frequency specified in critical design assumptions"]
[null,null,null,null,"For information: Redundant columns",null,{"$f":"IF(ISERROR(NRD_col),\"\",NRD_col)","v":0},"units"]
[null,null,null,null,"Component level","component_level_I",null,"<-- pick or leave blank","Leave blank to use low cost components"]
[null,null,null,null,"System automation","manual_I","fully automated","<-- pick or leave blank","Leave blank to allow model to pick based on component level"]
[null,null,null,null,"For information: Component level",null,{"$f":"IF(component_level=2,\"high cost\",IF(component_level=1,\"mid cost\",\"low cost\"))","v":"low cost"}]
[null,null,null,null,"Automation",null,{"$f":"IF(manual=1,\"manual\",IF(manual=2,\"semi-automated\",IF(manual=3,\"fully automated\")))","v":"fully automated"}]
[null,null,null,null,null,null,null,{"$f":"D84","v":""}]
[null,null,null,null,null,null,null,{"$f":"D87","v":""}]
[null,null,{"$f":"IF(NOT(AND(C84,C87)),FALSE,TRUE)","v":true},{"$f":"IF(NOT(C97),\"Optional Inputs Incomplete\",\"OK\")","v":"OK"},null,null,null,{"$f":"IF(C97,\"Optional Inputs OK\",D97)","v":"Optional Inputs OK"}]
[]
[null,null,null,null,"Retrofit","retrofit_I",null,"<-- pick or leave blank","Select to calculate costs to retrofit a system for a new contaminant or greater removal"]
[null,{"$f":"IF(retrofit=1,TRUE,FALSE)","v":false},{"$f":"IF(r_xtraheight_I=\"\",TRUE,IF(r_xtraheight_units=\"\",FALSE,TRUE))","v":true},null,"Additional height added per tower","r_xtraheight_I",null,null,{"$f":"IF(retrofit=0,\"\",\"Current height between redistribution rings is \"&r_ring_space_ft&\" ft. Enter 0 or leave blank to retrofit by adjusting air-to-water ratio only\")","v":""}]
[null,{"$f":"IF(r_new_contam=1,TRUE,FALSE)","v":false},{"$f":"IF(B101,NOT(r_Henry=\"\"),TRUE)","v":true},null,"Henry's coefficient for new contaminant","r_Henry",null,{"$f":"IF(B101,\"atm m3/m3\",\"not required\")","v":"not required"},"See above for notes on Henry's constant"]
[null,false,{"$f":"IF(B102,NOT(r_Mw_in=\"\"),TRUE)","v":true},null,"Molecular weight of new contaminant","r_Mw_in",null,{"$f":"IF(B102,\"kg/kilomole\",\"not required\")","v":"not required"}]
[null,false,{"$f":"IF(B103,NOT(r_Mv_in=\"\"),TRUE)","v":true},null,"Molar volume of new contaminant","r_Mv_in",null,{"$f":"IF(B103,\"m3/kilomole\",\"not required\")","v":"not required"}]
[null,false,{"$f":"IF(B104,NOT(r_Tb_in=\"\"),TRUE)","v":true},null,"Boiling point of new contaminant","r_Tb_in",null,{"$f":"IF(B104,\"degrees Kelvin\",\"not required\")","v":"not required"}]
[null,{"$f":"IF(r_new_contam=1,IF(r_Tb_in=\"\",TRUE,FALSE),FALSE)","v":false},{"$f":"IF(B105,NOT(r_Tm_in=\"\"),TRUE)","v":true},null,"Melting point of new contaminant","r_Tm_in",null,{"$f":"IF(B105,\"degrees Kelvin\",\"not required\")","v":"not required"}]
[null,false,{"$f":"IF(B106,NOT(r_influent_conc_I=\"\"),TRUE)","v":true},null,"Influent concentration of new contaminant","r_influent_conc_I",null,{"$f":"IF(B106,\"ug/L\",\"not required\")","v":"not required"}]
[null,false,{"$f":"IF(B107,NOT(r_units_rem_I=\"\"),TRUE)","v":true},null,"Removal input type for new contaminant","r_units_rem_I",null,{"$f":"IF(B107,\"<--- pick one\",\"not required\")","v":"not required"}]
[null,{"$f":"IF(retrofit=1,TRUE,FALSE)","v":false},{"$f":"IF(NOT(B108),TRUE,IF(r_rem_I=\"\",FALSE,IF(AND(r_units_rem=1,r_rem_I>=1),FALSE,IF(AND(r_units_rem=2,r_rem_I>=r_influent_conc),FALSE,IF(r_new_contam=0,CHOOSE(r_units_rem,r_rem_I>Rem_I,r_rem_I<Rem_I),TRUE)))))","v":true},null,{"$f":"IF(r_new_contam=1,IF(r_units_rem=1,\"Percent removal for new contaminant\", IF(r_units_rem=2,\"Effluent concentration of new contaminant\",\"\")),IF(r_units_rem=1,\"New percent removal\", IF(r_units_rem=2,\"New effluent concentration\",\"\")))","v":"New effluent concentration"},"r_rem_I",null,{"$f":"IF(B108,IF(r_units_rem=1,\"decimal between 0 and 1\",IF(AND(contam=2,r_new_contam=0),\"pCi/L\",\"ug/L\")),\"not required\")","v":"not required"}]
[null,null,null,null,{"$f":"IF(r_new_contam=1,\"\",\"For information:\")","v":"For information:"}]
[null,null,null,null,{"$f":"IF(r_new_contam=1,\"For Information:\",\"Original \"&IF(Units_rem=2,\"percent removal\", IF(Units_rem=1,\"effluent concentration\",\"\")))","v":"Original percent removal"},null,{"$f":"IF(OR(retrofit=0,r_influent_conc=\"\",r_units_rem=\"\",r_new_contam=1),\"\",G38)","v":""},{"$f":"IF(OR(retrofit=0,r_units_rem=2,r_new_contam=1),\"\",IF(contam=2,\"pCi/L\",\"ug/L\"))","v":""}]
[null,null,null,null,{"$f":"IF(r_new_contam=1,IF(r_units_rem=2,\"Percent removal for new contaminant\", IF(r_units_rem=1,\"Effluent concentration of new contaminant\",\"\")),IF(r_units_rem=2,\"New percent removal\", IF(r_units_rem=1,\"New effluent concentration\",\"\")))","v":"New percent removal"},null,{"$f":"IF(retrofit=0,\"\",IF(AND(r_new_contam=1,OR(r_influent_conc_I=\"\",r_units_rem_I=\"\")),\"\",IF(r_rem_I=\"\",\"\",IF(r_units_rem=1,r_influent_conc*(1-r_rem_I),IF(r_units_rem=2,TEXT(r_P_REM,\"0.0%\"))))))","v":""},{"$f":"IF(OR(retrofit=0,r_units_rem=2),\"\",IF(AND(contam=2,r_new_contam=0),\"pCi/L\",\"ug/L\"))","v":""}]
[null,null,null,null,"New tower height",null,{"$f":"IF(OR(ISERROR(r_Shell_height),retrofit=0),\"\",IF(r_xtraheight=0,\"unchanged\",ROUND(r_Shell_height*3.3,1)))","v":""},{"$f":"IF(OR(retrofit=0,r_xtraheight=0),\"\",\"ft\")","v":""}]
[null,null,null,null,"New air-to-water ratio",null,{"$f":"IF(retrofit=0,\"\",IF(r_RATIO=RATIO,\"unchanged\",r_RATIO&\":1\"))","v":""}]
[null,null,{"$f":"IF(NOT(AND(C100:C108)),FALSE,TRUE)","v":true},{"$f":"IF(NOT(C114),IF(AND(r_units_rem=1,r_rem_I>=1),\"Set percent removal to a decimal greater than 0 and less than 1\",IF(AND(r_new_contam=1,r_units_rem=2,r_rem_I>=r_influent_conc),\"Set effluent concentration less than influent concentration\",IF(AND(r_new_contam=0,OR(AND(r_units_rem=1,r_rem_I<=Rem_I),AND(r_units_rem=2,r_rem_I>=Rem_I))),\"New removal must be greater than old removal\",IF(AND(B100,NOT(C100)),\"Choose units for additional tower height\",\"Retrofit Inputs Incomplete\")))),\"OK\")","v":"OK"},null,null,null,{"$f":"IF(C114,\"Retrofit Inputs OK\",D114)","v":"Retrofit Inputs OK"}]

{"sheet":"OUTPUT","index":3,"n_rows":411,"n_cols":35,"rows_kept":411,"cut":false,"hidden":false,"merged":[[335,2,335,3],[27,22,29,22],[27,8,29,8],[27,9,29,9],[27,10,29,10],[27,11,29,11],[27,12,29,12],[27,13,27,21],[28,13,28,15],[28,16,28,18],[27,0,29,0],[27,1,29,1],[27,2,29,3],[27,4,29,5],[27,6,29,7],[27,32,28,33],[335,4,335,5],[28,19,28,21],[27,23,27,31],[28,23,28,25],[28,26,28,28],[28,29,28,31]]}
["OUTPUT SUMMARY"]
[null,"Parameter","Value","Units"]
[null,"Technology","PTA"]
[null,"Contaminant Type",{"$f":"VLOOKUP(contam,contaminant_lookup,2)&IF(retrofit=1,\" Retrofit\",\"\")","v":"TCE"}]
[null,{"$f":"IF(retrofit=1,\"Original \",\"\")&\"Percent Removal\"","v":"Percent Removal"},{"$f":"P_REM","v":0.9}]
[null,"System Size Category",{"$f":"IF(ss_cat2=1,\"small\",\"large\")","v":"small"}]
[null,"Design Flow",{"$f":"design_flow","v":0.03},"MGD (excludes bypass flow)"]
[null,"Average Flow",{"$f":"average_flow","v":7.0000000000000001E-3},"MGD (excludes bypass flow)"]
[null,{"$f":"IF(retrofit=1,\"Original Tower Height\",\"Tower Height\")","v":"Tower Height"},{"$f":"ROUND(Shell_Height*3.3,0)","v":15},"ft"]
[null,"Tower Diameter",{"$f":"ROUND(D*3.3,0)","v":1},"ft"]
[null,{"$f":"IF(retrofit=1,\"Original A:W Ratio\",\"Air-To-Water Ratio\")","v":"Air-To-Water Ratio"},{"$f":"RATIO&\":1\"","v":"93:1"}]
[null,"Liquid Loading Rate",{"$f":"L_LOAD","v":6.5861483130000027E-3},"m3/m2 - sec"]
[null,{"$f":"IF(retrofit=1,\"Original Air Load Rate\",\"Air Loading Rate\")","v":"Air Loading Rate"},{"$f":"G_LOAD","v":0.61251179310900028},"m3/m2 - sec"]
[null,"Off-Gas Treatment",{"$f":"IF(Offgas_Tech_I=\"\",\"none\",Offgas_Tech_I)","v":"none"}]
[]
[]
[null,{"$f":"\"Resulting Costs (in year \"&TEXT(current_year_cl,0)&\" dollars)\"","v":"Resulting Costs (in year 2013 dollars)"}]
[null,"Direct Capital Cost",{"$f":"IF(input_status<>\"input complete -- results ready\",\"Input incomplete\",IF(Missing_Cost,\"Missing cost!\",IF(cost_buildup_error,\"Error in buildup!\",direct_cost)))","v":190058.30235963842},"Details"]
[null,"Add-on Cost",{"$f":"IF(input_status<>\"input complete -- results ready\",\"Input incomplete\",addon_cost)","v":{"$error":"#NAME?"}},"Details"]
[null,"Indirect Capital Cost",{"$f":"IF(input_status<>\"input complete -- results ready\",\"Input incomplete\",indirect_cost)","v":{"$error":"#NAME?"}},"Details",{"$f":"IF(retrofit=1,\"After Retrofit:\",\"\")","v":""}]
[null,"Total Capital Cost",{"$f":"IF(input_status<>\"input complete -- results ready\",\"Input incomplete\",IF(Missing_Cost,\"Missing cost!\",IF(cost_buildup_error,\"Error in buildup!\",system_cost)))","v":{"$error":"#NAME?"}},"Details",{"$f":"IF(retrofit=1,\"New Tower Height\",\"\")","v":""},{"$f":"IF(OR(ISERROR(r_Shell_height),retrofit=0),\"\",IF(r_xtraheight=0,\"unchanged\",ROUND(r_Shell_height*3.3,1)))","v":""},{"$f":"IF(retrofit=1,\"ft\",\"\")","v":""}]
[null,"Annual O&M Cost",{"$f":"IF(input_status<>\"input complete -- results ready\",\"Input incomplete\",om_cost)","v":13979.99594020919},"Details",{"$f":"IF(retrofit=1,\"New A:W Ratio\",\"\")","v":""},{"$f":"IF(retrofit=0,\"\",IF(r_RATIO=RATIO,\"unchanged\",r_RATIO&\":1\"))","v":""}]
[null,{"$f":"\"Annualized Cost \"&IF(OR(input_status<>\"input complete -- results ready\",Missing_Cost,cost_buildup_error),\"\",\"(\"&useful_life&\" years at \"&Discount_rate*100&\"%)\")","v":{"$error":"#NAME?"}},{"$f":"IF(input_status<>\"input complete -- results ready\",\"Input incomplete\",IF(Missing_Cost,\"Missing cost!\",IF(cost_buildup_error,\"Error in buildup!\",Annualized_Cost)))","v":{"$error":"#NAME?"}},"Details",{"$f":"IF(retrofit=1,\"New Air Load Rate\",\"\")","v":""},{"$f":"IF(retrofit=0,\"\",IF(r_RATIO=RATIO,\"unchanged\",r_G_Load))","v":""},{"$f":"IF(retrofit=1,\"m3/m2 - sec\",\"\")","v":""}]
[null,"Per 1,000 gallons average flow",{"$f":"IF(input_status<>\"input complete -- results ready\",\"Input incomplete\",IF(Missing_Cost,\"Missing cost!\",IF(cost_buildup_error,\"Error in buildup!\",C385)))","v":{"$error":"#NAME?"}}]
[null,"Per household per year",{"$f":"IF(input_status<>\"input complete -- results ready\",\"Input incomplete\",IF(Missing_Cost,\"Missing cost!\",IF(cost_buildup_error,\"Error in buildup!\",C386)))","v":{"$error":"#NAME?"}}]
[]
["Direct Capital Cost Details (items in italics, without a 1 in the \"Use?\" column, represent alternate costs and are excluded from total)"]
["WBS #","Item","Design Quantity",null,"Design Size",null,"Size used in estimate",null,"Unit Cost","Total Cost","Useful Life","Use?","Full Line Item Name","Resulting priority selection (after considering whether this is a retrofit scenario)",null,null,null,null,null,null,null,null,"Include in Retrofit?","Baseline priority selection",null,null,null,null,null,null,null,null,"Useful Life"]
[null,null,null,null,null,null,null,null,null,null,null,null,null,"Small (<1 mgd)",null,null,"Medium (1-10 mgd)",null,null,"Large (>10 mgd)",null,null,null,"Small (<1 mgd)",null,null,"Medium (1-10 mgd)",null,null,"Large (>10 mgd)"]
[null,null,null,null,null,null,null,null,null,null,null,null,null,"Low","Mid","High","Low","Mid","High","Low","Mid","High",null,"Low","Mid","High","Low","Mid","High","Low","Mid","High","Count?","Depreciation"]
["1.","Aeration Columns"]
["1.1","Shell"]
["1.1.1","Stainless Steel",{"$f":"TOT_COL","v":2},"units",{"$f":"col_vol","v":121.32373803711515},"gal",{"$f":"IF(curve=1,col_vol,VLOOKUP(col_vol,ss_shell_cost_cl,2))","v":121.32373803711515},"gal",{"$f":"IF(curve=1,ss_shell_eq,VLOOKUP(col_vol,ss_shell_cost_cl,3))","v":26378.308748081439},{"$f":"IF(I33=\"contact vendor\",\"--\",C33*I33)","v":52756.617496162879},{"$f":"VLOOKUP(col_vol,ss_shell_cost_cl,IF(ss_cat=\"large\",4,5))","v":20},0,{"$f":"$B$31&\" - \"&$B$32&\" - \"&B33","v":"Aeration Columns - Shell - Stainless Steel"},{"$f":"IF(retrofit=1,$W33*X33,IF(ISBLANK(X33),\"\",X33))","v":3},3,1,3,3,1,3,{"$f":"IF(retrofit=1,$W33*AE33,IF(ISBLANK(AE33),\"\",AE33))","v":3},1,0,3,3,1,3,3,1,3,3,1,{"$f":"IF(ISERROR(K33*L33),0,IF(K33<1,0,L33))","v":0},{"$f":"IF(AG33,J33/K33,0)","v":0}]
["1.1.1","Fiberglass",{"$f":"TOT_COL","v":2},"units",{"$f":"col_vol","v":121.32373803711515},"gal",{"$f":"IF(curve=1,col_vol,VLOOKUP(col_vol,fg_shell_cost_cl,2))","v":121.32373803711515},"gal",{"$f":"IF(curve=1,fg_shell_eq,VLOOKUP(col_vol,fg_shell_cost_cl,3))","v":23400.996900552374},{"$f":"IF(I34=\"contact vendor\",\"--\",C34*I34)","v":46801.993801104749},{"$f":"VLOOKUP(col_vol,fg_shell_cost_cl,IF(ss_cat=\"large\",4,5))","v":18},1,{"$f":"$B$31&\" - \"&$B$32&\" - \"&B34","v":"Aeration Columns - Shell - Fiberglass"},1,2,2,1,2,2,1,2,2,0,1,2,2,1,2,2,1,2,2,1,2600.1107667280417]
["1.1.1","Aluminum",{"$f":"TOT_COL","v":2},"units",{"$f":"col_vol","v":121.32373803711515},"gal",{"$f":"IF(curve=1,col_vol,VLOOKUP(col_vol,al_shell_cost_cl,2))","v":121.32373803711515},"gal",{"$f":"IF(curve=1,al_shell_eq,VLOOKUP(col_vol,al_shell_cost_cl,3))","v":21609.518617549216},{"$f":"IF(I35=\"contact vendor\",\"--\",C35*I35)","v":43219.037235098433},{"$f":"VLOOKUP(col_vol,al_shell_cost_cl,IF(ss_cat=\"large\",4,5))","v":20},0,{"$f":"$B$31&\" - \"&$B$32&\" - \"&B35","v":"Aeration Columns - Shell - Aluminum"},2,1,3,2,1,3,2,1,3,0,2,1,3,2,1,3,2,1,3,0,0]
["1.2","Support Plate",null,null,null,null,null,null,null,null,null,null,null,null,null,null,null,null,null,null,null,null,null,null,null,null,null,null,null,null,null,null,0,0]
["1.2.1","Stainless Steel",{"$f":"TOT_COL","v":2},"units",{"$f":"AREA","v":0.10437815356254335},"square m",{"$f":"IF(curve=1,AREA,VLOOKUP(AREA,ss_splate_cost_cl,2))","v":0.10437815356254335},"square m",{"$f":"IF(curve=1,ss_splate_eq,VLOOKUP(AREA,ss_splate_cost_cl,3))","v":977.44498608365575},{"$f":"IF(I37=\"contact vendor\",\"--\",C37*I37)","v":1954.8899721673115},{"$f":"VLOOKUP(AREA,ss_splate_cost_cl,IF(ss_cat=\"large\",4,5))","v":30},0,{"$f":"$B$31&\" - \"&$B$36&\" - \"&B37","v":"Aeration Columns - Support Plate - Stainless Steel"},{"$f":"IF(retrofit=1,$W37*X37,IF(ISBLANK(X37),\"\",X37))","v":2},1,1,2,1,1,2,1,1,0,2,1,1,2,1,1,2,1,1,0,0]
["1.2.1","Plastic",{"$f":"TOT_COL","v":2},"units",{"$f":"AREA","v":0.10437815356254335},"square m",{"$f":"IF(curve=1,AREA,VLOOKUP(AREA,pl_splate_cost_cl,2))","v":0.10437815356254335},"square m",{"$f":"IF(curve=1,pl_splate_eq,VLOOKUP(AREA,pl_splate_cost_cl,3))","v":1819.4071729119194},{"$f":"IF(I38=\"contact vendor\",\"--\",C38*I38)","v":3638.8143458238387},{"$f":"VLOOKUP(AREA,pl_splate_cost_cl,IF(ss_cat=\"large\",4,5))","v":20},1,{"$f":"$B$31&\" - \"&$B$36&\" - \"&B38","v":"Aeration Columns - Support Plate - Plastic"},1,2,2,1,2,2,1,2,2,0,1,2,2,1,2,2,1,2,2,1,181.94071729119193]
["1.3","Liquid Distributor",null,null,null,null,null,null,null,null,null,null,null,null,null,null,null,null,null,null,null,null,null,null,null,null,null,null,null,null,null,null,0,0]
["1.3.1","Stainless Steel",{"$f":"TOT_COL","v":2},"units",{"$f":"AREA","v":0.10437815356254335},"square m",{"$f":"IF(curve=1,AREA,VLOOKUP(AREA,ss_ldist_cost_cl,2))","v":0.10437815356254335},"square m",{"$f":"IF(curve=1,ss_ldist_eq,VLOOKUP(AREA,ss_ldist_cost_cl,3))","v":1823.669054908951},{"$f":"IF(I40=\"contact vendor\",\"--\",C40*I40)","v":3647.338109817902},{"$f":"VLOOKUP(AREA,ss_ldist_cost_cl,IF(ss_cat=\"large\",4,5))","v":30},0,{"$f":"$B$31&\" - \"&$B$39&\" - \"&B40","v":"Aeration Columns - Liquid Distributor - Stainless Steel"},{"$f":"IF(retrofit=1,$W40*X40,IF(ISBLANK(X40),\"\",X40))","v":2},1,1,2,1,1,2,1,1,0,2,1,1,2,1,1,2,1,1,0,0]
["1.3.1","Plastic",{"$f":"TOT_COL","v":2},"units",{"$f":"AREA","v":0.10437815356254335},"square m",{"$f":"IF(curve=1,AREA,VLOOKUP(AREA,pl_ldist_cost_cl,2))","v":0.10437815356254335},"square m",{"$f":"IF(curve=1,pl_ldist_eq,VLOOKUP(AREA,pl_ldist_cost_cl,3))","v":2615.1902610591601},{"$f":"IF(I41=\"contact vendor\",\"--\",C41*I41)","v":5230.3805221183202},{"$f":"VLOOKUP(AREA,pl_ldist_cost_cl,IF(ss_cat=\"large\",4,5))","v":20},1,{"$f":"$B$31&\" - \"&$B$39&\" - \"&B41","v":"Aeration Columns - Liquid Distributor - Plastic"},1,2,2,1,2,2,1,2,2,0,1,2,2,1,2,2,1,2,2,1,261.519026105916]
["1.4","Liquid Redistributor",null,null,null,null,null,null,null,null,null,null,null,null,null,null,null,null,null,null,null,null,null,null,null,null,null,null,null,null,null,null,0,0]
["1.4.1","Stainless Steel",{"$f":"tot_R","v":2},"units",{"$f":"AREA","v":0.10437815356254335},"square m",{"$f":"IF(curve=1,AREA,VLOOKUP(AREA,ss_redist_cost_cl,2))","v":0.10437815356254335},"square m",{"$f":"IF(curve=1,ss_redist_eq,VLOOKUP(AREA,ss_redist_cost_cl,3))","v":1965.1562211213852},{"$f":"IF(I43=\"contact vendor\",\"--\",C43*I43)","v":3930.3124422427704},{"$f":"VLOOKUP(AREA,ss_redist_cost_cl,IF(ss_cat=\"large\",4,5))","v":30},0,{"$f":"$B$31&\" - \"&$B$42&\" - \"&B43","v":"Aeration Columns - Liquid Redistributor - Stainless Steel"},{"$f":"IF(retrofit=1,$W43*X43,IF(ISBLANK(X43),\"\",X43))","v":2},1,1,2,1,1,2,{"$f":"IF(retrofit=1,$W43*AE43,IF(ISBLANK(AE43),\"\",AE43))","v":1},1,0,2,1,1,2,1,1,2,1,1,0,0]
["1.4.1","Plastic",{"$f":"tot_R","v":2},"units",{"$f":"AREA","v":0.10437815356254335},"square m",{"$f":"IF(curve=1,AREA,VLOOKUP(AREA,pl_redist_cost_cl,2))","v":0.10437815356254335},"square m",{"$f":"IF(curve=1,pl_redist_eq,VLOOKUP(AREA,pl_redist_cost_cl,3))","v":2633.6692293491569},{"$f":"IF(I44=\"contact vendor\",\"--\",C44*I44)","v":5267.3384586983138},{"$f":"VLOOKUP(AREA,pl_redist_cost_cl,IF(ss_cat=\"large\",4,5))","v":20},1,{"$f":"$B$31&\" - \"&$B$42&\" - \"&B44","v":"Aeration Columns - Liquid Redistributor - Plastic"},1,2,2,1,2,2,1,2,2,0,1,2,2,1,2,2,1,2,2,1,263.36692293491569]
["1.5","Packing",{"$f":"Pv_ft","v":25.314375228201527},"cubic ft",{"$f":"Packing_size","v":2},"inches",{"$f":"IF(alt_pack_cost=\"\",VLOOKUP(Packing_size,packing_cost_cl,2),Packing_size)","v":2},"inches",{"$f":"IF(alt_pack_cost=\"\",VLOOKUP(Packing_size,packing_cost_cl,3),alt_pack_cost)","v":22.900945456345042},{"$f":"IF(I45=\"contact vendor\",\"--\",C45*I45)","v":579.72312636249524},{"$f":"VLOOKUP(Packing_size,packing_cost_cl,IF(ss_cat=\"large\",4,5))","v":20},1,{"$f":"$B$31&\" - \"&B45","v":"Aeration Columns - Packing"},1,1,1,1,1,1,1,1,1,0,1,1,1,1,1,1,1,1,1,1,28.986156318124763]
["2.","Pumps and Blowers",null,null,null,null,null,null,null,null,null,null,null,null,null,null,null,null,null,null,null,null,null,null,null,null,null,null,null,null,null,null,0,0]
["2.1","Booster Pumps",{"$f":"tot_pumps","v":2},"units",{"$f":"QP","v":13.020833333333332},"gpm",{"$f":"IF(curve=1,QP,VLOOKUP(QP,pump_cost_cl,2))","v":13.020833333333332},"gpm",{"$f":"IF(C47=0,\"NA\",IF(curve=1,pump_eq,VLOOKUP(QP,pump_cost_cl,3)))","v":5960.3761052926784},{"$f":"IF(I47=\"contact vendor\",\"--\",C47*I47)","v":11920.752210585357},{"$f":"VLOOKUP(QP,pump_cost_cl,IF(ss_cat=\"large\",4,5))","v":17},1,{"$f":"$B$46&\" - \"&B47","v":"Pumps and Blowers - Booster Pumps"},{"$f":"IF(retrofit=1,$W47*X47,IF(ISBLANK(X47),\"\",X47))","v":1},1,1,1,1,1,1,1,1,0,1,1,1,1,1,1,1,1,1,1,701.22071826972683]
["2.2","Acid Metering Pumps",null,null,null,null,null,null,null,null,null,null,null,null,null,null,null,null,null,null,null,null,null,null,null,null,null,null,null,null,null,null,0,0]
["2.2.1","PVC - Motor Driven",{"$f":"HCl_pumps","v":0},"units",{"$f":"IF(C49=0,\"NA\",HCl_pump_rate)","v":"NA"},{"$f":"IF(C49=0,\"\",\"gph\")","v":""},{"$f":"IF(C49=0,\"NA\",IF(curve=1,HCl_pump_rate,VLOOKUP(HCl_pump_rate,pvc_mmpump_cost_cl,2)))","v":"NA"},{"$f":"IF(C49=0,\"\",\"gph\")","v":""},{"$f":"IF(C49=0,\"NA\",IF(curve=1,pvc_mmpump_eq_hcl,VLOOKUP(HCl_pump_rate,pvc_mmpump_cost_cl,3)))","v":"NA"},{"$f":"IF(C49=0,\"--\",IF(I49=\"contact vendor\",\"--\",C49*I49))","v":"--"},{"$f":"IF(C49=0,\"NA\",VLOOKUP(HCl_pump_rate,pvc_mmpump_cost_cl,IF(ss_cat=\"large\",4,5)))","v":"NA"},null,{"$f":"$B$46&\" - \"&$B$48&\" - \"&B49","v":"Pumps and Blowers - Acid Metering Pumps - PVC - Motor Driven"},{"$f":"IF(retrofit=1,$W49*X49,IF(ISBLANK(X49),\"\",X49))","v":2},1,1,2,2,1,2,2,1,0,2,1,1,2,2,1,2,2,1,0,0]
["2.2.1","PVC - Electric",{"$f":"HCl_pumps","v":0},"units",{"$f":"IF(C50=0,\"NA\",HCl_pump_rate)","v":"NA"},{"$f":"IF(C50=0,\"\",\"gph\")","v":""},{"$f":"IF(C50=0,\"NA\",IF(curve=1,HCl_pump_rate,VLOOKUP(HCl_pump_rate,pvc_empump_cost_cl,2)))","v":"NA"},{"$f":"IF(C50=0,\"\",\"gph\")","v":""},{"$f":"IF(C50=0,\"NA\",IF(curve=1,pvc_empump_eq_hcl,VLOOKUP(HCl_pump_rate,pvc_empump_cost_cl,3)))","v":"NA"},"--",{"$f":"IF(C50=0,\"NA\",VLOOKUP(HCl_pump_rate,pvc_empump_cost_cl,IF(ss_cat=\"large\",4,5)))","v":"NA"},null,{"$f":"$B$46&\" - \"&$B$48&\" - \"&B50","v":"Pumps and Blowers - Acid Metering Pumps - PVC - Electric"},1,2,2,1,1,2,1,1,2,0,1,2,2,1,1,2,1,1,2,0,0]
["2.3","Sodium Hydroxide Metering Pumps",null,null,null,null,null,null,null,null,null,null,null,null,null,null,null,null,null,null,null,null,null,null,null,null,null,null,null,null,null,null,0,0]
["2.3.1","PVC - Motor Driven",{"$f":"NaOH_pumps","v":0},"units",{"$f":"IF(C52=0,\"NA\",NaOH_pump_rate)","v":"NA"},{"$f":"IF(C52=0,\"\",\"gph\")","v":""},{"$f":"IF(C52=0,\"NA\",IF(curve=1,NaOH_pump_rate,VLOOKUP(NaOH_pump_rate,pvc_mmpump_cost_cl,2)))","v":"NA"},{"$f":"IF(C52=0,\"\",\"gph\")","v":""},{"$f":"IF(C52=0,\"NA\",IF(curve=1,pvc_mmpump_eq_naoh,VLOOKUP(NaOH_pump_rate,pvc_mmpump_cost_cl,3)))","v":"NA"},{"$f":"IF(C52=0,\"--\",IF(I52=\"contact vendor\",\"--\",C52*I52))","v":"--"},{"$f":"IF(C52=0,\"NA\",VLOOKUP(NaOH_pump_rate,pvc_mmpump_cost_cl,IF(ss_cat=\"large\",4,5)))","v":"NA"},null,{"$f":"$B$46&\" - \"&$B$51&\" - \"&B52","v":"Pumps and Blowers - Sodium Hydroxide Metering Pumps - PVC - Motor Driven"},{"$f":"IF(retrofit=1,$W52*X52,IF(ISBLANK(X52),\"\",X52))","v":3},3,2,3,3,2,3,{"$f":"IF(retrofit=1,$W52*AE52,IF(ISBLANK(AE52),\"\",AE52))","v":3},2,0,3,3,2,3,3,2,3,3,2,0,0]
["2.3.1","Stainless Steel - Motor Driven",{"$f":"NaOH_pumps","v":0},"units",{"$f":"IF(C53=0,\"NA\",NaOH_pump_rate)","v":"NA"},{"$f":"IF(C53=0,\"\",\"gph\")","v":""},{"$f":"IF(C53=0,\"NA\",IF(curve=1,NaOH_pump_rate,VLOOKUP(NaOH_pump_rate,ss_mmpump_cost_cl,2)))","v":"NA"},{"$f":"IF(C53=0,\"\",\"gph\")","v":""},{"$f":"IF(C53=0,\"NA\",IF(curve=1,ss_mmpump_eq_naoh,VLOOKUP(NaOH_pump_rate,ss_mmpump_cost_cl,3)))","v":"NA"},"--",{"$f":"IF(C53=0,\"NA\",VLOOKUP(NaOH_pump_rate,ss_mmpump_cost_cl,IF(ss_cat=\"large\",4,5)))","v":"NA"},null,{"$f":"$B$46&\" - \"&$B$51&\" - \"&B53","v":"Pumps and Blowers - Sodium Hydroxide Metering Pumps - Stainless Steel - Motor Driven"},4,4,1,4,4,1,4,4,1,0,4,4,1,4,4,1,4,4,1,0,0]
["2.3.1","PVC - Electric",{"$f":"NaOH_pumps","v":0},"units",{"$f":"IF(C54=0,\"NA\",NaOH_pump_rate)","v":"NA"},{"$f":"IF(C54=0,\"\",\"gph\")","v":""},{"$f":"IF(C54=0,\"NA\",IF(curve=1,NaOH_pump_rate,VLOOKUP(NaOH_pump_rate,pvc_empump_cost_cl,2)))","v":"NA"},{"$f":"IF(C54=0,\"\",\"gph\")","v":""},{"$f":"IF(C54=0,\"NA\",IF(curve=1,pvc_empump_eq_naoh,VLOOKUP(NaOH_pump_rate,pvc_empump_cost_cl,3)))","v":"NA"},"--",{"$f":"IF(C54=0,\"NA\",VLOOKUP(NaOH_pump_rate,pvc_empump_cost_cl,IF(ss_cat=\"large\",4,5)))","v":"NA"},null,{"$f":"$B$46&\" - \"&$B$51&\" - \"&B54","v":"Pumps and Blowers - Sodium Hydroxide Metering Pumps - PVC - Electric"},1,2,4,1,2,4,1,2,4,0,1,2,4,1,2,4,1,2,4,0,0]
["2.3.1","Stainless Steel - Electric",{"$f":"NaOH_pumps","v":0},"units",{"$f":"IF(C55=0,\"NA\",NaOH_pump_rate)","v":"NA"},{"$f":"IF(C55=0,\"\",\"gph\")","v":""},{"$f":"IF(C55=0,\"NA\",IF(curve=1,NaOH_pump_rate,VLOOKUP(NaOH_pump_rate,ss_empump_cost_cl,2)))","v":"NA"},{"$f":"IF(C55=0,\"\",\"gph\")","v":""},{"$f":"IF(C55=0,\"NA\",IF(curve=1,ss_empump_eq_naoh,VLOOKUP(NaOH_pump_rate,ss_empump_cost_cl,3)))","v":"NA"},"--",{"$f":"IF(C55=0,\"NA\",VLOOKUP(NaOH_pump_rate,ss_empump_cost_cl,IF(ss_cat=\"large\",4,5)))","v":"NA"},null,{"$f":"$B$46&\" - \"&$B$51&\" - \"&B55","v":"Pumps and Blowers - Sodium Hydroxide Metering Pumps - Stainless Steel - Electric"},{"$f":"IF(retrofit=1,$W55*X55,IF(ISBLANK(X55),\"\",X55))","v":2},{"$f":"IF(retrofit=1,$W55*Y55,IF(ISBLANK(Y55),\"\",Y55))","v":1},{"$f":"IF(retrofit=1,$W55*Z55,IF(ISBLANK(Z55),\"\",Z55))","v":3},{"$f":"IF(retrofit=1,$W55*AA55,IF(ISBLANK(AA55),\"\",AA55))","v":2},{"$f":"IF(retrofit=1,$W55*AB55,IF(ISBLANK(AB55),\"\",AB55))","v":1},{"$f":"IF(retrofit=1,$W55*AC55,IF(ISBLANK(AC55),\"\",AC55))","v":3},{"$f":"IF(retrofit=1,$W55*AD55,IF(ISBLANK(AD55),\"\",AD55))","v":2},{"$f":"IF(retrofit=1,$W55*AE55,IF(ISBLANK(AE55),\"\",AE55))","v":1},{"$f":"IF(retrofit=1,$W55*AF55,IF(ISBLANK(AF55),\"\",AF55))","v":3},0,2,1,3,2,1,3,2,1,3,{"$f":"IF(ISERROR(K55*L55),0,IF(K55<1,0,L55))","v":0},{"$f":"IF(AG55,J55/K55,0)","v":0}]
["2.4","Corrosion Control Chemical Metering Pumps",null,null,null,null,null,null,null,null,null,null,null,null,null,null,null,null,null,null,null,null,null,null,null,null,null,null,null,null,null,null,0,0]
["2.4.1","PVC - Motor Driven",{"$f":"IF(chem_type=1,0,cc_pumps)","v":2},"units",{"$f":"IF(chem_type=1,\"NA\",cc_pump_rate)","v":6.2885641180478154E-3},{"$f":"IF(chem_type=1,\"\",\"gph\")","v":"gph"},{"$f":"IF(chem_type=1,\"NA\",IF(curve=1,cc_pump_rate,VLOOKUP(cc_pump_rate,pvc_mmpump_cost_cl,2)))","v":6.2885641180478154E-3},{"$f":"IF(chem_type=1,\"\",\"gph\")","v":"gph"},{"$f":"IF(chem_type=1,\"NA\",IF(curve=1,pvc_mmpump_eq_cc,VLOOKUP(cc_pump_rate,pvc_mmpump_cost_cl,3)))","v":3416.3402469966863},{"$f":"IF(C57=0,\"--\",IF(I57=\"contact vendor\",\"--\",C57*I57))","v":6832.6804939933727},{"$f":"IF(chem_type=1,\"NA\",VLOOKUP(cc_pump_rate,pvc_mmpump_cost_cl,IF(ss_cat=\"large\",4,5)))","v":17},0,{"$f":"$B$46&\" - \"&$B$56&\" - \"&B57","v":"Pumps and Blowers - Corrosion Control Chemical Metering Pumps - PVC - Motor Driven"},{"$f":"IF(retrofit=1,$W57*X57,IF(ISBLANK(X57),\"\",X57))","v":3},3,2,3,3,2,3,{"$f":"IF(retrofit=1,$W57*AE57,IF(ISBLANK(AE57),\"\",AE57))","v":3},2,0,3,3,2,3,3,2,3,3,2,0,0]
["2.4.1","Stainless Steel - Motor Driven",{"$f":"IF(chem_type=1,0,cc_pumps)","v":2},"units",{"$f":"IF(chem_type=1,\"NA\",cc_pump_rate)","v":6.2885641180478154E-3},{"$f":"IF(chem_type=1,\"\",\"gph\")","v":"gph"},{"$f":"IF(chem_type=1,\"NA\",IF(curve=1,cc_pump_rate,VLOOKUP(cc_pump_rate,ss_mmpump_cost_cl,2)))","v":6.2885641180478154E-3},{"$f":"IF(chem_type=1,\"\",\"gph\")","v":"gph"},{"$f":"IF(chem_type=1,\"NA\",IF(curve=1,ss_mmpump_eq_cc,VLOOKUP(cc_pump_rate,ss_mmpump_cost_cl,3)))","v":3817.8171119573831},7635.6342239147662,{"$f":"IF(chem_type=1,\"NA\",VLOOKUP(cc_pump_rate,ss_mmpump_cost_cl,IF(ss_cat=\"large\",4,5)))","v":17},0,{"$f":"$B$46&\" - \"&$B$56&\" - \"&B58","v":"Pumps and Blowers - Corrosion Control Chemical Metering Pumps - Stainless Steel - Motor Driven"},4,4,1,4,4,1,4,4,1,0,4,4,1,4,4,1,4,4,1,0,0]
["2.4.1","PVC - Electric",{"$f":"IF(chem_type=1,0,cc_pumps)","v":2},"units",{"$f":"IF(chem_type=1,\"NA\",cc_pump_rate)","v":6.2885641180478154E-3},{"$f":"IF(chem_type=1,\"\",\"gph\")","v":"gph"},{"$f":"IF(chem_type=1,\"NA\",IF(curve=1,cc_pump_rate,VLOOKUP(cc_pump_rate,pvc_empump_cost_cl,2)))","v":6.2885641180478154E-3},{"$f":"IF(chem_type=1,\"\",\"gph\")","v":"gph"},{"$f":"IF(chem_type=1,\"NA\",IF(curve=1,pvc_empump_eq_cc,VLOOKUP(cc_pump_rate,pvc_empump_cost_cl,3)))","v":439.541194643594},879.08238928718799,{"$f":"IF(chem_type=1,\"NA\",VLOOKUP(cc_pump_rate,pvc_empump_cost_cl,IF(ss_cat=\"large\",4,5)))","v":15},1,{"$f":"$B$46&\" - \"&$B$56&\" - \"&B59","v":"Pumps and Blowers - Corrosion Control Chemical Metering Pumps - PVC - Electric"},1,2,4,1,2,4,1,2,4,0,1,2,4,1,2,4,1,2,4,1,58.605492619145863]
["2.4.1","Stainless Steel - Electric",{"$f":"IF(chem_type=1,0,cc_pumps)","v":2},"units",{"$f":"IF(chem_type=1,\"NA\",cc_pump_rate)","v":6.2885641180478154E-3},{"$f":"IF(chem_type=1,\"\",\"gph\")","v":"gph"},{"$f":"IF(chem_type=1,\"NA\",IF(curve=1,cc_pump_rate,VLOOKUP(cc_pump_rate,ss_empump_cost_cl,2)))","v":6.2885641180478154E-3},{"$f":"IF(chem_type=1,\"\",\"gph\")","v":"gph"},{"$f":"IF(chem_type=1,\"NA\",IF(curve=1,ss_empump_eq_cc,VLOOKUP(cc_pump_rate,ss_empump_cost_cl,3)))","v":1221.5992902497264},2443.1985804994529,{"$f":"IF(chem_type=1,\"NA\",VLOOKUP(cc_pump_rate,ss_empump_cost_cl,IF(ss_cat=\"large\",4,5)))","v":15},0,{"$f":"$B$46&\" - \"&$B$56&\" - \"&B60","v":"Pumps and Blowers - Corrosion Control Chemical Metering Pumps - Stainless Steel - Electric"},2,1,3,2,1,3,2,1,3,0,2,1,3,2,1,3,2,1,3,0,0]
["2.5","Blowers",null,null,null,null,null,null,null,null,null,null,null,null,null,null,null,null,null,null,null,null,null,null,null,null,null,null,null,null,null,null,0,0]
["2.5.1","Centrifugal",{"$f":"tot_blowers","v":2},"units",{"$f":"Q_BLOWER","v":135.44813601000004},"cfm",{"$f":"IF(curve=1,Q_BLOWER,VLOOKUP(Q_BLOWER,cent_blow_cost_cl,2))","v":135.44813601000004},"cfm",{"$f":"IF(curve=1,cent_blow_eq,VLOOKUP(Q_BLOWER,cent_blow_cost_cl,3))","v":28092.938077326671},{"$f":"IF(C62=0,\"--\",IF(I62=\"contact vendor\",\"--\",C62*I62))","v":56185.876154653342},{"$f":"VLOOKUP(Q_BLOWER,cent_blow_cost_cl,IF(ss_cat=\"large\",4,5))","v":20},1,{"$f":"$B$46&\" - \"&$B$61&\" - \"&B62","v":"Pumps and Blowers - Blowers - Centrifugal"},{"$f":"IF(retrofit=1,$W62*X62,IF(ISBLANK(X62),\"\",X62))","v":1},1,2,1,1,2,1,1,2,0,1,1,2,1,1,2,1,1,2,1,2809.2938077326671]
["2.5.1","Positive Displacement",{"$f":"tot_blowers","v":2},"units",{"$f":"Q_BLOWER","v":135.44813601000004},"cfm",{"$f":"IF(curve=1,Q_BLOWER,VLOOKUP(Q_BLOWER,pd_blow_cost_cl,2))","v":135.44813601000004},"cfm",{"$f":"IF(curve=1,pd_blow_eq,VLOOKUP(Q_BLOWER,pd_blow_cost_cl,3))","v":11133.614061267508},22267.228122535016,{"$f":"VLOOKUP(Q_BLOWER,pd_blow_cost_cl,IF(ss_cat=\"large\",4,5))","v":20},0,{"$f":"$B$46&\" - \"&$B$61&\" - \"&B63","v":"Pumps and Blowers - Blowers - Positive Displacement"},2,2,1,2,2,1,2,2,1,0,2,2,1,2,2,1,2,2,1,0,0]
["3.","Clearwell",null,null,null,null,null,null,null,null,null,null,null,null,null,null,null,null,null,null,null,null,null,null,null,null,null,null,null,null,null,null,0,0]
["3.1","Concrete",{"$f":"IF(AW_DET=0,0,1)","v":1},"units",{"$f":"clearwell_gal","v":652.67884229268293},"gal",{"$f":"clearwell_gal","v":652.67884229268293},"gal",{"$f":"IF(AW_DET=0,\"NA\",concrete_vol_yd/C65*VLOOKUP(0,conc_basin_cost_cl,3))","v":3559.345132500001},{"$f":"IF(C65=0,\"--\",IF(I65=\"contact vendor\",\"--\",C65*I65))","v":3559.345132500001},{"$f":"IF(AW_DET=0,\"NA\",VLOOKUP(0,conc_basin_cost_cl,IF(ss_cat=\"large\",4,5)))","v":37},1,{"$f":"$B$64&\" - \"&B65","v":"Clearwell - Concrete"},{"$f":"IF(retrofit=1,$W65*X65,IF(ISBLANK(X65),\"\",X65))","v":1},1,1,1,1,1,1,{"$f":"IF(retrofit=1,$W65*AE65,IF(ISBLANK(AE65),\"\",AE65))","v":1},1,0,1,1,1,1,1,1,1,1,1,1,96.198517094594621]
["3.2","Excavation",{"$f":"IF(AW_DET=0,0,x_vol_yd)","v":52},"cubic yds","NA",null,"NA",null,{"$f":"IF(AW_DET=0,\"NA\",VLOOKUP(0,excavate_cost_cl,3))","v":28.127499999999998},1462.6299999999999,{"$f":"IF(AW_DET=0,\"NA\",VLOOKUP(0,conc_basin_cost_cl,IF(ss_cat=\"large\",4,5)))","v":37},1,{"$f":"$B$64&\" - \"&B66","v":"Clearwell - Excavation"},1,1,1,1,1,1,1,1,1,0,1,1,1,1,1,1,1,1,1,{"$f":"IF(ISERROR(K66*L66),0,IF(K66<1,0,L66))","v":1},{"$f":"IF(AG66,J66/K66,0)","v":39.530540540540535}]
["3.3","Backfill and Compaction",{"$f":"IF(AW_DET=0,0,b_vol_yd)","v":49},"cubic yds","NA",null,"NA",null,{"$f":"IF(AW_DET=0,\"NA\",VLOOKUP(0,backfill_cost_cl,3))","v":13.04},638.95999999999992,{"$f":"IF(AW_DET=0,\"NA\",VLOOKUP(0,conc_basin_cost_cl,IF(ss_cat=\"large\",4,5)))","v":37},1,{"$f":"$B$64&\" - \"&B67","v":"Clearwell - Backfill and Compaction"},1,1,1,1,1,1,1,1,1,0,1,1,1,1,1,1,1,1,1,1,17.269189189189188]
["4.","Chemical Storage",null,null,null,null,null,null,null,null,null,null,null,null,null,null,null,null,null,null,null,null,null,null,null,null,null,null,null,null,null,null,0,0]
["4.1","Acid Storage Tanks",null,null,null,null,null,null,null,null,null,null,null,null,null,null,null,null,null,null,null,null,null,null,null,null,null,null,null,null,null,null,0,0]
["4.1.1","Plastic/HDPE",{"$f":"HCl_tanks","v":0},"units",{"$f":"IF(C70=0,\"NA\",HCl_tank_vol)","v":"NA"},{"$f":"IF(C70=0,\"\",\"gal\")","v":""},{"$f":"IF(C70=0,\"NA\",IF(curve=1,HCl_tank_vol,VLOOKUP(HCl_tank_vol,pl_cst_cost_cl,2)))","v":"NA"},{"$f":"IF(C70=0,\"\",\"gal\")","v":""},{"$f":"IF(C70=0,\"NA\",IF(curve=1,pl_cst_eq_hcl,VLOOKUP(HCl_tank_vol,pl_cst_cost_cl,3)))","v":"NA"},{"$f":"IF(C70=0,\"--\",IF(I70=\"contact vendor\",\"--\",C70*I70))","v":"--"},{"$f":"IF(C70=0,\"NA\",VLOOKUP(HCl_tank_vol,pl_cst_cost_cl,IF(ss_cat=\"large\",4,5)))","v":"NA"},null,{"$f":"$B$68&\" - \"&$B$69&\" - \"&B70","v":"Chemical Storage - Acid Storage Tanks - Plastic/HDPE"},{"$f":"IF(retrofit=1,$W70*X70,IF(ISBLANK(X70),\"\",X70))","v":1},2,2,1,2,2,1,2,2,0,1,2,2,1,2,2,1,2,2,0,0]
["4.1.1","Fiberglass",{"$f":"HCl_tanks","v":0},"units",{"$f":"IF(C71=0,\"NA\",HCl_tank_vol)","v":"NA"},{"$f":"IF(C71=0,\"\",\"gal\")","v":""},{"$f":"IF(C71=0,\"NA\",IF(curve=1,HCl_tank_vol,VLOOKUP(HCl_tank_vol,fg_cst_cost_cl,2)))","v":"NA"},{"$f":"IF(C71=0,\"\",\"gal\")","v":""},{"$f":"IF(C71=0,\"NA\",IF(curve=1,fg_cst_eq_hcl,VLOOKUP(HCl_tank_vol,fg_cst_cost_cl,3)))","v":"NA"},"--",{"$f":"IF(C71=0,\"NA\",VLOOKUP(HCl_tank_vol,fg_cst_cost_cl,IF(ss_cat=\"large\",4,5)))","v":"NA"},null,{"$f":"$B$68&\" - \"&$B$69&\" - \"&B71","v":"Chemical Storage - Acid Storage Tanks - Fiberglass"},2,1,1,2,1,1,2,1,1,0,2,1,1,2,1,1,2,1,1,0,0]
[4.2,"Acid Day Tanks",null,null,null,null,null,null,null,null,null,null,null,null,null,null,null,null,null,null,null,null,null,null,null,null,null,null,null,null,null,null,0,0]
["4.2.1","Plastic/HDPE",{"$f":"day_tanks_acid","v":0},"units",{"$f":"IF(C73=0,\"NA\",day_tank_vol_acid)","v":"NA"},{"$f":"IF(C73=0,\"\",\"gal\")","v":""},{"$f":"IF(C73=0,\"NA\",IF(curve=1,day_tank_vol_acid,VLOOKUP(day_tank_vol_acid,pl_cst_cost_cl,2)))","v":"NA"},{"$f":"IF(C73=0,\"\",\"gal\")","v":""},{"$f":"IF(C73=0,\"NA\",IF(curve=1,pl_day_eq_hcl,VLOOKUP(day_tank_vol_acid,pl_cst_cost_cl,3)))","v":"NA"},{"$f":"IF(C73=0,\"--\",IF(I73=\"contact vendor\",\"--\",C73*I73))","v":"--"},{"$f":"IF(C73=0,\"NA\",VLOOKUP(day_tank_vol_acid,pl_cst_cost_cl,IF(ss_cat=\"large\",4,5)))","v":"NA"},null,{"$f":"$B$68&\" - \"&$B$72&\" - \"&B73","v":"Chemical Storage - Acid Day Tanks - Plastic/HDPE"},{"$f":"IF(retrofit=1,$W73*X73,IF(ISBLANK(X73),\"\",X73))","v":1},{"$f":"IF(retrofit=1,$W73*Y73,IF(ISBLANK(Y73),\"\",Y73))","v":2},{"$f":"IF(retrofit=1,$W73*Z73,IF(ISBLANK(Z73),\"\",Z73))","v":2},{"$f":"IF(retrofit=1,$W73*AA73,IF(ISBLANK(AA73),\"\",AA73))","v":1},{"$f":"IF(retrofit=1,$W73*AB73,IF(ISBLANK(AB73),\"\",AB73))","v":2},{"$f":"IF(retrofit=1,$W73*AC73,IF(ISBLANK(AC73),\"\",AC73))","v":2},{"$f":"IF(retrofit=1,$W73*AD73,IF(ISBLANK(AD73),\"\",AD73))","v":1},{"$f":"IF(retrofit=1,$W73*AE73,IF(ISBLANK(AE73),\"\",AE73))","v":2},{"$f":"IF(retrofit=1,$W73*AF73,IF(ISBLANK(AF73),\"\",AF73))","v":2},0,1,2,2,1,2,2,1,2,2,0,0]
["4.2.1","Fiberglass",{"$f":"day_tanks_acid","v":0},"units",{"$f":"IF(C74=0,\"NA\",day_tank_vol_acid)","v":"NA"},{"$f":"IF(C74=0,\"\",\"gal\")","v":""},{"$f":"IF(C74=0,\"NA\",IF(curve=1,day_tank_vol_acid,VLOOKUP(day_tank_vol_acid,fg_cst_cost_cl,2)))","v":"NA"},{"$f":"IF(C74=0,\"\",\"gal\")","v":""},{"$f":"IF(C74=0,\"NA\",IF(curve=1,fg_day_eq_hcl,VLOOKUP(day_tank_vol_acid,fg_cst_cost_cl,3)))","v":"NA"},{"$f":"IF(C74=0,\"--\",IF(I74=\"contact vendor\",\"--\",C74*I74))","v":"--"},{"$f":"IF(C74=0,\"NA\",VLOOKUP(day_tank_vol_acid,fg_cst_cost_cl,IF(ss_cat=\"large\",4,5)))","v":"NA"},null,{"$f":"$B$68&\" - \"&$B$72&\" - \"&B74","v":"Chemical Storage - Acid Day Tanks - Fiberglass"},2,1,1,2,1,1,2,1,1,0,2,1,1,2,1,1,2,1,1,0,0]
[4.3,"Mixers for Acid Storage Tanks",null,null,null,null,null,null,null,null,null,null,null,null,null,null,null,null,null,null,null,null,null,null,null,null,null,null,null,null,null,null,0,0]
["4.3.1","Portable",{"$f":"cmixers_acid","v":0},"units",{"$f":"IF(C76=0,\"NA\",cmix_size_acid)","v":"NA"},{"$f":"IF(C76=0,\"\",\"hp\")","v":""},{"$f":"IF(C76=0,\"NA\",VLOOKUP(cmix_size_acid,port_mix_cost_cl,2))","v":"NA"},{"$f":"IF(C76=0,\"\",\"hp\")","v":""},{"$f":"IF(C76=0,\"NA\",VLOOKUP(cmix_size_acid,port_mix_cost_cl,3))","v":"NA"},{"$f":"IF(C76=0,\"--\",IF(I76=\"contact vendor\",\"--\",C76*I76))","v":"--"},{"$f":"IF(C76=0,\"NA\",VLOOKUP(cmix_size_acid,port_mix_cost_cl,IF(ss_cat=\"large\",4,5)))","v":"NA"},null,{"$f":"$B$68&\" - \"&$B$75&\" - \"&B76","v":"Chemical Storage - Mixers for Acid Storage Tanks - Portable"},{"$f":"IF(retrofit=1,$W76*X76,IF(ISBLANK(X76),\"\",X76))","v":3},3,3,3,3,3,3,3,3,0,3,3,3,3,3,3,3,3,3,0,0]
["4.3.1","Mounted",{"$f":"cmixers_acid","v":0},"units",{"$f":"IF(C77=0,\"NA\",cmix_size_acid)","v":"NA"},{"$f":"IF(C77=0,\"\",\"hp\")","v":""},{"$f":"IF(C77=0,\"NA\",IF(curve=1,cmix_size_acid,VLOOKUP(cmix_size_acid,mount_mix_cost_cl,2)))","v":"NA"},{"$f":"IF(C77=0,\"\",\"hp\")","v":""},{"$f":"IF(C77=0,\"NA\",IF(curve=1,cmount_mix_eq_hcl,VLOOKUP(cmix_size_acid,mount_mix_cost_cl,3)))","v":"NA"},{"$f":"IF(C77=0,\"--\",IF(I77=\"contact vendor\",\"--\",C77*I77))","v":"--"},{"$f":"IF(C77=0,\"NA\",VLOOKUP(cmix_size_acid,mount_mix_cost_cl,IF(ss_cat=\"large\",4,5)))","v":"NA"},null,{"$f":"$B$68&\" - \"&$B$75&\" - \"&B77","v":"Chemical Storage - Mixers for Acid Storage Tanks - Mounted"},1,1,1,1,1,1,1,1,1,0,1,1,1,1,1,1,1,1,1,0,0]
["4.3.1","Impeller",{"$f":"cmixers_acid","v":0},"units",{"$f":"IF(C78=0,\"NA\",cmix_size_acid)","v":"NA"},{"$f":"IF(C78=0,\"\",\"hp\")","v":""},{"$f":"IF(C78=0,\"NA\",IF(curve=1,cmix_size_acid,VLOOKUP(cmix_size_acid,imp_mix_cost_cl,2)))","v":"NA"},{"$f":"IF(C78=0,\"\",\"hp\")","v":""},{"$f":"IF(C78=0,\"NA\",IF(curve=1,cimp_mix_eq_hcl,VLOOKUP(cmix_size_acid,imp_mix_cost_cl,3)))","v":"NA"},{"$f":"IF(C78=0,\"--\",IF(I78=\"contact vendor\",\"--\",C78*I78))","v":"--"},{"$f":"IF(C78=0,\"NA\",VLOOKUP(cmix_size_acid,imp_mix_cost_cl,IF(ss_cat=\"large\",4,5)))","v":"NA"},null,{"$f":"$B$68&\" - \"&$B$75&\" - \"&B78","v":"Chemical Storage - Mixers for Acid Storage Tanks - Impeller"},2,2,2,2,2,2,2,2,2,0,2,2,2,2,2,2,2,2,2,0,0]
[4.4000000000000004,"Mixers for Acid Day Tanks",null,null,null,null,null,null,null,null,null,null,null,null,null,null,null,null,null,null,null,null,null,null,null,null,null,null,null,null,null,null,0,0]
["4.4.1","Portable",{"$f":"dmixers_acid","v":0},"units",{"$f":"IF(C80=0,\"NA\",dmix_size_acid)","v":"NA"},{"$f":"IF(C80=0,\"\",\"hp\")","v":""},{"$f":"IF(C80=0,\"NA\",VLOOKUP(dmix_size_acid,port_mix_cost_cl,2))","v":"NA"},{"$f":"IF(C80=0,\"\",\"hp\")","v":""},{"$f":"IF(C80=0,\"NA\",VLOOKUP(dmix_size_acid,port_mix_cost_cl,3))","v":"NA"},{"$f":"IF(C80=0,\"--\",IF(I80=\"contact vendor\",\"--\",C80*I80))","v":"--"},{"$f":"IF(C80=0,\"NA\",VLOOKUP(dmix_size_acid,port_mix_cost_cl,IF(ss_cat=\"large\",4,5)))","v":"NA"},null,{"$f":"$B$68&\" - \"&$B$79&\" - \"&B80","v":"Chemical Storage - Mixers for Acid Day Tanks - Portable"},{"$f":"IF(retrofit=1,$W80*X80,IF(ISBLANK(X80),\"\",X80))","v":3},3,3,3,3,3,3,3,3,0,3,3,3,3,3,3,3,3,3,0,0]
["4.4.1","Mounted",{"$f":"dmixers_acid","v":0},"units",{"$f":"IF(C81=0,\"NA\",dmix_size_acid)","v":"NA"},{"$f":"IF(C81=0,\"\",\"hp\")","v":""},{"$f":"IF(C81=0,\"NA\",IF(curve=1,dmix_size_acid,VLOOKUP(dmix_size_acid,mount_mix_cost_cl,2)))","v":"NA"},{"$f":"IF(C81=0,\"\",\"hp\")","v":""},{"$f":"IF(C81=0,\"NA\",IF(curve=1,dmount_mix_eq_hcl,VLOOKUP(dmix_size_acid,mount_mix_cost_cl,3)))","v":"NA"},{"$f":"IF(C81=0,\"--\",IF(I81=\"contact vendor\",\"--\",C81*I81))","v":"--"},{"$f":"IF(C81=0,\"NA\",VLOOKUP(dmix_size_acid,mount_mix_cost_cl,IF(ss_cat=\"large\",4,5)))","v":"NA"},null,{"$f":"$B$68&\" - \"&$B$79&\" - \"&B81","v":"Chemical Storage - Mixers for Acid Day Tanks - Mounted"},1,1,1,1,1,1,1,1,1,0,1,1,1,1,1,1,1,1,1,0,0]
["4.4.1","Impeller",{"$f":"dmixers_acid","v":0},"units",{"$f":"IF(C82=0,\"NA\",dmix_size_acid)","v":"NA"},{"$f":"IF(C82=0,\"\",\"hp\")","v":""},{"$f":"IF(C82=0,\"NA\",IF(curve=1,dmix_size_acid,VLOOKUP(dmix_size_acid,imp_mix_cost_cl,2)))","v":"NA"},{"$f":"IF(C82=0,\"\",\"hp\")","v":""},{"$f":"IF(C82=0,\"NA\",IF(curve=1,dimp_mix_eq_hcl,VLOOKUP(dmix_size_acid,imp_mix_cost_cl,3)))","v":"NA"},{"$f":"IF(C82=0,\"--\",IF(I82=\"contact vendor\",\"--\",C82*I82))","v":"--"},{"$f":"IF(C82=0,\"NA\",VLOOKUP(dmix_size_acid,imp_mix_cost_cl,IF(ss_cat=\"large\",4,5)))","v":"NA"},null,{"$f":"$B$68&\" - \"&$B$79&\" - \"&B82","v":"Chemical Storage - Mixers for Acid Day Tanks - Impeller"},2,2,2,2,2,2,2,2,2,0,2,2,2,2,2,2,2,2,2,0,0]
[4.5,"Sodium Hydroxide Storage Tanks",null,null,null,null,null,null,null,null,null,null,null,null,null,null,null,null,null,null,null,null,null,null,null,null,null,null,null,null,null,null,0,0]
["4.5.1","Plastic/HDPE",{"$f":"NaOH_tanks","v":0},"units",{"$f":"IF(C84=0,\"NA\",NaOH_tank_vol)","v":"NA"},{"$f":"IF(C84=0,\"\",\"gal\")","v":""},{"$f":"IF(C84=0,\"NA\",IF(curve=1,NaOH_tank_vol,VLOOKUP(NaOH_tank_vol,pl_cst_cost_cl,2)))","v":"NA"},{"$f":"IF(C84=0,\"\",\"gal\")","v":""},{"$f":"IF(C84=0,\"NA\",IF(curve=1,pl_cst_eq_naoh,VLOOKUP(NaOH_tank_vol,pl_cst_cost_cl,3)))","v":"NA"},{"$f":"IF(C84=0,\"--\",IF(I84=\"contact vendor\",\"--\",C84*I84))","v":"--"},{"$f":"IF(C84=0,\"NA\",VLOOKUP(NaOH_tank_vol,pl_cst_cost_cl,IF(ss_cat=\"large\",4,5)))","v":"NA"},null,{"$f":"$B$68&\" - \"&$B$83&\" - \"&B84","v":"Chemical Storage - Sodium Hydroxide Storage Tanks - Plastic/HDPE"},{"$f":"IF(retrofit=1,$W84*X84,IF(ISBLANK(X84),\"\",X84))","v":1},2,3,1,2,3,1,2,3,0,1,2,3,1,2,3,1,2,3,0,0]
["4.5.1","Fiberglass",{"$f":"NaOH_tanks","v":0},"units",{"$f":"IF(C85=0,\"NA\",NaOH_tank_vol)","v":"NA"},{"$f":"IF(C85=0,\"\",\"gal\")","v":""},{"$f":"IF(C85=0,\"NA\",IF(curve=1,NaOH_tank_vol,VLOOKUP(NaOH_tank_vol,fg_cst_cost_cl,2)))","v":"NA"},{"$f":"IF(C85=0,\"\",\"gal\")","v":""},{"$f":"IF(C85=0,\"NA\",IF(curve=1,fg_cst_eq_naoh,VLOOKUP(NaOH_tank_vol,fg_cst_cost_cl,3)))","v":"NA"},"--",{"$f":"IF(C85=0,\"NA\",VLOOKUP(NaOH_tank_vol,fg_cst_cost_cl,IF(ss_cat=\"large\",4,5)))","v":"NA"},null,{"$f":"$B$68&\" - \"&$B$83&\" - \"&B85","v":"Chemical Storage - Sodium Hydroxide Storage Tanks - Fiberglass"},2,1,2,2,1,2,2,1,2,0,2,1,2,2,1,2,2,1,2,0,0]
["4.5.1","Stainless Steel",{"$f":"NaOH_tanks","v":0},"units",{"$f":"IF(C86=0,\"NA\",NaOH_tank_vol)","v":"NA"},{"$f":"IF(C86=0,\"\",\"gal\")","v":""},{"$f":"IF(C86=0,\"NA\",IF(curve=1,NaOH_tank_vol,VLOOKUP(NaOH_tank_vol,ss_cst_cost_cl,2)))","v":"NA"},{"$f":"IF(C86=0,\"\",\"gal\")","v":""},{"$f":"IF(C86=0,\"NA\",IF(curve=1,ss_cst_eq_naoh,VLOOKUP(NaOH_tank_vol,ss_cst_cost_cl,3)))","v":"NA"},"--",{"$f":"IF(C86=0,\"NA\",VLOOKUP(NaOH_tank_vol,ss_cst_cost_cl,IF(ss_cat=\"large\",4,5)))","v":"NA"},null,{"$f":"$B$68&\" - \"&$B$83&\" - \"&B86","v":"Chemical Storage - Sodium Hydroxide Storage Tanks - Stainless Steel"},{"$f":"IF(retrofit=1,$W86*X86,IF(ISBLANK(X86),\"\",X86))","v":3},3,1,3,3,1,3,3,1,0,3,3,1,3,3,1,3,3,1,0,0]
["4.5.2","Heat Tracing",{"$f":"NaOH_tanks","v":0},"units",{"$f":"IF(C87=0,\"NA\",NaOH_tank_vol)","v":"NA"},{"$f":"IF(C87=0,\"\",\"gal\")","v":""},{"$f":"IF(C87=0,\"NA\",IF(curve=1,NaOH_tank_vol,VLOOKUP(NaOH_tank_vol,cst_heat_cost_cl,2)))","v":"NA"},{"$f":"IF(C87=0,\"\",\"gal\")","v":""},{"$f":"IF(C87=0,\"NA\",IF(curve=1,cst_heat_eq,VLOOKUP(NaOH_tank_vol,cst_heat_cost_cl,3)))","v":"NA"},"--",{"$f":"IF(C87=0,\"NA\",VLOOKUP(NaOH_tank_vol,cst_heat_cost_cl,IF(ss_cat=\"large\",4,5)))","v":"NA"},null,{"$f":"$B$68&\" - \"&$B$83&\" - \"&B87","v":"Chemical Storage - Sodium Hydroxide Storage Tanks - Heat Tracing"},{"$f":"IF(retrofit=1,$W87*X87,IF(ISBLANK(X87),\"\",X87))","v":1},{"$f":"IF(retrofit=1,$W87*Y87,IF(ISBLANK(Y87),\"\",Y87))","v":1},{"$f":"IF(retrofit=1,$W87*Z87,IF(ISBLANK(Z87),\"\",Z87))","v":1},{"$f":"IF(retrofit=1,$W87*AA87,IF(ISBLANK(AA87),\"\",AA87))","v":1},{"$f":"IF(retrofit=1,$W87*AB87,IF(ISBLANK(AB87),\"\",AB87))","v":1},{"$f":"IF(retrofit=1,$W87*AC87,IF(ISBLANK(AC87),\"\",AC87))","v":1},{"$f":"IF(retrofit=1,$W87*AD87,IF(ISBLANK(AD87),\"\",AD87))","v":1},{"$f":"IF(retrofit=1,$W87*AE87,IF(ISBLANK(AE87),\"\",AE87))","v":1},{"$f":"IF(retrofit=1,$W87*AF87,IF(ISBLANK(AF87),\"\",AF87))","v":1},0,1,1,1,1,1,1,1,1,1,{"$f":"IF(ISERROR(K87*L87),0,IF(K87<1,0,L87))","v":0},{"$f":"IF(AG87,J87/K87,0)","v":0}]
["4.5.3","Insulation",{"$f":"NaOH_tanks","v":0},"units",{"$f":"IF(C88=0,\"NA\",NaOH_tank_vol)","v":"NA"},{"$f":"IF(C88=0,\"\",\"gal\")","v":""},{"$f":"IF(C88=0,\"NA\",IF(curve=1,NaOH_tank_vol,VLOOKUP(NaOH_tank_vol,cst_insul_cost_cl,2)))","v":"NA"},{"$f":"IF(C88=0,\"\",\"gal\")","v":""},{"$f":"IF(C88=0,\"NA\",IF(curve=1,cst_insul_eq,VLOOKUP(NaOH_tank_vol,cst_insul_cost_cl,3)))","v":"NA"},"--",{"$f":"IF(C88=0,\"NA\",VLOOKUP(NaOH_tank_vol,cst_insul_cost_cl,IF(ss_cat=\"large\",4,5)))","v":"NA"},null,{"$f":"$B$68&\" - \"&$B$83&\" - \"&B88","v":"Chemical Storage - Sodium Hydroxide Storage Tanks - Insulation"},{"$f":"IF(retrofit=1,$W88*X88,IF(ISBLANK(X88),\"\",X88))","v":1},{"$f":"IF(retrofit=1,$W88*Y88,IF(ISBLANK(Y88),\"\",Y88))","v":1},{"$f":"IF(retrofit=1,$W88*Z88,IF(ISBLANK(Z88),\"\",Z88))","v":1},{"$f":"IF(retrofit=1,$W88*AA88,IF(ISBLANK(AA88),\"\",AA88))","v":1},{"$f":"IF(retrofit=1,$W88*AB88,IF(ISBLANK(AB88),\"\",AB88))","v":1},{"$f":"IF(retrofit=1,$W88*AC88,IF(ISBLANK(AC88),\"\",AC88))","v":1},{"$f":"IF(retrofit=1,$W88*AD88,IF(ISBLANK(AD88),\"\",AD88))","v":1},{"$f":"IF(retrofit=1,$W88*AE88,IF(ISBLANK(AE88),\"\",AE88))","v":1},{"$f":"IF(retrofit=1,$W88*AF88,IF(ISBLANK(AF88),\"\",AF88))","v":1},0,1,1,1,1,1,1,1,1,1,{"$f":"IF(ISERROR(K88*L88),0,IF(K88<1,0,L88))","v":0},{"$f":"IF(AG88,J88/K88,0)","v":0}]
[4.5999999999999996,"Sodium Hydroxide Day Tanks",null,null,null,null,null,null,null,null,null,null,null,null,null,null,null,null,null,null,null,null,null,null,null,null,null,null,null,null,null,null,{"$f":"IF(ISERROR(K89*L89),0,IF(K89<1,0,L89))","v":0},{"$f":"IF(AG89,J89/K89,0)","v":0}]
["4.6.1","Plastic/HDPE",{"$f":"day_tanks_NaOH","v":0},"units",{"$f":"IF(C90=0,\"NA\",day_tank_vol_NaOH)","v":"NA"},{"$f":"IF(C90=0,\"\",\"gal\")","v":""},{"$f":"IF(C90=0,\"NA\",IF(curve=1,day_tank_vol_NaOH,VLOOKUP(day_tank_vol_NaOH,pl_cst_cost_cl,2)))","v":"NA"},{"$f":"IF(C90=0,\"\",\"gal\")","v":""},{"$f":"IF(C90=0,\"NA\",IF(curve=1,pl_day_eq_naoh,VLOOKUP(day_tank_vol,pl_cst_cost_cl,3)))","v":"NA"},{"$f":"IF(C90=0,\"--\",IF(I90=\"contact vendor\",\"--\",C90*I90))","v":"--"},{"$f":"IF(C90=0,\"NA\",VLOOKUP(day_tank_vol_NaOH,pl_cst_cost_cl,IF(ss_cat=\"large\",4,5)))","v":"NA"},null,{"$f":"$B$68&\" - \"&$B$89&\" - \"&B90","v":"Chemical Storage - Sodium Hydroxide Day Tanks - Plastic/HDPE"},{"$f":"IF(retrofit=1,$W90*X90,IF(ISBLANK(X90),\"\",X90))","v":1},2,3,1,2,3,1,2,3,0,1,2,3,1,2,3,1,2,3,{"$f":"IF(ISERROR(K90*L90),0,IF(K90<1,0,L90))","v":0},{"$f":"IF(AG90,J90/K90,0)","v":0}]
["4.6.1","Fiberglass",{"$f":"day_tanks_NaOH","v":0},"units",{"$f":"IF(C91=0,\"NA\",day_tank_vol_NaOH)","v":"NA"},{"$f":"IF(C91=0,\"\",\"gal\")","v":""},{"$f":"IF(C91=0,\"NA\",IF(curve=1,day_tank_vol_NaOH,VLOOKUP(day_tank_vol_NaOH,fg_cst_cost_cl,2)))","v":"NA"},{"$f":"IF(C91=0,\"\",\"gal\")","v":""},{"$f":"IF(C91=0,\"NA\",IF(curve=1,fg_day_eq_naoh,VLOOKUP(day_tank_vol,fg_cst_cost_cl,3)))","v":"NA"},{"$f":"IF(C91=0,\"--\",IF(I91=\"contact vendor\",\"--\",C91*I91))","v":"--"},{"$f":"IF(C91=0,\"NA\",VLOOKUP(day_tank_vol_NaOH,fg_cst_cost_cl,IF(ss_cat=\"large\",4,5)))","v":"NA"},null,{"$f":"$B$68&\" - \"&$B$89&\" - \"&B91","v":"Chemical Storage - Sodium Hydroxide Day Tanks - Fiberglass"},2,1,2,2,1,2,2,1,2,0,2,1,2,2,1,2,2,1,2,{"$f":"IF(ISERROR(K91*L91),0,IF(K91<1,0,L91))","v":0},{"$f":"IF(AG91,J91/K91,0)","v":0}]
["4.6.1","Stainless Steel",{"$f":"day_tanks_NaOH","v":0},"units",{"$f":"IF(C92=0,\"NA\",day_tank_vol_NaOH)","v":"NA"},{"$f":"IF(C92=0,\"\",\"gal\")","v":""},{"$f":"IF(C92=0,\"NA\",IF(curve=1,day_tank_vol_NaOH,VLOOKUP(day_tank_vol_NaOH,ss_cst_cost_cl,2)))","v":"NA"},{"$f":"IF(C92=0,\"\",\"gal\")","v":""},{"$f":"IF(C92=0,\"NA\",IF(curve=1,ss_day_eq_naoh,VLOOKUP(day_tank_vol,ss_cst_cost_cl,3)))","v":"NA"},{"$f":"IF(C92=0,\"--\",IF(I92=\"contact vendor\",\"--\",C92*I92))","v":"--"},{"$f":"IF(C92=0,\"NA\",VLOOKUP(day_tank_vol_NaOH,ss_cst_cost_cl,IF(ss_cat=\"large\",4,5)))","v":"NA"},null,{"$f":"$B$68&\" - \"&$B$89&\" - \"&B92","v":"Chemical Storage - Sodium Hydroxide Day Tanks - Stainless Steel"},{"$f":"IF(retrofit=1,$W92*X92,IF(ISBLANK(X92),\"\",X92))","v":3},3,1,3,3,1,3,3,1,0,3,3,1,3,3,1,3,3,1,{"$f":"IF(ISERROR(K92*L92),0,IF(K92<1,0,L92))","v":0},{"$f":"IF(AG92,J92/K92,0)","v":0}]
["4.6.2","Heat Tracing",{"$f":"day_tanks_NaOH","v":0},"units",{"$f":"IF(C93=0,\"NA\",day_tank_vol_NaOH)","v":"NA"},{"$f":"IF(C93=0,\"\",\"gal\")","v":""},{"$f":"IF(C93=0,\"NA\",IF(curve=1,day_tank_vol_NaOH,VLOOKUP(day_tank_vol_NaOH,cst_heat_cost_cl,2)))","v":"NA"},{"$f":"IF(C93=0,\"\",\"gal\")","v":""},{"$f":"IF(C93=0,\"NA\",IF(curve=1,day_heat_eq,VLOOKUP(day_tank_vol,cst_heat_cost_cl,3)))","v":"NA"},{"$f":"IF(C93=0,\"--\",IF(I93=\"contact vendor\",\"--\",C93*I93))","v":"--"},{"$f":"IF(C93=0,\"NA\",VLOOKUP(day_tank_vol_NaOH,cst_heat_cost_cl,IF(ss_cat=\"large\",4,5)))","v":"NA"},null,{"$f":"$B$68&\" - \"&$B$89&\" - \"&B93","v":"Chemical Storage - Sodium Hydroxide Day Tanks - Heat Tracing"},1,1,1,1,1,1,1,1,1,0,1,1,1,1,1,1,1,1,1,{"$f":"IF(ISERROR(K93*L93),0,IF(K93<1,0,L93))","v":0},{"$f":"IF(AG93,J93/K93,0)","v":0}]
["4.6.3","Insulation",{"$f":"day_tanks_NaOH","v":0},"units",{"$f":"IF(C94=0,\"NA\",day_tank_vol_NaOH)","v":"NA"},{"$f":"IF(C94=0,\"\",\"gal\")","v":""},{"$f":"IF(C94=0,\"NA\",IF(curve=1,day_tank_vol_NaOH,VLOOKUP(day_tank_vol_NaOH,cst_insul_cost_cl,2)))","v":"NA"},{"$f":"IF(C94=0,\"\",\"gal\")","v":""},{"$f":"IF(C94=0,\"NA\",IF(curve=1,day_insul_eq,VLOOKUP(day_tank_vol,cst_insul_cost_cl,3)))","v":"NA"},{"$f":"IF(C94=0,\"--\",IF(I94=\"contact vendor\",\"--\",C94*I94))","v":"--"},{"$f":"IF(C94=0,\"NA\",VLOOKUP(day_tank_vol_NaOH,cst_insul_cost_cl,IF(ss_cat=\"large\",4,5)))","v":"NA"},null,{"$f":"$B$68&\" - \"&$B$89&\" - \"&B94","v":"Chemical Storage - Sodium Hydroxide Day Tanks - Insulation"},1,1,1,1,1,1,1,1,1,0,1,1,1,1,1,1,1,1,1,0,0]
[4.7,"Mixers for Sodium Hydroxide Storage Tanks",null,null,null,null,null,null,null,null,null,null,null,null,null,null,null,null,null,null,null,null,null,null,null,null,null,null,null,null,null,null,{"$f":"IF(ISERROR(K95*L95),0,IF(K95<1,0,L95))","v":0},{"$f":"IF(AG95,J95/K95,0)","v":0}]
["4.7.1","Portable",{"$f":"cmixers_NaOH","v":0},"units",{"$f":"IF(C96=0,\"NA\",cmix_size_NaOH)","v":"NA"},{"$f":"IF(C96=0,\"\",\"hp\")","v":""},{"$f":"IF(C96=0,\"NA\",VLOOKUP(cmix_size_NaOH,port_mix_cost_cl,2))","v":"NA"},{"$f":"IF(C96=0,\"\",\"hp\")","v":""},{"$f":"IF(C96=0,\"NA\",VLOOKUP(cmix_size_NaOH,port_mix_cost_cl,3))","v":"NA"},{"$f":"IF(C96=0,\"--\",IF(I96=\"contact vendor\",\"--\",C96*I96))","v":"--"},{"$f":"IF(C96=0,\"NA\",VLOOKUP(cmix_size_NaOH,port_mix_cost_cl,IF(ss_cat=\"large\",4,5)))","v":"NA"},null,{"$f":"$B$68&\" - \"&$B$95&\" - \"&B96","v":"Chemical Storage - Mixers for Sodium Hydroxide Storage Tanks - Portable"},{"$f":"IF(retrofit=1,$W96*X96,IF(ISBLANK(X96),\"\",X96))","v":3},3,3,3,3,3,3,3,3,0,3,3,3,3,3,3,3,3,3,0,0]
["4.7.1","Mounted",{"$f":"cmixers_NaOH","v":0},"units",{"$f":"IF(C97=0,\"NA\",cmix_size_NaOH)","v":"NA"},{"$f":"IF(C97=0,\"\",\"hp\")","v":""},{"$f":"IF(C97=0,\"NA\",IF(curve=1,cmix_size_NaOH,VLOOKUP(cmix_size_NaOH,mount_mix_cost_cl,2)))","v":"NA"},{"$f":"IF(C97=0,\"\",\"hp\")","v":""},{"$f":"IF(C97=0,\"NA\",IF(curve=1,cmount_mix_eq_naoh,VLOOKUP(cmix_size_NaOH,mount_mix_cost_cl,3)))","v":"NA"},{"$f":"IF(C97=0,\"--\",IF(I97=\"contact vendor\",\"--\",C97*I97))","v":"--"},{"$f":"IF(C97=0,\"NA\",VLOOKUP(cmix_size_NaOH,mount_mix_cost_cl,IF(ss_cat=\"large\",4,5)))","v":"NA"},null,{"$f":"$B$68&\" - \"&$B$95&\" - \"&B97","v":"Chemical Storage - Mixers for Sodium Hydroxide Storage Tanks - Mounted"},1,1,1,1,1,1,1,1,1,0,1,1,1,1,1,1,1,1,1,0,0]
["4.7.1","Impeller",{"$f":"cmixers_NaOH","v":0},"units",{"$f":"IF(C98=0,\"NA\",cmix_size_NaOH)","v":"NA"},{"$f":"IF(C98=0,\"\",\"hp\")","v":""},{"$f":"IF(C98=0,\"NA\",IF(curve=1,cmix_size_NaOH,VLOOKUP(cmix_size_NaOH,imp_mix_cost_cl,2)))","v":"NA"},{"$f":"IF(C98=0,\"\",\"hp\")","v":""},{"$f":"IF(C98=0,\"NA\",IF(curve=1,cimp_mix_eq_naoh,VLOOKUP(cmix_size_NaOH,imp_mix_cost_cl,3)))","v":"NA"},{"$f":"IF(C98=0,\"--\",IF(I98=\"contact vendor\",\"--\",C98*I98))","v":"--"},{"$f":"IF(C98=0,\"NA\",VLOOKUP(cmix_size_NaOH,imp_mix_cost_cl,IF(ss_cat=\"large\",4,5)))","v":"NA"},null,{"$f":"$B$68&\" - \"&$B$95&\" - \"&B98","v":"Chemical Storage - Mixers for Sodium Hydroxide Storage Tanks - Impeller"},2,2,2,2,2,2,2,2,2,0,2,2,2,2,2,2,2,2,2,0,0]
[4.8,"Mixers for Sodium Hydroxide Day Tanks",null,null,null,null,null,null,null,null,null,null,null,null,null,null,null,null,null,null,null,null,null,null,null,null,null,null,null,null,null,null,0,0]
["4.8.1","Portable",{"$f":"dmixers_NaOH","v":0},"units",{"$f":"IF(C100=0,\"NA\",dmix_size_NaOH)","v":"NA"},{"$f":"IF(C100=0,\"\",\"hp\")","v":""},{"$f":"IF(C100=0,\"NA\",VLOOKUP(dmix_size_NaOH,port_mix_cost_cl,2))","v":"NA"},{"$f":"IF(C100=0,\"\",\"hp\")","v":""},{"$f":"IF(C100=0,\"NA\",VLOOKUP(dmix_size_NaOH,port_mix_cost_cl,3))","v":"NA"},{"$f":"IF(C100=0,\"--\",IF(I100=\"contact vendor\",\"--\",C100*I100))","v":"--"},{"$f":"IF(C100=0,\"NA\",VLOOKUP(dmix_size_NaOH,port_mix_cost_cl,IF(ss_cat=\"large\",4,5)))","v":"NA"},null,{"$f":"$B$68&\" - \"&$B$99&\" - \"&B100","v":"Chemical Storage - Mixers for Sodium Hydroxide Day Tanks - Portable"},{"$f":"IF(retrofit=1,$W100*X100,IF(ISBLANK(X100),\"\",X100))","v":3},3,3,3,3,3,3,3,3,0,3,3,3,3,3,3,3,3,3,0,0]
["4.8.1","Mounted",{"$f":"dmixers_NaOH","v":0},"units",{"$f":"IF(C101=0,\"NA\",dmix_size_NaOH)","v":"NA"},{"$f":"IF(C101=0,\"\",\"hp\")","v":""},{"$f":"IF(C101=0,\"NA\",IF(curve=1,dmix_size_NaOH,VLOOKUP(dmix_size_NaOH,mount_mix_cost_cl,2)))","v":"NA"},{"$f":"IF(C101=0,\"\",\"hp\")","v":""},{"$f":"IF(C101=0,\"NA\",IF(curve=1,dmount_mix_eq_naoh,VLOOKUP(dmix_size_NaOH,mount_mix_cost_cl,3)))","v":"NA"},{"$f":"IF(C101=0,\"--\",IF(I101=\"contact vendor\",\"--\",C101*I101))","v":"--"},{"$f":"IF(C101=0,\"NA\",VLOOKUP(dmix_size_NaOH,mount_mix_cost_cl,IF(ss_cat=\"large\",4,5)))","v":"NA"},null,{"$f":"$B$68&\" - \"&$B$99&\" - \"&B101","v":"Chemical Storage - Mixers for Sodium Hydroxide Day Tanks - Mounted"},1,1,1,1,1,1,1,1,1,0,1,1,1,1,1,1,1,1,1,0,0]
["4.8.1","Impeller",{"$f":"dmixers_NaOH","v":0},"units",{"$f":"IF(C102=0,\"NA\",dmix_size_NaOH)","v":"NA"},{"$f":"IF(C102=0,\"\",\"hp\")","v":""},{"$f":"IF(C102=0,\"NA\",IF(curve=1,dmix_size_NaOH,VLOOKUP(dmix_size_NaOH,imp_mix_cost_cl,2)))","v":"NA"},{"$f":"IF(C102=0,\"\",\"hp\")","v":""},{"$f":"IF(C102=0,\"NA\",IF(curve=1,dimp_mix_eq_naoh,VLOOKUP(dmix_size_NaOH,imp_mix_cost_cl,3)))","v":"NA"},{"$f":"IF(C102=0,\"--\",IF(I102=\"contact vendor\",\"--\",C102*I102))","v":"--"},{"$f":"IF(C102=0,\"NA\",VLOOKUP(dmix_size_NaOH,imp_mix_cost_cl,IF(ss_cat=\"large\",4,5)))","v":"NA"},null,{"$f":"$B$68&\" - \"&$B$99&\" - \"&B102","v":"Chemical Storage - Mixers for Sodium Hydroxide Day Tanks - Impeller"},2,2,2,2,2,2,2,2,2,0,2,2,2,2,2,2,2,2,2,0,0]
[4.9000000000000004,"Corrosion Control Chemical Storage Tanks",null,null,null,null,null,null,null,null,null,null,null,null,null,null,null,null,null,null,null,null,null,null,null,null,null,null,null,null,null,null,0,0]
["4.9.1","Plastic/HDPE",{"$f":"IF(chem_type=1,0,cc_tanks)","v":1},"units",{"$f":"IF(chem_type=1,\"NA\",cc_tank_vol)","v":4.2259150873281319},{"$f":"IF(chem_type=1,\"\",\"gal\")","v":"gal"},{"$f":"IF(chem_type=1,\"NA\",IF(curve=1,cc_tank_vol,VLOOKUP(cc_tank_vol,pl_cst_cost_cl,2)))","v":4.2259150873281319},{"$f":"IF(chem_type=1,\"\",\"gal\")","v":"gal"},{"$f":"IF(chem_type=1,\"NA\",IF(curve=1,pl_cst_eq,VLOOKUP(cc_tank_vol,pl_cst_cost_cl,3)))","v":754.75394361192116},{"$f":"IF(C104=0,\"--\",IF(I104=\"contact vendor\",\"--\",C104*I104))","v":754.75394361192116},{"$f":"IF(chem_type=1,\"NA\",VLOOKUP(cc_tank_vol,pl_cst_cost_cl,IF(ss_cat=\"large\",4,5)))","v":7},1,{"$f":"$B$68&\" - \"&$B$103&\" - \"&B104","v":"Chemical Storage - Corrosion Control Chemical Storage Tanks - Plastic/HDPE"},{"$f":"IF(retrofit=1,$W104*X104,IF(ISBLANK(X104),\"\",X104))","v":1},2,3,1,2,3,1,2,3,0,{"$f":"IF(chem_type=1,0,1)","v":1},{"$f":"IF(chem_type=1,0,2)","v":2},3,{"$f":"IF(chem_type=1,0,1)","v":1},{"$f":"IF(chem_type=1,0,2)","v":2},3,{"$f":"IF(chem_type=1,0,1)","v":1},{"$f":"IF(chem_type=1,0,2)","v":2},3,1,107.82199194456017]
["4.9.1","Fiberglass",{"$f":"IF(chem_type=1,0,cc_tanks)","v":1},"units",{"$f":"IF(chem_type=1,\"NA\",cc_tank_vol)","v":4.2259150873281319},{"$f":"IF(chem_type=1,\"\",\"gal\")","v":"gal"},{"$f":"IF(chem_type=1,\"NA\",IF(curve=1,cc_tank_vol,VLOOKUP(cc_tank_vol,fg_cst_cost_cl,2)))","v":4.2259150873281319},{"$f":"IF(chem_type=1,\"\",\"gal\")","v":"gal"},{"$f":"IF(chem_type=1,\"NA\",IF(curve=1,fg_cst_eq,VLOOKUP(cc_tank_vol,fg_cst_cost_cl,3)))","v":"contact vendor"},"--",{"$f":"IF(chem_type=1,\"NA\",VLOOKUP(cc_tank_vol,fg_cst_cost_cl,IF(ss_cat=\"large\",4,5)))","v":7},0,{"$f":"$B$68&\" - \"&$B$103&\" - \"&B105","v":"Chemical Storage - Corrosion Control Chemical Storage Tanks - Fiberglass"},2,1,2,2,1,2,2,1,2,0,{"$f":"IF(chem_type=1,0,2)","v":2},{"$f":"IF(chem_type=1,0,1)","v":1},2,{"$f":"IF(chem_type=1,0,2)","v":2},{"$f":"IF(chem_type=1,0,1)","v":1},2,{"$f":"IF(chem_type=1,0,2)","v":2},{"$f":"IF(chem_type=1,0,1)","v":1},2,0,0]
["4.9.1","Stainless Steel",{"$f":"IF(chem_type=1,0,cc_tanks)","v":1},"units",{"$f":"IF(chem_type=1,\"NA\",cc_tank_vol)","v":4.2259150873281319},{"$f":"IF(chem_type=1,\"\",\"gal\")","v":"gal"},{"$f":"IF(chem_type=1,\"NA\",IF(curve=1,cc_tank_vol,VLOOKUP(cc_tank_vol,ss_cst_cost_cl,2)))","v":4.2259150873281319},{"$f":"IF(chem_type=1,\"\",\"gal\")","v":"gal"},{"$f":"IF(chem_type=1,\"NA\",IF(curve=1,ss_cst_eq,VLOOKUP(cc_tank_vol,ss_cst_cost_cl,3)))","v":"contact vendor"},"--",{"$f":"IF(chem_type=1,\"NA\",VLOOKUP(cc_tank_vol,ss_cst_cost_cl,IF(ss_cat=\"large\",4,5)))","v":30},0,{"$f":"$B$68&\" - \"&$B$103&\" - \"&B106","v":"Chemical Storage - Corrosion Control Chemical Storage Tanks - Stainless Steel"},{"$f":"IF(retrofit=1,$W106*X106,IF(ISBLANK(X106),\"\",X106))","v":3},3,1,3,3,1,3,3,1,1,3,3,1,3,3,1,3,3,1,0,0]
["4.10","Corrosion Control Day Tanks",null,null,null,null,null,null,null,null,null,null,null,null,null,null,null,null,null,null,null,null,null,null,null,null,null,null,null,null,null,null,0,0]
["4.10.1","Plastic/HDPE",{"$f":"day_tanks_sh","v":0},"units",{"$f":"IF(C108=0,\"NA\",day_tank_vol_sh)","v":"NA"},{"$f":"IF(C108=0,\"\",\"gal\")","v":""},{"$f":"IF(C108=0,\"NA\",IF(curve=1,day_tank_vol_sh,VLOOKUP(day_tank_vol_sh,pl_cst_cost_cl,2)))","v":"NA"},{"$f":"IF(C108=0,\"\",\"gal\")","v":""},{"$f":"IF(C108=0,\"NA\",IF(curve=1,pl_day_eq,VLOOKUP(day_tank_vol_sh,pl_cst_cost_cl,3)))","v":"NA"},{"$f":"IF(C108=0,\"--\",IF(I108=\"contact vendor\",\"--\",C108*I108))","v":"--"},{"$f":"IF(C108=0,\"NA\",VLOOKUP(day_tank_vol_sh,pl_cst_cost_cl,IF(ss_cat=\"large\",4,5)))","v":"NA"},null,{"$f":"$B$68&\" - \"&$B$108&\" - \"&B108","v":"Chemical Storage - Plastic/HDPE - Plastic/HDPE"},{"$f":"IF(retrofit=1,$W108*X108,IF(ISBLANK(X108),\"\",X108))","v":1},2,3,1,2,3,1,2,3,0,1,2,3,1,2,3,1,2,3,0,0]
["4.10.1","Fiberglass",{"$f":"day_tanks_sh","v":0},"units",{"$f":"IF(C109=0,\"NA\",day_tank_vol_sh)","v":"NA"},{"$f":"IF(C109=0,\"\",\"gal\")","v":""},{"$f":"IF(C109=0,\"NA\",IF(curve=1,day_tank_vol_sh,VLOOKUP(day_tank_vol_sh,fg_cst_cost_cl,2)))","v":"NA"},{"$f":"IF(C109=0,\"\",\"gal\")","v":""},{"$f":"IF(C109=0,\"NA\",IF(curve=1,fg_day_eq,VLOOKUP(day_tank_vol_sh,fg_cst_cost_cl,3)))","v":"NA"},{"$f":"IF(C109=0,\"--\",IF(I109=\"contact vendor\",\"--\",C109*I109))","v":"--"},{"$f":"IF(C109=0,\"NA\",VLOOKUP(day_tank_vol_sh,fg_cst_cost_cl,IF(ss_cat=\"large\",4,5)))","v":"NA"},null,{"$f":"$B$68&\" - \"&$B$108&\" - \"&B109","v":"Chemical Storage - Plastic/HDPE - Fiberglass"},2,1,2,2,1,2,2,1,2,0,2,1,2,2,1,2,2,1,2,0,0]
["4.10.1","Stainless Steel",{"$f":"day_tanks_sh","v":0},"units",{"$f":"IF(C110=0,\"NA\",day_tank_vol_sh)","v":"NA"},{"$f":"IF(C110=0,\"\",\"gal\")","v":""},{"$f":"IF(C110=0,\"NA\",IF(curve=1,day_tank_vol_sh,VLOOKUP(day_tank_vol_sh,ss_cst_cost_cl,2)))","v":"NA"},{"$f":"IF(C110=0,\"\",\"gal\")","v":""},{"$f":"IF(C110=0,\"NA\",IF(curve=1,ss_day_eq,VLOOKUP(day_tank_vol_sh,ss_cst_cost_cl,3)))","v":"NA"},{"$f":"IF(C110=0,\"--\",IF(I110=\"contact vendor\",\"--\",C110*I110))","v":"--"},{"$f":"IF(C110=0,\"NA\",VLOOKUP(day_tank_vol_sh,ss_cst_cost_cl,IF(ss_cat=\"large\",4,5)))","v":"NA"},null,{"$f":"$B$68&\" - \"&$B$108&\" - \"&B110","v":"Chemical Storage - Plastic/HDPE - Stainless Steel"},{"$f":"IF(retrofit=1,$W110*X110,IF(ISBLANK(X110),\"\",X110))","v":3},3,1,3,3,1,3,3,1,0,3,3,1,3,3,1,3,3,1,0,0]
[4.1100000000000003,"Mixers for Corrosion Control Storage Tanks",null,null,null,null,null,null,null,null,null,null,null,null,null,null,null,null,null,null,null,null,null,null,null,null,null,null,null,null,null,null,0,0]
["4.11.1","Portable",{"$f":"cmixers_sh","v":1},"units",{"$f":"IF(C112=0,\"NA\",cmix_size_sh)","v":1.056478771832033E-3},{"$f":"IF(C112=0,\"\",\"hp\")","v":"hp"},{"$f":"IF(C112=0,\"NA\",VLOOKUP(cmix_size_sh,port_mix_cost_cl,2))","v":1},{"$f":"IF(C112=0,\"\",\"hp\")","v":"hp"},{"$f":"IF(C112=0,\"NA\",VLOOKUP(cmix_size_sh,port_mix_cost_cl,3))","v":1977.7631003548438},{"$f":"IF(C112=0,\"--\",IF(I112=\"contact vendor\",\"--\",C112*I112))","v":1977.7631003548438},{"$f":"IF(C112=0,\"NA\",VLOOKUP(cmix_size_sh,port_mix_cost_cl,IF(ss_cat=\"large\",4,5)))","v":20},0,{"$f":"$B$68&\" - \"&$B$111&\" - \"&B112","v":"Chemical Storage - Mixers for Corrosion Control Storage Tanks - Portable"},{"$f":"IF(retrofit=1,$W112*X112,IF(ISBLANK(X112),\"\",X112))","v":3},3,3,3,3,3,3,3,3,0,3,3,3,3,3,3,3,3,3,0,0]
["4.11.1","Mounted",{"$f":"cmixers_sh","v":1},"units",{"$f":"IF(C113=0,\"NA\",cmix_size_sh)","v":1.056478771832033E-3},{"$f":"IF(C113=0,\"\",\"hp\")","v":"hp"},{"$f":"IF(C113=0,\"NA\",IF(curve=1,cmix_size_sh,VLOOKUP(cmix_size_sh,mount_mix_cost_cl,2)))","v":1.056478771832033E-3},{"$f":"IF(C113=0,\"\",\"hp\")","v":"hp"},{"$f":"IF(C113=0,\"NA\",IF(curve=1,cmount_mix_eq,VLOOKUP(cmix_size_sh,mount_mix_cost_cl,3)))","v":368.69507859264894},{"$f":"IF(C113=0,\"--\",IF(I113=\"contact vendor\",\"--\",C113*I113))","v":368.69507859264894},{"$f":"IF(C113=0,\"NA\",VLOOKUP(cmix_size_sh,mount_mix_cost_cl,IF(ss_cat=\"large\",4,5)))","v":22},1,{"$f":"$B$68&\" - \"&$B$111&\" - \"&B113","v":"Chemical Storage - Mixers for Corrosion Control Storage Tanks - Mounted"},1,1,1,1,1,1,1,1,1,0,1,1,1,1,1,1,1,1,1,1,16.758867208756769]
["4.11.1","Impeller",{"$f":"cmixers_sh","v":1},"units",{"$f":"IF(C114=0,\"NA\",cmix_size_sh)","v":1.056478771832033E-3},{"$f":"IF(C114=0,\"\",\"hp\")","v":"hp"},{"$f":"IF(C114=0,\"NA\",IF(curve=1,cmix_size_sh,VLOOKUP(cmix_size_sh,imp_mix_cost_cl,2)))","v":1.056478771832033E-3},{"$f":"IF(C114=0,\"\",\"hp\")","v":"hp"},{"$f":"IF(C114=0,\"NA\",IF(curve=1,cimp_mix_eq,VLOOKUP(cmix_size_sh,imp_mix_cost_cl,3)))","v":195.04445091214686},{"$f":"IF(C114=0,\"--\",IF(I114=\"contact vendor\",\"--\",C114*I114))","v":195.04445091214686},{"$f":"IF(C114=0,\"NA\",VLOOKUP(cmix_size_sh,imp_mix_cost_cl,IF(ss_cat=\"large\",4,5)))","v":20},0,{"$f":"$B$68&\" - \"&$B$111&\" - \"&B114","v":"Chemical Storage - Mixers for Corrosion Control Storage Tanks - Impeller"},2,2,2,2,2,2,2,2,2,0,2,2,2,2,2,2,2,2,2,0,0]
[4.12,"Mixers for Corrosion Control Day Tanks",null,null,null,null,null,null,null,null,null,null,null,null,null,null,null,null,null,null,null,null,null,null,null,null,null,null,null,null,null,null,0,0]
["4.12.1","Portable",{"$f":"dmixers_sh","v":0},"units",{"$f":"IF(C116=0,\"NA\",dmix_size_sh)","v":"NA"},{"$f":"IF(C116=0,\"\",\"hp\")","v":""},{"$f":"IF(C116=0,\"NA\",VLOOKUP(dmix_size_sh,port_mix_cost_cl,2))","v":"NA"},{"$f":"IF(C116=0,\"\",\"hp\")","v":""},{"$f":"IF(C116=0,\"NA\",VLOOKUP(dmix_size_sh,port_mix_cost_cl,3))","v":"NA"},{"$f":"IF(C116=0,\"--\",IF(I116=\"contact vendor\",\"--\",C116*I116))","v":"--"},{"$f":"IF(C116=0,\"NA\",VLOOKUP(dmix_size_sh,port_mix_cost_cl,IF(ss_cat=\"large\",4,5)))","v":"NA"},null,{"$f":"$B$68&\" - \"&$B$115&\" - \"&B116","v":"Chemical Storage - Mixers for Corrosion Control Day Tanks - Portable"},{"$f":"IF(retrofit=1,$W116*X116,IF(ISBLANK(X116),\"\",X116))","v":3},3,3,3,3,3,3,3,3,0,3,3,3,3,3,3,3,3,3,0,0]
["4.12.1","Mounted",{"$f":"dmixers_sh","v":0},"units",{"$f":"IF(C117=0,\"NA\",dmix_size_sh)","v":"NA"},{"$f":"IF(C117=0,\"\",\"hp\")","v":""},{"$f":"IF(C117=0,\"NA\",IF(curve=1,dmix_size_sh,VLOOKUP(dmix_size_sh,mount_mix_cost_cl,2)))","v":"NA"},{"$f":"IF(C117=0,\"\",\"hp\")","v":""},{"$f":"IF(C117=0,\"NA\",IF(curve=1,dmount_mix_eq,VLOOKUP(dmix_size_sh,mount_mix_cost_cl,3)))","v":"NA"},{"$f":"IF(C117=0,\"--\",IF(I117=\"contact vendor\",\"--\",C117*I117))","v":"--"},{"$f":"IF(C117=0,\"NA\",VLOOKUP(dmix_size_sh,mount_mix_cost_cl,IF(ss_cat=\"large\",4,5)))","v":"NA"},null,{"$f":"$B$68&\" - \"&$B$115&\" - \"&B117","v":"Chemical Storage - Mixers for Corrosion Control Day Tanks - Mounted"},1,1,1,1,1,1,1,1,1,0,1,1,1,1,1,1,1,1,1,0,0]
["4.12.1","Impeller",{"$f":"dmixers_sh","v":0},"units",{"$f":"IF(C118=0,\"NA\",dmix_size_sh)","v":"NA"},{"$f":"IF(C118=0,\"\",\"hp\")","v":""},{"$f":"IF(C118=0,\"NA\",IF(curve=1,dmix_size_sh,VLOOKUP(dmix_size_sh,imp_mix_cost_cl,2)))","v":"NA"},{"$f":"IF(C118=0,\"\",\"hp\")","v":""},{"$f":"IF(C118=0,\"NA\",IF(curve=1,dimp_mix_eq,VLOOKUP(dmix_size_sh,imp_mix_cost_cl,3)))","v":"NA"},{"$f":"IF(C118=0,\"--\",IF(I118=\"contact vendor\",\"--\",C118*I118))","v":"--"},{"$f":"IF(C118=0,\"NA\",VLOOKUP(dmix_size_sh,imp_mix_cost_cl,IF(ss_cat=\"large\",4,5)))","v":"NA"},null,{"$f":"$B$68&\" - \"&$B$115&\" - \"&B118","v":"Chemical Storage - Mixers for Corrosion Control Day Tanks - Impeller"},2,2,2,2,2,2,2,2,2,0,2,2,2,2,2,2,2,2,2,0,0]
["5.","Chemicals",null,null,null,null,null,null,null,null,null,null,null,null,null,null,null,null,null,null,null,null,null,null,null,null,null,null,null,null,null,null,0,0]
["5.1",{"$f":"CHOOSE(acid_type,\"No acid addition\",\"Hydrochloric Acid\",\"Sulfuric Acid\")","v":"No acid addition"},{"$f":"HCl_init","v":0},"lbs","NA",null,"NA",null,{"$f":"IF(C120=0,\"NA\",VLOOKUP(B120,chem_cost_cl,3,FALSE))","v":"NA"},{"$f":"IF(C120=0,\"--\",IF(I120=\"contact vendor\",\"--\",C120*I120))","v":"--"},{"$f":"IF(C120=0,\"NA\",VLOOKUP(B120,chem_cost_cl,IF(ss_cat=\"large\",4,5),FALSE))","v":"NA"},null,{"$f":"$B$119&\" - \"&B120","v":"Chemicals - No acid addition"},{"$f":"IF(retrofit=1,$W120*X120,IF(ISBLANK(X120),\"\",X120))","v":1},1,1,1,1,1,1,{"$f":"IF(retrofit=1,$W120*AE120,IF(ISBLANK(AE120),\"\",AE120))","v":1},1,0,1,1,1,1,1,1,1,1,1,0,0]
["5.2",{"$f":"CHOOSE(acid_type,\"No caustic addition\",\"Sodium Hydroxide\",\"Sodium Hydroxide\")","v":"No caustic addition"},{"$f":"NaOH_init","v":0},"lbs","NA",null,"NA",null,{"$f":"IF(C121=0,\"NA\",VLOOKUP(B121,chem_cost_cl,3,FALSE))","v":"NA"},"--",{"$f":"IF(C121=0,\"NA\",VLOOKUP(B121,chem_cost_cl,IF(ss_cat=\"large\",4,5),FALSE))","v":"NA"},null,{"$f":"$B$119&\" - \"&B121","v":"Chemicals - No caustic addition"},1,1,1,1,1,1,1,1,1,0,1,1,1,1,1,1,1,1,1,0,0]
["5.3",{"$f":"CHOOSE(chem_type,\"Corrosion control chemical\",\"Sodium Hexametaphosphate\",\"Tetrasodium Polyphosphate\")","v":"Sodium Hexametaphosphate"},{"$f":"IF(chem_type=1,0,cc_init)","v":8.7570000000000014},"lbs","NA",null,"NA",null,{"$f":"IF(chem_type=1,\"NA\",VLOOKUP(B122,chem_cost_cl,3,FALSE))","v":2.3467303894317206},20.550318020253581,{"$f":"IF(C122=0,\"NA\",VLOOKUP(B122,chem_cost_cl,IF(ss_cat=\"large\",4,5),FALSE))","v":"N/A"},1,{"$f":"$B$119&\" - \"&B122","v":"Chemicals - Sodium Hexametaphosphate"},1,1,1,1,1,1,1,1,1,0,{"$f":"IF(chem_type=1,0,1)","v":1},{"$f":"IF(chem_type=1,0,1)","v":1},1,1,1,1,1,1,1,0,0]
["6.","Piping",null,null,null,null,null,null,null,null,null,null,null,null,null,null,null,null,null,null,null,null,null,null,null,null,null,null,null,null,null,null,0,0]
["6.1","Process Piping",null,null,null,null,null,null,null,null,null,null,null,null,null,null,null,null,null,null,null,null,null,null,null,null,null,null,null,null,null,null,0,0]
["6.1.1","Ductile Iron",{"$f":"proc_pipe_length","v":62.542906817411691},"lf",{"$f":"proc_pipe_diam","v":1.5},"in. diam",{"$f":"IF(curve=1,proc_pipe_diam,VLOOKUP(proc_pipe_diam,di_pipe_cost_cl,2))","v":1.5},"in. diam",{"$f":"IF(curve=1,di_pipe_eq_in,VLOOKUP(proc_pipe_diam,di_pipe_cost_cl,3))","v":"contact vendor"},{"$f":"IF(I125=\"contact vendor\",\"--\",C125*I125)","v":"--"},{"$f":"VLOOKUP(proc_pipe_diam,di_pipe_cost_cl,IF(ss_cat=\"large\",4,5))","v":35},0,{"$f":"$B$123&\" - \"&$B$124&\" - \"&B125","v":"Piping - Process Piping - Ductile Iron"},{"$f":"IF(retrofit=1,$W125*X125,IF(ISBLANK(X125),\"\",X125))","v":3},{"$f":"IF(retrofit=1,$W125*Y125,IF(ISBLANK(Y125),\"\",Y125))","v":3},3,3,3,3,3,{"$f":"IF(retrofit=1,$W125*AE125,IF(ISBLANK(AE125),\"\",AE125))","v":3},3,0,3,3,3,3,3,3,3,3,3,0,0]
["6.1.1","CPVC",{"$f":"proc_pipe_length","v":62.542906817411691},"lf",{"$f":"proc_pipe_diam","v":1.5},"in. diam",{"$f":"IF(curve=1,proc_pipe_diam,VLOOKUP(proc_pipe_diam,cpvc_pipe_cost_cl,2))","v":1.5},"in. diam",{"$f":"IF(curve=1,cpvc_pipe_eq_in,VLOOKUP(proc_pipe_diam,cpvc_pipe_cost_cl,3))","v":8.8384855386249992},{"$f":"IF(I126=\"contact vendor\",\"--\",C126*I126)","v":552.78457744926413},{"$f":"VLOOKUP(proc_pipe_diam,cpvc_pipe_cost_cl,IF(ss_cat=\"large\",4,5))","v":17},0,{"$f":"$B$123&\" - \"&$B$124&\" - \"&B126","v":"Piping - Process Piping - CPVC"},2,1,4,2,1,4,2,1,4,0,2,1,4,2,1,4,2,1,4,0,0]
["6.1.1","PVC",{"$f":"proc_pipe_length","v":62.542906817411691},"lf",{"$f":"proc_pipe_diam","v":1.5},"in. diam",{"$f":"IF(curve=1,proc_pipe_diam,VLOOKUP(proc_pipe_diam,pvc_pipe_cost_cl,2))","v":1.5},"in. diam",{"$f":"IF(curve=1,pvc_pipe_eq_in,VLOOKUP(proc_pipe_diam,pvc_pipe_cost_cl,3))","v":2.2804869051250001},{"$f":"IF(I127=\"contact vendor\",\"--\",C127*I127)","v":142.62828000556044},{"$f":"VLOOKUP(proc_pipe_diam,pvc_pipe_cost_cl,IF(ss_cat=\"large\",4,5))","v":17},1,{"$f":"$B$123&\" - \"&$B$124&\" - \"&B127","v":"Piping - Process Piping - PVC"},1,2,5,1,2,5,1,2,5,0,1,2,5,1,2,5,1,2,5,{"$f":"IF(ISERROR(K127*L127),0,IF(K127<1,0,L127))","v":1},{"$f":"IF(AG127,J127/K127,0)","v":8.3898988238564964}]
["6.1.1","Stainless Steel",{"$f":"proc_pipe_length","v":62.542906817411691},"lf",{"$f":"proc_pipe_diam","v":1.5},"in. diam",{"$f":"IF(curve=1,proc_pipe_diam,VLOOKUP(proc_pipe_diam,ss_pipe_cost_cl,2))","v":1.5},"in. diam",{"$f":"IF(curve=1,ss_pipe_eq_in,VLOOKUP(proc_pipe_diam,ss_pipe_cost_cl,3))","v":50.308192065499988},{"$f":"IF(I128=\"contact vendor\",\"--\",C128*I128)","v":3146.420568505016},{"$f":"VLOOKUP(proc_pipe_diam,ss_pipe_cost_cl,IF(ss_cat=\"large\",4,5))","v":40},0,{"$f":"$B$123&\" - \"&$B$124&\" - \"&B128","v":"Piping - Process Piping - Stainless Steel"},5,5,1,5,5,1,5,5,1,0,5,5,1,5,5,1,5,5,1,0,0]
["6.1.1","Steel",{"$f":"proc_pipe_length","v":62.542906817411691},"lf",{"$f":"proc_pipe_diam","v":1.5},"in. diam",{"$f":"IF(curve=1,proc_pipe_diam,VLOOKUP(proc_pipe_diam,st_pipe_cost_cl,2))","v":1.5},"in. diam",{"$f":"IF(curve=1,st_pipe_eq_in,VLOOKUP(proc_pipe_diam,st_pipe_cost_cl,3))","v":24.836319334125001},{"$f":"IF(I129=\"contact vendor\",\"--\",C129*I129)","v":1553.3356058016602},{"$f":"VLOOKUP(proc_pipe_diam,st_pipe_cost_cl,IF(ss_cat=\"large\",4,5))","v":33},0,{"$f":"$B$123&\" - \"&$B$124&\" - \"&B129","v":"Piping - Process Piping - Steel"},4,4,2,4,4,2,4,4,2,0,4,4,2,4,4,2,4,4,2,0,0]
["6.2","Inlet and Outlet Piping",null,null,null,null,null,null,null,null,null,null,null,null,null,null,null,null,null,null,null,null,null,null,null,null,null,null,null,null,null,null,0,0]
["6.2.1","Ductile Iron",{"$f":"in_out_pipe_length","v":40},"lf",{"$f":"in_out_pipe_diam","v":1.5},"in. diam",{"$f":"IF(curve=1,in_out_pipe_diam,VLOOKUP(in_out_pipe_diam,di_pipe_cost_cl,2))","v":1.5},"in. diam",{"$f":"IF(curve=1,di_pipe_eq_head,VLOOKUP(in_out_pipe_diam,di_pipe_cost_cl,3))","v":"contact vendor"},{"$f":"IF(I131=\"contact vendor\",\"--\",C131*I131)","v":"--"},{"$f":"VLOOKUP(in_out_pipe_diam,di_pipe_cost_cl,IF(ss_cat=\"large\",4,5))","v":35},0,{"$f":"$B$123&\" - \"&$B$130&\" - \"&B131","v":"Piping - Inlet and Outlet Piping - Ductile Iron"},{"$f":"IF(retrofit=1,$W131*X131,IF(ISBLANK(X131),\"\",X131))","v":3},3,3,3,3,3,3,{"$f":"IF(retrofit=1,$W131*AE131,IF(ISBLANK(AE131),\"\",AE131))","v":3},3,0,3,3,3,3,3,3,3,3,3,0,0]
["6.2.1","CPVC",{"$f":"in_out_pipe_length","v":40},"lf",{"$f":"in_out_pipe_diam","v":1.5},"in. diam",{"$f":"IF(curve=1,in_out_pipe_diam,VLOOKUP(in_out_pipe_diam,cpvc_pipe_cost_cl,2))","v":1.5},"in. diam",{"$f":"IF(curve=1,cpvc_pipe_eq_head,VLOOKUP(in_out_pipe_diam,cpvc_pipe_cost_cl,3))","v":8.8384855386249992},{"$f":"IF(I132=\"contact vendor\",\"--\",C132*I132)","v":353.53942154499998},{"$f":"VLOOKUP(in_out_pipe_diam,cpvc_pipe_cost_cl,IF(ss_cat=\"large\",4,5))","v":17},0,{"$f":"$B$123&\" - \"&$B$130&\" - \"&B132","v":"Piping - Inlet and Outlet Piping - CPVC"},2,1,4,2,1,4,2,1,4,0,2,1,4,2,1,4,2,1,4,0,0]
["6.2.1","PVC",{"$f":"in_out_pipe_length","v":40},"lf",{"$f":"in_out_pipe_diam","v":1.5},"in. diam",{"$f":"IF(curve=1,in_out_pipe_diam,VLOOKUP(in_out_pipe_diam,pvc_pipe_cost_cl,2))","v":1.5},"in. diam",{"$f":"IF(curve=1,pvc_pipe_eq_head,VLOOKUP(in_out_pipe_diam,pvc_pipe_cost_cl,3))","v":2.2804869051250001},{"$f":"IF(I133=\"contact vendor\",\"--\",C133*I133)","v":91.219476205000007},{"$f":"VLOOKUP(in_out_pipe_diam,pvc_pipe_cost_cl,IF(ss_cat=\"large\",4,5))","v":17},1,{"$f":"$B$123&\" - \"&$B$130&\" - \"&B133","v":"Piping - Inlet and Outlet Piping - PVC"},1,2,5,1,2,5,1,2,5,0,1,2,5,1,2,5,1,2,5,1,5.3658515414705885]
["6.2.1","Stainless Steel",{"$f":"in_out_pipe_length","v":40},"lf",{"$f":"in_out_pipe_diam","v":1.5},"in. diam",{"$f":"IF(curve=1,in_out_pipe_diam,VLOOKUP(in_out_pipe_diam,ss_pipe_cost_cl,2))","v":1.5},"in. diam",{"$f":"IF(curve=1,ss_pipe_eq_head,VLOOKUP(in_out_pipe_diam,ss_pipe_cost_cl,3))","v":50.308192065499988},{"$f":"IF(I134=\"contact vendor\",\"--\",C134*I134)","v":2012.3276826199995},{"$f":"VLOOKUP(in_out_pipe_diam,ss_pipe_cost_cl,IF(ss_cat=\"large\",4,5))","v":40},0,{"$f":"$B$123&\" - \"&$B$130&\" - \"&B134","v":"Piping - Inlet and Outlet Piping - Stainless Steel"},5,5,1,5,5,1,5,5,1,0,5,5,1,5,5,1,5,5,1,0,0]
["6.2.1","Steel",{"$f":"in_out_pipe_length","v":40},"lf",{"$f":"in_out_pipe_diam","v":1.5},"in. diam",{"$f":"IF(curve=1,in_out_pipe_diam,VLOOKUP(in_out_pipe_diam,st_pipe_cost_cl,2))","v":1.5},"in. diam",{"$f":"IF(curve=1,st_pipe_eq_head,VLOOKUP(in_out_pipe_diam,st_pipe_cost_cl,3))","v":24.836319334125001},{"$f":"IF(I135=\"contact vendor\",\"--\",C135*I135)","v":993.45277336499998},{"$f":"VLOOKUP(in_out_pipe_diam,st_pipe_cost_cl,IF(ss_cat=\"large\",4,5))","v":33},0,{"$f":"$B$123&\" - \"&$B$130&\" - \"&B135","v":"Piping - Inlet and Outlet Piping - Steel"},4,4,2,4,4,2,4,4,2,0,4,4,2,4,4,2,4,4,2,0,0]
["6.3","Air Piping",null,null,null,null,null,null,null,null,null,null,null,null,null,null,null,null,null,null,null,null,null,null,null,null,null,null,null,null,null,null,0,0]
["6.3.1","CPVC",{"$f":"air_pipe_length","v":200},"lf",{"$f":"air_pipe_diam","v":1.5},"in. diam",{"$f":"IF(curve=1,air_pipe_diam,VLOOKUP(air_pipe_diam,cpvc_pipe_cost_cl,2))","v":1.5},"in. diam",{"$f":"IF(curve=1,cpvc_pipe_eq_air,VLOOKUP(air_pipe_diam,cpvc_pipe_cost_cl,3))","v":8.8384855386249992},{"$f":"IF(I137=\"contact vendor\",\"--\",C137*I137)","v":1767.6971077249998},{"$f":"VLOOKUP(air_pipe_diam,cpvc_pipe_cost_cl,IF(ss_cat=\"large\",4,5))","v":17},0,{"$f":"$B$123&\" - \"&$B$136&\" - \"&B137","v":"Piping - Air Piping - CPVC"},{"$f":"IF(retrofit=1,$W137*X137,IF(ISBLANK(X137),\"\",X137))","v":2},1,3,2,1,3,2,{"$f":"IF(retrofit=1,$W137*AE137,IF(ISBLANK(AE137),\"\",AE137))","v":1},3,0,2,1,3,2,1,3,2,1,3,0,0]
["6.3.1","PVC",{"$f":"air_pipe_length","v":200},"lf",{"$f":"air_pipe_diam","v":1.5},"in. diam",{"$f":"IF(curve=1,air_pipe_diam,VLOOKUP(air_pipe_diam,pvc_pipe_cost_cl,2))","v":1.5},"in. diam",{"$f":"IF(curve=1,pvc_pipe_eq_air,VLOOKUP(air_pipe_diam,pvc_pipe_cost_cl,3))","v":2.2804869051250001},{"$f":"IF(I138=\"contact vendor\",\"--\",C138*I138)","v":456.097381025},{"$f":"VLOOKUP(air_pipe_diam,pvc_pipe_cost_cl,IF(ss_cat=\"large\",4,5))","v":17},1,{"$f":"$B$123&\" - \"&$B$136&\" - \"&B138","v":"Piping - Air Piping - PVC"},1,2,4,1,2,4,1,2,4,0,1,2,4,1,2,4,1,2,4,1,26.829257707352941]
["6.3.1","Stainless Steel",{"$f":"air_pipe_length","v":200},"lf",{"$f":"air_pipe_diam","v":1.5},"in. diam",{"$f":"IF(curve=1,air_pipe_diam,VLOOKUP(air_pipe_diam,ss_pipe_cost_cl,2))","v":1.5},"in. diam",{"$f":"IF(curve=1,ss_pipe_eq_air,VLOOKUP(air_pipe_diam,ss_pipe_cost_cl,3))","v":50.308192065499988},{"$f":"IF(I139=\"contact vendor\",\"--\",C139*I139)","v":10061.638413099998},{"$f":"VLOOKUP(air_pipe_diam,ss_pipe_cost_cl,IF(ss_cat=\"large\",4,5))","v":40},0,{"$f":"$B$123&\" - \"&$B$136&\" - \"&B139","v":"Piping - Air Piping - Stainless Steel"},4,4,1,4,4,1,4,4,1,0,4,4,1,4,4,1,4,4,1,0,0]
["6.3.1","Steel",{"$f":"air_pipe_length","v":200},"lf",{"$f":"air_pipe_diam","v":1.5},"in. diam",{"$f":"IF(curve=1,air_pipe_diam,VLOOKUP(air_pipe_diam,st_pipe_cost_cl,2))","v":1.5},"in. diam",{"$f":"IF(curve=1,st_pipe_eq_air,VLOOKUP(air_pipe_diam,st_pipe_cost_cl,3))","v":24.836319334125001},{"$f":"IF(I140=\"contact vendor\",\"--\",C140*I140)","v":4967.2638668250002},{"$f":"VLOOKUP(air_pipe_diam,st_pipe_cost_cl,IF(ss_cat=\"large\",4,5))","v":33},0,{"$f":"$B$123&\" - \"&$B$136&\" - \"&B140","v":"Piping - Air Piping - Steel"},3,3,2,3,3,2,3,3,2,0,3,3,2,3,3,2,3,3,2,0,0]
["6.4","Acid Feed Piping",null,null,null,null,null,null,null,null,null,null,null,null,null,null,null,null,null,null,null,null,null,null,null,null,null,null,null,null,null,null,0,0]
["6.4.1","CPVC",{"$f":"IF(acid_type=1,0,chem_pipe_length)","v":0},"lf",{"$f":"IF(C142=0,\"NA\",HCl_pipe_diam)","v":"NA"},{"$f":"IF(C142=0,\"\",\"in. diam\")","v":""},{"$f":"IF(C142=0,\"NA\",IF(curve=1,HCl_pipe_diam,VLOOKUP(HCl_pipe_diam,cpvc_pipe_cost_cl,2)))","v":"NA"},{"$f":"IF(C142=0,\"\",\"in. diam\")","v":""},{"$f":"IF(C142=0,\"NA\",IF(curve=1,cpvc_pipe_eq_hcl,VLOOKUP(HCl_pipe_diam,cpvc_pipe_cost_cl,3)))","v":"NA"},{"$f":"IF(C142=0,\"--\",IF(I142=\"contact vendor\",\"--\",C142*I142))","v":"--"},{"$f":"IF(C142=0,\"NA\",VLOOKUP(HCl_pipe_diam,cpvc_pipe_cost_cl,IF(ss_cat=\"large\",4,5)))","v":"NA"},null,{"$f":"$B$123&\" - \"&$B$141&\" - \"&B142","v":"Piping - Acid Feed Piping - CPVC"},{"$f":"IF(retrofit=1,$W142*X142,IF(ISBLANK(X142),\"\",X142))","v":2},1,2,2,1,2,2,{"$f":"IF(retrofit=1,$W142*AE142,IF(ISBLANK(AE142),\"\",AE142))","v":1},2,0,2,1,2,2,1,2,2,1,2,0,0]
["6.4.1","PVC",{"$f":"IF(acid_type=1,0,chem_pipe_length)","v":0},"lf",{"$f":"IF(C143=0,\"NA\",HCl_pipe_diam)","v":"NA"},{"$f":"IF(C143=0,\"\",\"in. diam\")","v":""},{"$f":"IF(C143=0,\"NA\",IF(curve=1,HCl_pipe_diam,VLOOKUP(HCl_pipe_diam,pvc_pipe_cost_cl,2)))","v":"NA"},{"$f":"IF(C143=0,\"\",\"in. diam\")","v":""},{"$f":"IF(C143=0,\"NA\",IF(curve=1,pvc_pipe_eq_hcl,VLOOKUP(HCl_pipe_diam,pvc_pipe_cost_cl,3)))","v":"NA"},"--",{"$f":"IF(C143=0,\"NA\",VLOOKUP(HCl_pipe_diam,pvc_pipe_cost_cl,IF(ss_cat=\"large\",4,5)))","v":"NA"},null,{"$f":"$B$123&\" - \"&$B$141&\" - \"&B143","v":"Piping - Acid Feed Piping - PVC"},1,2,3,1,2,3,1,2,3,0,1,2,3,1,2,3,1,2,3,0,0]
["6.4.1","Stainless Steel",{"$f":"IF(acid_type=1,0,chem_pipe_length)","v":0},"lf",{"$f":"IF(C144=0,\"NA\",HCl_pipe_diam)","v":"NA"},{"$f":"IF(C144=0,\"\",\"in. diam\")","v":""},{"$f":"IF(C144=0,\"NA\",IF(curve=1,HCl_pipe_diam,VLOOKUP(HCl_pipe_diam,ss_pipe_cost_cl,2)))","v":"NA"},{"$f":"IF(C144=0,\"\",\"in. diam\")","v":""},{"$f":"IF(C144=0,\"NA\",IF(curve=1,ss_pipe_eq_hcl,VLOOKUP(HCl_pipe_diam,ss_pipe_cost_cl,3)))","v":"NA"},"--",{"$f":"IF(C144=0,\"NA\",VLOOKUP(HCl_pipe_diam,ss_pipe_cost_cl,IF(ss_cat=\"large\",4,5)))","v":"NA"},null,{"$f":"$B$123&\" - \"&$B$141&\" - \"&B144","v":"Piping - Acid Feed Piping - Stainless Steel"},3,3,1,3,3,1,3,3,1,0,3,3,1,3,3,1,3,3,1,0,0]
["6.5","Sodium Hydroxide Feed Piping",null,null,null,null,null,null,null,null,null,null,null,null,null,null,null,null,null,null,null,null,null,null,null,null,null,null,null,null,null,null,0,0]
["6.5.1","CPVC",{"$f":"IF(acid_type=1,0,chem_pipe_length)","v":0},"lf",{"$f":"IF(C146=0,\"NA\",NaOH_pipe_diam)","v":"NA"},{"$f":"IF(C146=0,\"\",\"in. diam\")","v":""},{"$f":"IF(C146=0,\"NA\",IF(curve=1,NaOH_pipe_diam,VLOOKUP(NaOH_pipe_diam,cpvc_pipe_cost_cl,2)))","v":"NA"},{"$f":"IF(C146=0,\"\",\"in. diam\")","v":""},{"$f":"IF(C142=0,\"NA\",IF(curve=1,cpvc_pipe_eq_naoh,VLOOKUP(NaOH_pipe_diam,cpvc_pipe_cost_cl,3)))","v":"NA"},{"$f":"IF(C146=0,\"--\",IF(I146=\"contact vendor\",\"--\",C146*I146))","v":"--"},{"$f":"IF(C146=0,\"NA\",VLOOKUP(NaOH_pipe_diam,cpvc_pipe_cost_cl,IF(ss_cat=\"large\",4,5)))","v":"NA"},null,{"$f":"$B$123&\" - \"&$B$145&\" - \"&B146","v":"Piping - Sodium Hydroxide Feed Piping - CPVC"},{"$f":"IF(retrofit=1,$W146*X146,IF(ISBLANK(X146),\"\",X146))","v":2},1,2,2,1,2,2,{"$f":"IF(retrofit=1,$W146*AE146,IF(ISBLANK(AE146),\"\",AE146))","v":1},2,0,2,1,2,2,1,2,2,1,2,0,0]
["6.5.1","PVC",{"$f":"IF(acid_type=1,0,chem_pipe_length)","v":0},"lf",{"$f":"IF(C147=0,\"NA\",NaOH_pipe_diam)","v":"NA"},{"$f":"IF(C147=0,\"\",\"in. diam\")","v":""},{"$f":"IF(C147=0,\"NA\",IF(curve=1,NaOH_pipe_diam,VLOOKUP(NaOH_pipe_diam,pvc_pipe_cost_cl,2)))","v":"NA"},{"$f":"IF(C147=0,\"\",\"in. diam\")","v":""},{"$f":"IF(C142=0,\"NA\",IF(curve=1,pvc_pipe_eq_naoh,VLOOKUP(NaOH_pipe_diam,pvc_pipe_cost_cl,3)))","v":"NA"},"--",{"$f":"IF(C147=0,\"NA\",VLOOKUP(NaOH_pipe_diam,pvc_pipe_cost_cl,IF(ss_cat=\"large\",4,5)))","v":"NA"},null,{"$f":"$B$123&\" - \"&$B$145&\" - \"&B147","v":"Piping - Sodium Hydroxide Feed Piping - PVC"},1,2,3,1,2,3,1,2,3,0,1,2,3,1,2,3,1,2,3,0,0]
["6.5.1","Stainless Steel",{"$f":"IF(acid_type=1,0,chem_pipe_length)","v":0},"lf",{"$f":"IF(C148=0,\"NA\",NaOH_pipe_diam)","v":"NA"},{"$f":"IF(C148=0,\"\",\"in. diam\")","v":""},{"$f":"IF(C148=0,\"NA\",IF(curve=1,NaOH_pipe_diam,VLOOKUP(NaOH_pipe_diam,ss_pipe_cost_cl,2)))","v":"NA"},{"$f":"IF(C148=0,\"\",\"in. diam\")","v":""},{"$f":"IF(C142=0,\"NA\",IF(curve=1,ss_pipe_eq_naoh,VLOOKUP(NaOH_pipe_diam,ss_pipe_cost_cl,3)))","v":"NA"},"--",{"$f":"IF(C148=0,\"NA\",VLOOKUP(NaOH_pipe_diam,ss_pipe_cost_cl,IF(ss_cat=\"large\",4,5)))","v":"NA"},null,{"$f":"$B$123&\" - \"&$B$145&\" - \"&B148","v":"Piping - Sodium Hydroxide Feed Piping - Stainless Steel"},3,3,1,3,3,1,3,3,1,0,3,3,1,3,3,1,3,3,1,0,0]
["6.6","Corrosion Control Chemical Feed Piping",null,null,null,null,null,null,null,null,null,null,null,null,null,null,null,null,null,null,null,null,null,null,null,null,null,null,null,null,null,null,0,0]
["6.6.1","CPVC",{"$f":"IF(chem_type=1,0,chem_pipe_length)","v":20},"lf",{"$f":"IF(chem_type=1,\"NA\",cc_pipe_diam)","v":0.5},{"$f":"IF(chem_type=1,\"\",\"in. diam\")","v":"in. diam"},{"$f":"IF(chem_type=1,\"NA\",IF(curve=1,cc_pipe_diam,VLOOKUP(cc_pipe_diam,cpvc_pipe_cost_cl,2)))","v":0.5},{"$f":"IF(chem_type=1,\"\",\"in. diam\")","v":"in. diam"},{"$f":"IF(chem_type=1,\"NA\",IF(curve=1,cpvc_pipe_eq_cc,VLOOKUP(cc_pipe_diam,cpvc_pipe_cost_cl,3)))","v":2.6270192353750002},52.540384707500003,{"$f":"IF(chem_type=1,\"NA\",VLOOKUP(cc_pipe_diam,cpvc_pipe_cost_cl,IF(ss_cat=\"large\",4,5)))","v":17},0,{"$f":"$B$123&\" - \"&$B$149&\" - \"&B150","v":"Piping - Corrosion Control Chemical Feed Piping - CPVC"},{"$f":"IF(retrofit=1,$W150*X150,IF(ISBLANK(X150),\"\",X150))","v":2},1,2,2,1,2,2,{"$f":"IF(retrofit=1,$W150*AE150,IF(ISBLANK(AE150),\"\",AE150))","v":1},2,0,{"$f":"IF(chem_type=1,0,2)","v":2},{"$f":"IF(chem_type=1,0,1)","v":1},{"$f":"IF(chem_type=1,0,2)","v":2},{"$f":"IF(chem_type=1,0,2)","v":2},{"$f":"IF(chem_type=1,0,1)","v":1},{"$f":"IF(chem_type=1,0,2)","v":2},{"$f":"IF(chem_type=1,0,2)","v":2},{"$f":"IF(chem_type=1,0,1)","v":1},{"$f":"IF(chem_type=1,0,2)","v":2},0,0]
["6.6.1","PVC",{"$f":"IF(chem_type=1,0,chem_pipe_length)","v":20},"lf",{"$f":"IF(chem_type=1,\"NA\",cc_pipe_diam)","v":0.5},{"$f":"IF(chem_type=1,\"\",\"in. diam\")","v":"in. diam"},{"$f":"IF(chem_type=1,\"NA\",IF(curve=1,cc_pipe_diam,VLOOKUP(cc_pipe_diam,pvc_pipe_cost_cl,2)))","v":0.5},{"$f":"IF(chem_type=1,\"\",\"in. diam\")","v":"in. diam"},{"$f":"IF(chem_type=1,\"NA\",IF(curve=1,pvc_pipe_eq_cc,VLOOKUP(cc_pipe_diam,pvc_pipe_cost_cl,3)))","v":1.0220772978749999},20.441545957499997,{"$f":"IF(chem_type=1,\"NA\",VLOOKUP(cc_pipe_diam,pvc_pipe_cost_cl,IF(ss_cat=\"large\",4,5)))","v":17},1,{"$f":"$B$123&\" - \"&$B$149&\" - \"&B151","v":"Piping - Corrosion Control Chemical Feed Piping - PVC"},1,2,3,1,2,3,1,2,3,0,{"$f":"IF(chem_type=1,0,1)","v":1},{"$f":"IF(chem_type=1,0,2)","v":2},{"$f":"IF(chem_type=1,0,3)","v":3},{"$f":"IF(chem_type=1,0,1)","v":1},{"$f":"IF(chem_type=1,0,2)","v":2},{"$f":"IF(chem_type=1,0,3)","v":3},{"$f":"IF(chem_type=1,0,1)","v":1},{"$f":"IF(chem_type=1,0,2)","v":2},{"$f":"IF(chem_type=1,0,3)","v":3},1,1.2024438798529411]
["6.6.1","Stainless Steel",{"$f":"IF(chem_type=1,0,chem_pipe_length)","v":20},"lf",{"$f":"IF(chem_type=1,\"NA\",cc_pipe_diam)","v":0.5},{"$f":"IF(chem_type=1,\"\",\"in. diam\")","v":"in. diam"},{"$f":"IF(chem_type=1,\"NA\",IF(curve=1,cc_pipe_diam,VLOOKUP(cc_pipe_diam,ss_pipe_cost_cl,2)))","v":0.5},{"$f":"IF(chem_type=1,\"\",\"in. diam\")","v":"in. diam"},{"$f":"IF(chem_type=1,\"NA\",IF(curve=1,ss_pipe_eq_cc,VLOOKUP(cc_pipe_diam,ss_pipe_cost_cl,3)))","v":17.554407703999999},351.08815407999998,{"$f":"IF(chem_type=1,\"NA\",VLOOKUP(cc_pipe_diam,ss_pipe_cost_cl,IF(ss_cat=\"large\",4,5)))","v":40},0,{"$f":"$B$123&\" - \"&$B$149&\" - \"&B152","v":"Piping - Corrosion Control Chemical Feed Piping - Stainless Steel"},3,3,1,3,3,1,3,3,1,0,{"$f":"IF(chem_type=1,0,3)","v":3},{"$f":"IF(chem_type=1,0,3)","v":3},{"$f":"IF(chem_type=1,0,1)","v":1},{"$f":"IF(chem_type=1,0,3)","v":3},{"$f":"IF(chem_type=1,0,3)","v":3},{"$f":"IF(chem_type=1,0,1)","v":1},{"$f":"IF(chem_type=1,0,3)","v":3},{"$f":"IF(chem_type=1,0,3)","v":3},{"$f":"IF(chem_type=1,0,1)","v":1},0,0]
["6.7","Bypass Piping",null,null,null,null,null,null,null,null,null,null,null,null,null,null,null,null,null,null,null,null,null,null,null,null,null,null,null,null,null,null,0,0]
["6.7.1","CPVC",{"$f":"bp_pipe_length","v":0},"lf",{"$f":"IF(bp_pct>0,bp_pipe_diam,\"NA\")","v":"NA"},{"$f":"IF(bp_pct=0,\" \",\"in. diam\")","v":" "},{"$f":"IF(bp_pct=0,\"NA\",IF(curve=1,bp_pipe_diam,VLOOKUP(bp_pipe_diam,cpvc_pipe_cost_cl,2)))","v":"NA"},{"$f":"IF(bp_pct=0,\" \",\"in. diam\")","v":" "},{"$f":"IF(bp_pct=0,\"NA\",IF(curve=1,cpvc_pipe_eq_bp,VLOOKUP(bp_pipe_diam,cpvc_pipe_cost_cl,3)))","v":"NA"},"--",{"$f":"IF(C154=0,\"NA\",VLOOKUP(E154,cpvc_pipe_cost_cl,IF(ss_cat=\"large\",4,5)))","v":"NA"},null,{"$f":"$B$123&\" - \"&$B$153&\" - \"&B154","v":"Piping - Bypass Piping - CPVC"},{"$f":"IF(retrofit=1,$W154*X154,IF(ISBLANK(X154),\"\",X154))","v":2},1,3,2,1,3,2,{"$f":"IF(retrofit=1,$W154*AE154,IF(ISBLANK(AE154),\"\",AE154))","v":1},3,0,2,1,3,2,1,3,2,1,3,0,0]
["6.7.1","PVC",{"$f":"bp_pipe_length","v":0},"lf",{"$f":"IF(bp_pct>0,bp_pipe_diam,\"NA\")","v":"NA"},{"$f":"IF(bp_pct=0,\" \",\"in. diam\")","v":" "},{"$f":"IF(bp_pct=0,\"NA\",IF(curve=1,bp_pipe_diam,VLOOKUP(bp_pipe_diam,pvc_pipe_cost_cl,2)))","v":"NA"},{"$f":"IF(bp_pct=0,\" \",\"in. diam\")","v":" "},{"$f":"IF(bp_pct=0,\"NA\",IF(curve=1,pvc_pipe_eq_bp,VLOOKUP(bp_pipe_diam,pvc_pipe_cost_cl,3)))","v":"NA"},"--",{"$f":"IF(C155=0,\"NA\",VLOOKUP(E155,pvc_pipe_cost_cl,IF(ss_cat=\"large\",4,5)))","v":"NA"},null,{"$f":"$B$123&\" - \"&$B$153&\" - \"&B155","v":"Piping - Bypass Piping - PVC"},1,2,4,1,2,4,1,2,4,0,1,2,4,1,2,4,1,2,4,0,0]
["6.7.1","Stainless Steel",{"$f":"bp_pipe_length","v":0},"lf",{"$f":"IF(bp_pct>0,bp_pipe_diam,\"NA\")","v":"NA"},{"$f":"IF(bp_pct=0,\" \",\"in. diam\")","v":" "},{"$f":"IF(bp_pct=0,\"NA\",IF(curve=1,bp_pipe_diam,VLOOKUP(bp_pipe_diam,ss_pipe_cost_cl,2)))","v":"NA"},{"$f":"IF(bp_pct=0,\" \",\"in. diam\")","v":" "},{"$f":"IF(bp_pct=0,\"NA\",IF(curve=1,ss_pipe_eq_bp,VLOOKUP(bp_pipe_diam,ss_pipe_cost_cl,3)))","v":"NA"},"--",{"$f":"IF(C156=0,\"NA\",VLOOKUP(E156,ss_pipe_cost_cl,IF(ss_cat=\"large\",4,5)))","v":"NA"},null,{"$f":"$B$123&\" - \"&$B$153&\" - \"&B156","v":"Piping - Bypass Piping - Stainless Steel"},4,4,1,4,4,1,4,4,1,0,4,4,1,4,4,1,4,4,1,0,0]
["6.7.1","Steel",{"$f":"bp_pipe_length","v":0},"lf",{"$f":"IF(bp_pct>0,bp_pipe_diam,\"NA\")","v":"NA"},{"$f":"IF(bp_pct=0,\" \",\"in. diam\")","v":" "},{"$f":"IF(bp_pct=0,\"NA\",IF(curve=1,bp_pipe_diam,VLOOKUP(bp_pipe_diam,st_pipe_cost_cl,2)))","v":"NA"},{"$f":"IF(bp_pct=0,\" \",\"in. diam\")","v":" "},{"$f":"IF(bp_pct=0,\"NA\",IF(curve=1,st_pipe_eq_bp,VLOOKUP(bp_pipe_diam,st_pipe_cost_cl,3)))","v":"NA"},"--",{"$f":"IF(C157=0,\"NA\",VLOOKUP(E157,st_pipe_cost_cl,IF(ss_cat=\"large\",4,5)))","v":"NA"},null,{"$f":"$B$123&\" - \"&$B$153&\" - \"&B157","v":"Piping - Bypass Piping - Steel"},3,3,2,3,3,2,3,3,2,0,3,3,2,3,3,2,3,3,2,0,0]
["7.","Valves",null,null,null,null,null,null,null,null,null,null,null,null,null,null,null,null,null,null,null,null,null,null,null,null,null,null,null,null,null,null,0,0]
["7.1","Motor/Air Operated (on/off)",null,null,null,null,null,null,null,null,null,null,null,null,null,null,null,null,null,null,null,null,null,null,null,null,null,null,null,null,null,null,{"$f":"IF(ISERROR(K159*L159),0,IF(K159<1,0,L159))","v":0},{"$f":"IF(AG159,J159/K159,0)","v":0}]
["7.1.1","Process - Polypropylene/PVC",{"$f":"tot_proc_MOVs","v":6},"units",{"$f":"IF(C160=0,\"NA\",tank_valve_size)","v":1.5},{"$f":"IF(C160=0,\"\",\"in. diam\")","v":"in. diam"},{"$f":"IF(C160=0,\"NA\",IF(curve=1,tank_valve_size,VLOOKUP(tank_valve_size,pp_mov_cost_cl,2)))","v":1.5},{"$f":"IF(C160=0,\"\",\"in. diam\")","v":"in. diam"},{"$f":"IF(C160=0,\"NA\",IF(curve=1,pp_mov_eq_in,VLOOKUP(tank_valve_size,pp_mov_cost_cl,3)))","v":745.56193466762488},{"$f":"IF(C160=0,\"--\",IF(I160=\"contact vendor\",\"--\",C160*I160))","v":4473.3716080057493},{"$f":"IF(C160=0,\"NA\",VLOOKUP(tank_valve_size,pp_mov_cost_cl,IF(ss_cat=\"large\",4,5)))","v":20},1,{"$f":"$B$159&\" \"&$B$158&\" - \"&B160","v":"Motor/Air Operated (on/off) Valves - Process - Polypropylene/PVC"},{"$f":"IF(retrofit=1,$W160*X160,IF(ISBLANK(X160),\"\",X160))","v":1},{"$f":"IF(retrofit=1,$W160*Y160,IF(ISBLANK(Y160),\"\",Y160))","v":2},{"$f":"IF(retrofit=1,$W160*Z160,IF(ISBLANK(Z160),\"\",Z160))","v":3},{"$f":"IF(retrofit=1,$W160*AA160,IF(ISBLANK(AA160),\"\",AA160))","v":1},{"$f":"IF(retrofit=1,$W160*AB160,IF(ISBLANK(AB160),\"\",AB160))","v":2},{"$f":"IF(retrofit=1,$W160*AC160,IF(ISBLANK(AC160),\"\",AC160))","v":3},{"$f":"IF(retrofit=1,$W160*AD160,IF(ISBLANK(AD160),\"\",AD160))","v":1},{"$f":"IF(retrofit=1,$W160*AE160,IF(ISBLANK(AE160),\"\",AE160))","v":2},{"$f":"IF(retrofit=1,$W160*AF160,IF(ISBLANK(AF160),\"\",AF160))","v":3},0,1,2,3,1,2,3,1,2,3,1,223.66858040028745]
["7.1.1","Process - Stainless Steel",{"$f":"tot_proc_MOVs","v":6},"units",{"$f":"IF(C161=0,\"NA\",tank_valve_size)","v":1.5},"in. diam",{"$f":"IF(C161=0,\"NA\",IF(curve=1,tank_valve_size,VLOOKUP(tank_valve_size,ss_mov_cost_cl,2)))","v":1.5},{"$f":"IF(C161=0,\"\",\"in. diam\")","v":"in. diam"},{"$f":"IF(C161=0,\"NA\",IF(curve=1,ss_mov_eq_in,VLOOKUP(tank_valve_size,ss_mov_cost_cl,3)))","v":832.02956450362501},4992.1773870217503,{"$f":"IF(C161=0,\"NA\",VLOOKUP(tank_valve_size,ss_mov_cost_cl,IF(ss_cat=\"large\",4,5)))","v":20},0,{"$f":"$B$159&\" \"&$B$158&\" - \"&B161","v":"Motor/Air Operated (on/off) Valves - Process - Stainless Steel"},3,3,1,3,3,1,3,3,1,0,3,3,1,3,3,1,3,3,1,0,0]
["7.1.1","Process - Cast Iron",{"$f":"tot_proc_MOVs","v":6},"units",{"$f":"IF(C162=0,\"NA\",tank_valve_size)","v":1.5},"in. diam",{"$f":"IF(C162=0,\"NA\",IF(curve=1,tank_valve_size,VLOOKUP(tank_valve_size,ci_mov_cost_cl,2)))","v":1.5},"in. diam",{"$f":"IF(C162=0,\"NA\",IF(curve=1,ci_mov_eq_in,VLOOKUP(tank_valve_size,ci_mov_cost_cl,3)))","v":"contact vendor"},"--",{"$f":"IF(C162=0,\"NA\",VLOOKUP(tank_valve_size,ci_mov_cost_cl,IF(ss_cat=\"large\",4,5)))","v":20},0,"Motor/Air Operated (on/off) Valves - Process - Cast Iron",2,1,2,2,1,2,2,1,2,0,2,1,2,2,1,2,2,1,2,0,0]
["7.1.2","Air - Polypropylene/PVC",{"$f":"tot_air_MOVs","v":2},"units",{"$f":"IF(C163=0,\"NA\",air_valve_size)","v":1.5},"in. diam",{"$f":"IF(C163=0,\"NA\",IF(curve=1,air_valve_size,VLOOKUP(air_valve_size,pp_mov_cost_cl,2)))","v":1.5},"in. diam",{"$f":"IF(C163=0,\"NA\",IF(curve=1,pp_mov_eq_air,VLOOKUP(air_valve_size,pp_mov_cost_cl,3)))","v":745.56193466762488},1491.1238693352498,{"$f":"IF(C163=0,\"NA\",VLOOKUP(air_valve_size,pp_mov_cost_cl,IF(ss_cat=\"large\",4,5)))","v":20},1,"Motor/Air Operated (on/off) Valves - Air - Polypropylene/PVC",1,2,3,1,2,3,1,2,3,0,1,2,3,1,2,3,1,2,3,1,74.556193466762494]
["7.1.2","Air - Stainless Steel",{"$f":"tot_air_MOVs","v":2},"units",{"$f":"IF(C164=0,\"NA\",air_valve_size)","v":1.5},"in. diam",{"$f":"IF(C164=0,\"NA\",IF(curve=1,air_valve_size,VLOOKUP(air_valve_size,ss_mov_cost_cl,2)))","v":1.5},"in. diam",{"$f":"IF(C164=0,\"NA\",IF(curve=1,ss_mov_eq_air,VLOOKUP(air_valve_size,ss_mov_cost_cl,3)))","v":832.02956450362501},1664.05912900725,{"$f":"IF(C164=0,\"NA\",VLOOKUP(air_valve_size,ss_mov_cost_cl,IF(ss_cat=\"large\",4,5)))","v":20},0,"Motor/Air Operated (on/off) Valves - Air - Stainless Steel",3,3,1,3,3,1,3,3,1,0,3,3,1,3,3,1,3,3,1,0,0]
["7.1.2","Air - Cast Iron",{"$f":"tot_air_MOVs","v":2},"units",{"$f":"IF(C165=0,\"NA\",air_valve_size)","v":1.5},"in. diam",{"$f":"IF(C165=0,\"NA\",IF(curve=1,air_valve_size,VLOOKUP(air_valve_size,ci_mov_cost_cl,2)))","v":1.5},"in. diam",{"$f":"IF(C165=0,\"NA\",IF(curve=1,ci_mov_eq_air,VLOOKUP(air_valve_size,ci_mov_cost_cl,3)))","v":"contact vendor"},"--",{"$f":"IF(C165=0,\"NA\",VLOOKUP(air_valve_size,ci_mov_cost_cl,IF(ss_cat=\"large\",4,5)))","v":20},0,"Motor/Air Operated (on/off) Valves - Air - Cast Iron",2,1,2,2,1,2,2,1,2,0,2,1,2,2,1,2,2,1,2,0,0]
["7.1.3","Acid - Polypropylene/PVC",{"$f":"tot_HCl_MOVs","v":0},"units",{"$f":"IF(C166=0,\"NA\",HCl_valve_size)","v":"NA"},"",{"$f":"IF(C166=0,\"NA\",IF(curve=1,HCl_valve_size,VLOOKUP(HCl_valve_size,pp_mov_cost_cl,2)))","v":"NA"},"",{"$f":"IF(C166=0,\"NA\",IF(curve=1,pp_mov_eq_hcl,VLOOKUP(HCl_valve_size,pp_mov_cost_cl,3)))","v":"NA"},"--",{"$f":"IF(C166=0,\"NA\",VLOOKUP(HCl_valve_size,pp_mov_cost_cl,IF(ss_cat=\"large\",4,5)))","v":"NA"},null,"Motor/Air Operated (on/off) Valves - Acid - Polypropylene/PVC",1,2,2,1,2,2,1,2,2,0,1,2,2,1,2,2,1,2,2,0,0]
["7.1.3","Acid - Stainless Steel",{"$f":"tot_HCl_MOVs","v":0},"units",{"$f":"IF(C167=0,\"NA\",HCl_valve_size)","v":"NA"},"",{"$f":"IF(C167=0,\"NA\",IF(curve=1,HCl_valve_size,VLOOKUP(HCl_valve_size,ss_mov_cost_cl,2)))","v":"NA"},"",{"$f":"IF(C167=0,\"NA\",IF(curve=1,ss_mov_eq_hcl,VLOOKUP(HCl_valve_size,ss_mov_cost_cl,3)))","v":"NA"},"--",{"$f":"IF(C167=0,\"NA\",VLOOKUP(HCl_valve_size,ss_mov_cost_cl,IF(ss_cat=\"large\",4,5)))","v":"NA"},null,"Motor/Air Operated (on/off) Valves - Acid - Stainless Steel",2,1,1,2,1,1,2,1,1,0,2,1,1,2,1,1,2,1,1,0,0]
["7.1.4","Sodium Hydroxide - Polypropylene/PVC",{"$f":"tot_NaOH_MOVs","v":0},"units",{"$f":"IF(C168=0,\"NA\",NaOH_valve_size)","v":"NA"},"",{"$f":"IF(C168=0,\"NA\",IF(curve=1,NaOH_valve_size,VLOOKUP(NaOH_valve_size,pp_mov_cost_cl,2)))","v":"NA"},"",{"$f":"IF(C168=0,\"NA\",IF(curve=1,pp_mov_eq_naoh,VLOOKUP(NaOH_valve_size,pp_mov_cost_cl,3)))","v":"NA"},"--",{"$f":"IF(C168=0,\"NA\",VLOOKUP(NaOH_valve_size,pp_mov_cost_cl,IF(ss_cat=\"large\",4,5)))","v":"NA"},null,"Motor/Air Operated (on/off) Valves - Sodium Hydroxide - Polypropylene/PVC",1,2,2,1,2,2,1,2,2,0,1,2,2,1,2,2,1,2,2,0,0]
["7.1.4","Sodium Hydroxide - Stainless Steel",{"$f":"tot_NaOH_MOVs","v":0},"units",{"$f":"IF(C169=0,\"NA\",NaOH_valve_size)","v":"NA"},"",{"$f":"IF(C169=0,\"NA\",IF(curve=1,NaOH_valve_size,VLOOKUP(NaOH_valve_size,ss_mov_cost_cl,2)))","v":"NA"},"",{"$f":"IF(C169=0,\"NA\",IF(curve=1,ss_mov_eq_naoh,VLOOKUP(NaOH_valve_size,ss_mov_cost_cl,3)))","v":"NA"},"--",{"$f":"IF(C169=0,\"NA\",VLOOKUP(NaOH_valve_size,ss_mov_cost_cl,IF(ss_cat=\"large\",4,5)))","v":"NA"},null,"Motor/Air Operated (on/off) Valves - Sodium Hydroxide - Stainless Steel",2,1,1,2,1,1,2,1,1,0,2,1,1,2,1,1,2,1,1,0,0]
["7.1.5","Corrosion Control Chemical - Polypropylene/PVC",{"$f":"IF(chem_type=1,0,tot_chem_MOVs)","v":4},"units",{"$f":"IF(C170=0,\"NA\",IF(chem_type=1,\"NA\",cc_valve_size))","v":0.5},"in. diam",{"$f":"IF(C170=0,\"NA\",IF(chem_type=1,\"NA\",IF(curve=1,cc_valve_size,VLOOKUP(cc_valve_size,pp_mov_cost_cl,2))))","v":0.5},"in. diam",{"$f":"IF(C170=0,\"NA\",IF(chem_type=1,\"NA\",IF(curve=1,pp_mov_eq_cc,VLOOKUP(cc_valve_size,pp_mov_cost_cl,3))))","v":489.82761753387501},1959.3104701355001,{"$f":"IF(C170=0,\"NA\",IF(chem_type=1,\"NA\",VLOOKUP(cc_valve_size,pp_mov_cost_cl,IF(ss_cat=\"large\",4,5))))","v":20},1,"Motor/Air Operated (on/off) Valves - Corrosion Control Chemical - Polypropylene/PVC",1,2,2,1,2,2,1,2,2,0,{"$f":"IF(chem_type=1,0,1)","v":1},{"$f":"IF(chem_type=1,0,2)","v":2},{"$f":"IF(chem_type=1,0,2)","v":2},{"$f":"IF(chem_type=1,0,1)","v":1},{"$f":"IF(chem_type=1,0,2)","v":2},{"$f":"IF(chem_type=1,0,2)","v":2},{"$f":"IF(chem_type=1,0,1)","v":1},{"$f":"IF(chem_type=1,0,2)","v":2},{"$f":"IF(chem_type=1,0,2)","v":2},1,97.965523506775]
["7.1.5","Corrosion Control Chemical - Stainless Steel",{"$f":"IF(chem_type=1,0,tot_chem_MOVs)","v":4},"units",{"$f":"IF(C171=0,\"NA\",IF(chem_type=1,\"NA\",cc_valve_size))","v":0.5},"in. diam",{"$f":"IF(C171=0,\"NA\",IF(chem_type=1,\"NA\",IF(curve=1,cc_valve_size,VLOOKUP(cc_valve_size,ss_mov_cost_cl,2))))","v":0.5},"in. diam",{"$f":"IF(C171=0,\"NA\",IF(chem_type=1,\"NA\",IF(curve=1,ss_mov_eq_cc,VLOOKUP(cc_valve_size,ss_mov_cost_cl,3))))","v":"contact vendor"},"--",{"$f":"IF(C171=0,\"NA\",IF(chem_type=1,\"NA\",VLOOKUP(cc_valve_size,ss_mov_cost_cl,IF(ss_cat=\"large\",4,5))))","v":20},0,{"$f":"$B$159&\" \"&$B$158&\" - \"&B171","v":"Motor/Air Operated (on/off) Valves - Corrosion Control Chemical - Stainless Steel"},2,1,1,2,1,1,2,1,1,0,{"$f":"IF(chem_type=1,0,2)","v":2},{"$f":"IF(chem_type=1,0,1)","v":1},{"$f":"IF(chem_type=1,0,1)","v":1},{"$f":"IF(chem_type=1,0,2)","v":2},{"$f":"IF(chem_type=1,0,1)","v":1},{"$f":"IF(chem_type=1,0,1)","v":1},{"$f":"IF(chem_type=1,0,2)","v":2},{"$f":"IF(chem_type=1,0,1)","v":1},{"$f":"IF(chem_type=1,0,1)","v":1},0,0]
["7.1.6","Bypass - Polypropylene/PVC",{"$f":"IF(bp_pct>0,tot_bp_MOVs,0)","v":0},"units",{"$f":"IF(C172=0,\"NA\",IF(bp_pct=0,\"NA\",bypass_valve_size))","v":"NA"},"",{"$f":"IF(C172=0,\"NA\",IF(bp_pct=0,\"NA\",(IF(curve=1,bypass_valve_size,VLOOKUP(bypass_valve_size,pp_mov_cost_cl,2)))))","v":"NA"},"",{"$f":"IF(C172=0,\"NA\",IF(bp_pct=0,\"NA\",(IF(curve=1,pp_mov_eq_bp,VLOOKUP(bypass_valve_size,pp_mov_cost_cl,3)))))","v":"NA"},"--",{"$f":"IF(C172=0,\"NA\",IF(bp_pct=0,\"NA\",VLOOKUP(bypass_valve_size,pp_mov_cost_cl,IF(ss_cat=\"large\",4,5))))","v":"NA"},null,{"$f":"$B$159&\" \"&$B$158&\" - \"&B172","v":"Motor/Air Operated (on/off) Valves - Bypass - Polypropylene/PVC"},1,2,3,1,2,3,1,2,3,0,1,2,3,1,2,3,1,2,3,0,0]
["7.1.6","Bypass - Stainless Steel",{"$f":"IF(bp_pct>0,tot_bp_MOVs,0)","v":0},"units",{"$f":"IF(C173=0,\"NA\",IF(bp_pct=0,\"NA\",bypass_valve_size))","v":"NA"},"",{"$f":"IF(C173=0,\"NA\",IF(bp_pct=0,\"NA\",(IF(curve=1,bypass_valve_size,VLOOKUP(bypass_valve_size,ss_mov_cost_cl,2)))))","v":"NA"},"",{"$f":"IF(C173=0,\"NA\",IF(bp_pct=0,\"NA\",(IF(curve=1,ss_mov_eq_bp,VLOOKUP(bypass_valve_size,ss_mov_cost_cl,3)))))","v":"NA"},"--",{"$f":"IF(C173=0,\"NA\",IF(bp_pct=0,\"NA\",VLOOKUP(bypass_valve_size,ss_mov_cost_cl,IF(ss_cat=\"large\",4,5))))","v":"NA"},null,{"$f":"$B$159&\" \"&$B$158&\" - \"&B173","v":"Motor/Air Operated (on/off) Valves - Bypass - Stainless Steel"},3,3,1,3,3,1,3,3,1,0,3,3,1,3,3,1,3,3,1,0,0]
["7.1.6","Bypass - Cast Iron",{"$f":"IF(bp_pct>0,tot_bp_MOVs,0)","v":0},"units",{"$f":"IF(C174=0,\"NA\",IF(bp_pct=0,\"NA\",bypass_valve_size))","v":"NA"},"",{"$f":"IF(C174=0,\"NA\",IF(bp_pct=0,\"NA\",(IF(curve=1,bypass_valve_size,VLOOKUP(bypass_valve_size,ci_mov_cost_cl,2)))))","v":"NA"},"",{"$f":"IF(C174=0,\"NA\",IF(bp_pct=0,\"NA\",(IF(curve=1,ci_mov_eq_bp,VLOOKUP(bypass_valve_size,ci_mov_cost_cl,3)))))","v":"NA"},"--",{"$f":"IF(C174=0,\"NA\",IF(bp_pct=0,\"NA\",VLOOKUP(bypass_valve_size,ci_mov_cost_cl,IF(ss_cat=\"large\",4,5))))","v":"NA"},null,{"$f":"$B$159&\" \"&$B$158&\" - \"&B174","v":"Motor/Air Operated (on/off) Valves - Bypass - Cast Iron"},2,1,2,2,1,2,2,1,2,0,2,1,2,2,1,2,2,1,2,0,0]
["7.2","Manual",null,null,null,null,null,null,null,null,null,null,null,null,null,null,null,null,null,null,null,null,null,null,null,null,null,null,null,null,null,null,0,0]
["7.2.1","Inlet and outlet - Polypropylene/PVC",{"$f":"tot_man_valves","v":2},"units",{"$f":"IF(C176=0,\"NA\",in_valve_size)","v":1.5},{"$f":"IF(C176=0,\"\",\"in. diam\")","v":"in. diam"},{"$f":"IF(C176=0,\"NA\",IF(curve=1,in_valve_size,VLOOKUP(in_valve_size,pp_man_cost_cl,2)))","v":1.5},{"$f":"IF(C176=0,\"\",\"in. diam\")","v":"in. diam"},{"$f":"IF(C176=0,\"NA\",IF(curve=1,pp_man_eq,VLOOKUP(in_valve_size,pp_man_cost_cl,3)))","v":189.57344279487501},379.14688558975001,{"$f":"IF(C176=0,\"NA\",VLOOKUP(in_valve_size,pp_man_cost_cl,IF(ss_cat=\"large\",4,5)))","v":20},1,{"$f":"$B$175&\" \"&$B$158&\" - \"&B176","v":"Manual Valves - Inlet and outlet - Polypropylene/PVC"},{"$f":"IF(retrofit=1,$W176*X176,IF(ISBLANK(X176),\"\",X176))","v":1},{"$f":"IF(retrofit=1,$W176*Y176,IF(ISBLANK(Y176),\"\",Y176))","v":2},{"$f":"IF(retrofit=1,$W176*Z176,IF(ISBLANK(Z176),\"\",Z176))","v":3},{"$f":"IF(retrofit=1,$W176*AA176,IF(ISBLANK(AA176),\"\",AA176))","v":1},{"$f":"IF(retrofit=1,$W176*AB176,IF(ISBLANK(AB176),\"\",AB176))","v":2},{"$f":"IF(retrofit=1,$W176*AC176,IF(ISBLANK(AC176),\"\",AC176))","v":3},{"$f":"IF(retrofit=1,$W176*AD176,IF(ISBLANK(AD176),\"\",AD176))","v":1},{"$f":"IF(retrofit=1,$W176*AE176,IF(ISBLANK(AE176),\"\",AE176))","v":2},{"$f":"IF(retrofit=1,$W176*AF176,IF(ISBLANK(AF176),\"\",AF176))","v":3},0,1,2,3,1,2,3,1,2,3,1,18.957344279487501]
["7.2.1","Inlet and outlet - Stainless Steel",{"$f":"tot_man_valves","v":2},"units",{"$f":"IF(C177=0,\"NA\",in_valve_size)","v":1.5},"in. diam",{"$f":"IF(C177=0,\"NA\",IF(curve=1,in_valve_size,VLOOKUP(in_valve_size,ss_man_cost_cl,2)))","v":1.5},"in. diam",{"$f":"IF(C177=0,\"NA\",IF(curve=1,ss_man_eq,VLOOKUP(in_valve_size,ss_man_cost_cl,3)))","v":686.27523337599996},1372.5504667519999,{"$f":"IF(C177=0,\"NA\",VLOOKUP(in_valve_size,ss_man_cost_cl,IF(ss_cat=\"large\",4,5)))","v":20},0,{"$f":"$B$175&\" \"&$B$158&\" - \"&B177","v":"Manual Valves - Inlet and outlet - Stainless Steel"},3,3,1,3,3,1,3,3,1,0,3,3,1,3,3,1,3,3,1,0,0]
["7.2.1","Inlet and outlet - Cast Iron",{"$f":"tot_man_valves","v":2},"units",{"$f":"IF(C178=0,\"NA\",in_valve_size)","v":1.5},"in. diam",{"$f":"IF(C178=0,\"NA\",IF(curve=1,in_valve_size,VLOOKUP(in_valve_size,ci_bfv_cost_cl,2)))","v":1.5},"in. diam",{"$f":"IF(C178=0,\"NA\",IF(curve=1,ci_bfv_eq,VLOOKUP(in_valve_size,ci_bfv_cost_cl,3)))","v":"contact vendor"},"--",{"$f":"IF(C178=0,\"NA\",VLOOKUP(in_valve_size,ci_bfv_cost_cl,IF(ss_cat=\"large\",4,5)))","v":20},0,{"$f":"$B$175&\" \"&$B$158&\" - \"&B178","v":"Manual Valves - Inlet and outlet - Cast Iron"},2,1,2,2,1,2,2,1,2,0,2,1,2,2,1,2,2,1,2,0,0]
["7.2.2","Process - Polypropylene/PVC",{"$f":"tot_proc_man","v":0},"units",{"$f":"IF(C179=0,\"NA\",tank_valve_size)","v":"NA"},"",{"$f":"IF(C179=0,\"NA\",IF(curve=1,tank_valve_size,VLOOKUP(tank_valve_size,pp_man_cost_cl,2)))","v":"NA"},"",{"$f":"IF(C179=0,\"NA\",IF(curve=1,pp_man_eq_in,VLOOKUP(tank_valve_size,pp_man_cost_cl,3)))","v":"NA"},"--",{"$f":"IF(C179=0,\"NA\",VLOOKUP(tank_valve_size,pp_man_cost_cl,IF(ss_cat=\"large\",4,5)))","v":"NA"},null,{"$f":"$B$175&\" \"&$B$158&\" - \"&B179","v":"Manual Valves - Process - Polypropylene/PVC"},1,2,3,1,2,3,1,2,3,0,1,2,3,1,2,3,1,2,3,0,0]
["7.2.2","Process - Stainless Steel",{"$f":"tot_proc_man","v":0},"units",{"$f":"IF(C180=0,\"NA\",tank_valve_size)","v":"NA"},"",{"$f":"IF(C180=0,\"NA\",IF(curve=1,tank_valve_size,VLOOKUP(tank_valve_size,ss_man_cost_cl,2)))","v":"NA"},"",{"$f":"IF(C180=0,\"NA\",IF(curve=1,ss_man_eq_in,VLOOKUP(tank_valve_size,ss_man_cost_cl,3)))","v":"NA"},"--",{"$f":"IF(C180=0,\"NA\",VLOOKUP(tank_valve_size,ss_man_cost_cl,IF(ss_cat=\"large\",4,5)))","v":"NA"},null,"Manual Valves - Process - Stainless Steel",3,3,1,3,3,1,3,3,1,0,3,3,1,3,3,1,3,3,1,0,0]
["7.2.2","Process - Cast Iron",{"$f":"tot_proc_man","v":0},"units",{"$f":"IF(C181=0,\"NA\",tank_valve_size)","v":"NA"},"",{"$f":"IF(C181=0,\"NA\",IF(curve=1,tank_valve_size,VLOOKUP(tank_valve_size,ci_bfv_cost_cl,2)))","v":"NA"},"",{"$f":"IF(C181=0,\"NA\",IF(curve=1,ci_man_eq_in,VLOOKUP(tank_valve_size,ci_bfv_cost_cl,3)))","v":"NA"},"--",{"$f":"IF(C181=0,\"NA\",VLOOKUP(tank_valve_size,ci_bfv_cost_cl,IF(ss_cat=\"large\",4,5)))","v":"NA"},null,"Manual Valves - Process - Cast Iron",2,1,2,2,1,2,2,1,2,0,2,1,2,2,1,2,2,1,2,0,0]
["7.2.3","Air - Polypropylene/PVC",{"$f":"tot_air_man","v":0},"units",{"$f":"IF(C182=0,\"NA\",air_valve_size)","v":"NA"},"",{"$f":"IF(C182=0,\"NA\",IF(curve=1,air_valve_size,VLOOKUP(air_valve_size,pp_man_cost_cl,2)))","v":"NA"},"",{"$f":"IF(C182=0,\"NA\",IF(curve=1,pp_man_eq_air,VLOOKUP(air_valve_size,pp_man_cost_cl,3)))","v":"NA"},"--",{"$f":"IF(C182=0,\"NA\",VLOOKUP(air_valve_size,pp_man_cost_cl,IF(ss_cat=\"large\",4,5)))","v":"NA"},null,"Manual Valves - Air - Polypropylene/PVC",1,2,3,1,2,3,1,2,3,0,1,2,3,1,2,3,1,2,3,0,0]
["7.2.3","Air - Stainless Steel",{"$f":"tot_air_man","v":0},"units",{"$f":"IF(C183=0,\"NA\",air_valve_size)","v":"NA"},"",{"$f":"IF(C183=0,\"NA\",IF(curve=1,air_valve_size,VLOOKUP(air_valve_size,ss_man_cost_cl,2)))","v":"NA"},"",{"$f":"IF(C183=0,\"NA\",IF(curve=1,ss_man_eq_air,VLOOKUP(air_valve_size,ss_man_cost_cl,3)))","v":"NA"},"--",{"$f":"IF(C183=0,\"NA\",VLOOKUP(air_valve_size,ss_man_cost_cl,IF(ss_cat=\"large\",4,5)))","v":"NA"},null,"Manual Valves - Air - Stainless Steel",3,3,1,3,3,1,3,3,1,0,3,3,1,3,3,1,3,3,1,0,0]
["7.2.3","Air - Cast Iron",{"$f":"tot_air_man","v":0},"units",{"$f":"IF(C184=0,\"NA\",air_valve_size)","v":"NA"},"",{"$f":"IF(C184=0,\"NA\",IF(curve=1,air_valve_size,VLOOKUP(air_valve_size,ci_bfv_cost_cl,2)))","v":"NA"},"",{"$f":"IF(C184=0,\"NA\",IF(curve=1,ci_man_eq_air,VLOOKUP(air_valve_size,ci_bfv_cost_cl,3)))","v":"NA"},"--",{"$f":"IF(C184=0,\"NA\",VLOOKUP(air_valve_size,ci_bfv_cost_cl,IF(ss_cat=\"large\",4,5)))","v":"NA"},null,"Manual Valves - Air - Cast Iron",2,1,2,2,1,2,2,1,2,0,2,1,2,2,1,2,2,1,2,0,0]
["7.2.4","Acid - Polypropylene/PVC",{"$f":"tot_HCl_man","v":0},"units",{"$f":"IF(C185=0,\"NA\",HCl_valve_size)","v":"NA"},"",{"$f":"IF(C185=0,\"NA\",IF(curve=1,HCl_valve_size,VLOOKUP(HCl_valve_size,pp_man_cost_cl,2)))","v":"NA"},"",{"$f":"IF(C185=0,\"NA\",IF(curve=1,pp_man_eq_hcl,VLOOKUP(HCl_valve_size,pp_man_cost_cl,3)))","v":"NA"},"--",{"$f":"IF(C185=0,\"NA\",VLOOKUP(HCl_valve_size,pp_man_cost_cl,IF(ss_cat=\"large\",4,5)))","v":"NA"},null,"Manual Valves - Acid - Polypropylene/PVC",1,2,2,1,2,2,1,2,2,0,1,2,2,1,2,2,1,2,2,0,0]
["7.2.4","Acid - Stainless Steel",{"$f":"tot_HCl_man","v":0},"units",{"$f":"IF(C186=0,\"NA\",HCl_valve_size)","v":"NA"},"",{"$f":"IF(C186=0,\"NA\",IF(curve=1,HCl_valve_size,VLOOKUP(HCl_valve_size,ss_man_cost_cl,2)))","v":"NA"},"",{"$f":"IF(C186=0,\"NA\",IF(curve=1,ss_man_eq_hcl,VLOOKUP(HCl_valve_size,ss_man_cost_cl,3)))","v":"NA"},"--",{"$f":"IF(C186=0,\"NA\",VLOOKUP(HCl_valve_size,ss_man_cost_cl,IF(ss_cat=\"large\",4,5)))","v":"NA"},null,"Manual Valves - Acid - Stainless Steel",2,1,1,2,1,1,2,1,1,0,2,1,1,2,1,1,2,1,1,0,0]
["7.2.5","Sodium Hydroxide - Polypropylene/PVC",{"$f":"tot_NaOH_man","v":0},"units",{"$f":"IF(C187=0,\"NA\",NaOH_valve_size)","v":"NA"},"",{"$f":"IF(C187=0,\"NA\",IF(curve=1,NaOH_valve_size,VLOOKUP(NaOH_valve_size,pp_man_cost_cl,2)))","v":"NA"},"",{"$f":"IF(C187=0,\"NA\",IF(curve=1,pp_man_eq_naoh,VLOOKUP(NaOH_valve_size,pp_man_cost_cl,3)))","v":"NA"},"--",{"$f":"IF(C187=0,\"NA\",VLOOKUP(NaOH_valve_size,pp_man_cost_cl,IF(ss_cat=\"large\",4,5)))","v":"NA"},null,"Manual Valves - Sodium Hydroxide - Polypropylene/PVC",1,2,2,1,2,2,1,2,2,0,1,2,2,1,2,2,1,2,2,0,0]
["7.2.5","Sodium Hydroxide - Stainless Steel",{"$f":"tot_NaOH_man","v":0},"units",{"$f":"IF(C188=0,\"NA\",NaOH_valve_size)","v":"NA"},"",{"$f":"IF(C188=0,\"NA\",IF(curve=1,NaOH_valve_size,VLOOKUP(NaOH_valve_size,ss_man_cost_cl,2)))","v":"NA"},"",{"$f":"IF(C188=0,\"NA\",IF(curve=1,ss_man_eq_naoh,VLOOKUP(NaOH_valve_size,ss_man_cost_cl,3)))","v":"NA"},"--",{"$f":"IF(C188=0,\"NA\",VLOOKUP(NaOH_valve_size,ss_man_cost_cl,IF(ss_cat=\"large\",4,5)))","v":"NA"},null,"Manual Valves - Sodium Hydroxide - Stainless Steel",2,1,1,2,1,1,2,1,1,0,2,1,1,2,1,1,2,1,1,0,0]
["7.2.6","Corrosion Control Chemical - Polypropylene/PVC",{"$f":"IF(chem_type=1,0,tot_chem_man)","v":0},"units",{"$f":"IF(C189=0,\"NA\",IF(chem_type=1,\"NA\",cc_valve_size))","v":"NA"},"",{"$f":"IF(C189=0,\"NA\",IF(chem_type=1,\"NA\",IF(curve=1,cc_valve_size,VLOOKUP(cc_valve_size,pp_man_cost_cl,2))))","v":"NA"},"",{"$f":"IF(C189=0,\"NA\",IF(chem_type=1,\"NA\",IF(curve=1,pp_man_eq_cc,VLOOKUP(cc_valve_size,pp_man_cost_cl,3))))","v":"NA"},"--",{"$f":"IF(C189=0,\"NA\",IF(chem_type=1,\"NA\",VLOOKUP(cc_valve_size,pp_man_cost_cl,IF(ss_cat=\"large\",4,5))))","v":"NA"},null,"Manual Valves - Corrosion Control Chemical - Polypropylene/PVC",1,2,2,1,2,2,1,2,2,0,{"$f":"IF(chem_type=1,0,1)","v":1},{"$f":"IF(chem_type=1,0,2)","v":2},{"$f":"IF(chem_type=1,0,2)","v":2},{"$f":"IF(chem_type=1,0,1)","v":1},{"$f":"IF(chem_type=1,0,2)","v":2},{"$f":"IF(chem_type=1,0,2)","v":2},{"$f":"IF(chem_type=1,0,1)","v":1},{"$f":"IF(chem_type=1,0,2)","v":2},{"$f":"IF(chem_type=1,0,2)","v":2},0,0]
["7.2.6","Corrosion Control Chemical - Stainless Steel",{"$f":"IF(chem_type=1,0,tot_chem_man)","v":0},"units",{"$f":"IF(C190=0,\"NA\",IF(chem_type=1,\"NA\",cc_valve_size))","v":"NA"},"",{"$f":"IF(C190=0,\"NA\",IF(chem_type=1,\"NA\",IF(curve=1,cc_valve_size,VLOOKUP(cc_valve_size,ss_man_cost_cl,2))))","v":"NA"},"",{"$f":"IF(C190=0,\"NA\",IF(chem_type=1,\"NA\",IF(curve=1,ss_man_eq_cc,VLOOKUP(cc_valve_size,ss_man_cost_cl,3))))","v":"NA"},"--",{"$f":"IF(C190=0,\"NA\",IF(chem_type=1,\"NA\",VLOOKUP(cc_valve_size,ss_man_cost_cl,IF(ss_cat=\"large\",4,5))))","v":"NA"},null,"Manual Valves - Corrosion Control Chemical - Stainless Steel",2,1,1,2,1,1,2,1,1,0,{"$f":"IF(chem_type=1,0,2)","v":2},{"$f":"IF(chem_type=1,0,1)","v":1},{"$f":"IF(chem_type=1,0,1)","v":1},{"$f":"IF(chem_type=1,0,2)","v":2},{"$f":"IF(chem_type=1,0,1)","v":1},{"$f":"IF(chem_type=1,0,1)","v":1},{"$f":"IF(chem_type=1,0,2)","v":2},{"$f":"IF(chem_type=1,0,1)","v":1},{"$f":"IF(chem_type=1,0,1)","v":1},0,0]
["7.2.7","Bypass - Polypropylene/PVC",{"$f":"IF(bp_pct>0,tot_bp_man,0)","v":0},"units",{"$f":"IF(C191=0,\"NA\",IF(bp_pct=0,\"NA\",bypass_valve_size))","v":"NA"},"",{"$f":"IF(C191=0,\"NA\",IF(bp_pct=0,\"NA\",(IF(curve=1,bypass_valve_size,VLOOKUP(bypass_valve_size,pp_man_cost_cl,2)))))","v":"NA"},"",{"$f":"IF(C191=0,\"NA\",IF(bp_pct=0,\"NA\",(IF(curve=1,pp_man_eq_bp,VLOOKUP(bypass_valve_size,pp_man_cost_cl,3)))))","v":"NA"},"--",{"$f":"IF(C191=0,\"NA\",IF(bp_pct=0,\"NA\",VLOOKUP(bypass_valve_size,pp_man_cost_cl,IF(ss_cat=\"large\",4,5))))","v":"NA"},null,"Manual Valves - Bypass - Polypropylene/PVC",1,2,3,1,2,3,1,2,3,0,1,2,3,1,2,3,1,2,3,{"$f":"IF(ISERROR(K191*L191),0,IF(K191<1,0,L191))","v":0},{"$f":"IF(AG191,J191/K191,0)","v":0}]
["7.2.7","Bypass - Stainless Steel",{"$f":"IF(bp_pct>0,tot_bp_man,0)","v":0},"units",{"$f":"IF(C192=0,\"NA\",IF(bp_pct=0,\"NA\",bypass_valve_size))","v":"NA"},"",{"$f":"IF(C192=0,\"NA\",IF(bp_pct=0,\"NA\",(IF(curve=1,bypass_valve_size,VLOOKUP(bypass_valve_size,ss_man_cost_cl,2)))))","v":"NA"},"",{"$f":"IF(C192=0,\"NA\",IF(bp_pct=0,\"NA\",(IF(curve=1,ss_man_eq_bp,VLOOKUP(bypass_valve_size,ss_man_cost_cl,3)))))","v":"NA"},"--",{"$f":"IF(C192=0,\"NA\",IF(bp_pct=0,\"NA\",VLOOKUP(bypass_valve_size,ss_man_cost_cl,IF(ss_cat=\"large\",4,5))))","v":"NA"},null,"Manual Valves - Bypass - Stainless Steel",3,3,1,3,3,1,3,3,1,0,3,3,1,3,3,1,3,3,1,0,0]
["7.2.7","Bypass - Cast Iron",{"$f":"IF(bp_pct>0,tot_bp_man,0)","v":0},"units",{"$f":"IF(C193=0,\"NA\",IF(bp_pct=0,\"NA\",bypass_valve_size))","v":"NA"},"",{"$f":"IF(C193=0,\"NA\",IF(bp_pct=0,\"NA\",(IF(curve=1,bypass_valve_size,VLOOKUP(bypass_valve_size,ci_bfv_cost_cl,2)))))","v":"NA"},"",{"$f":"IF(C193=0,\"NA\",IF(bp_pct=0,\"NA\",(IF(curve=1,ci_bfv_eq_bp,VLOOKUP(bypass_valve_size,ci_bfv_cost_cl,3)))))","v":"NA"},"--",{"$f":"IF(C193=0,\"NA\",IF(bp_pct=0,\"NA\",VLOOKUP(bypass_valve_size,ci_bfv_cost_cl,IF(ss_cat=\"large\",4,5))))","v":"NA"},null,"Manual Valves - Bypass - Cast Iron",2,1,2,2,1,2,2,1,2,0,2,1,2,2,1,2,2,1,2,0,0]
[7.3,"Check Valves",null,null,null,null,null,null,null,null,null,null,null,null,null,null,null,null,null,null,null,null,null,null,null,null,null,null,null,null,null,null,0,0]
["7.3.1","Acid - Polypropylene/PVC",{"$f":"tot_HCl_chv","v":0},"units",{"$f":"IF(C195=0,\"NA\",HCl_valve_size)","v":"NA"},{"$f":"IF(C195=0,\"\",\"in. diam\")","v":""},{"$f":"IF(C195=0,\"NA\",IF(curve=1,HCl_valve_size,VLOOKUP(HCl_valve_size,pp_chv_cost_cl,2)))","v":"NA"},{"$f":"IF(C195=0,\"\",\"in. diam\")","v":""},{"$f":"IF(C195=0,\"NA\",IF(curve=1,pp_chv_eq_hcl,VLOOKUP(HCl_valve_size,pp_chv_cost_cl,3)))","v":"NA"},"--",{"$f":"IF(C194=0,\"NA\",VLOOKUP(HCl_valve_size,pp_chv_cost_cl,IF(ss_cat=\"large\",4,5)))","v":"NA"},null,{"$f":"$B$194&\" - \"&B195","v":"Check Valves - Acid - Polypropylene/PVC"},{"$f":"IF(retrofit=1,$W195*X195,IF(ISBLANK(X195),\"\",X195))","v":1},{"$f":"IF(retrofit=1,$W195*Y195,IF(ISBLANK(Y195),\"\",Y195))","v":2},{"$f":"IF(retrofit=1,$W195*Z195,IF(ISBLANK(Z195),\"\",Z195))","v":2},{"$f":"IF(retrofit=1,$W195*AA195,IF(ISBLANK(AA195),\"\",AA195))","v":1},{"$f":"IF(retrofit=1,$W195*AB195,IF(ISBLANK(AB195),\"\",AB195))","v":2},{"$f":"IF(retrofit=1,$W195*AC195,IF(ISBLANK(AC195),\"\",AC195))","v":2},{"$f":"IF(retrofit=1,$W195*AD195,IF(ISBLANK(AD195),\"\",AD195))","v":1},{"$f":"IF(retrofit=1,$W195*AE195,IF(ISBLANK(AE195),\"\",AE195))","v":2},{"$f":"IF(retrofit=1,$W195*AF195,IF(ISBLANK(AF195),\"\",AF195))","v":2},0,1,2,2,1,2,2,1,2,2,0,0]
["7.3.1","Acid - Stainless Steel",{"$f":"tot_HCl_chv","v":0},"units",{"$f":"IF(C196=0,\"NA\",HCl_valve_size)","v":"NA"},"",{"$f":"IF(C196=0,\"NA\",IF(curve=1,HCl_valve_size,VLOOKUP(HCl_valve_size,ss_chv_cost_cl,2)))","v":"NA"},"",{"$f":"IF(C196=0,\"NA\",IF(curve=1,ss_chv_eq_hcl,VLOOKUP(HCl_valve_size,ss_chv_cost_cl,3)))","v":"NA"},"--",{"$f":"IF(C195=0,\"NA\",VLOOKUP(HCl_valve_size,ss_chv_cost_cl,IF(ss_cat=\"large\",4,5)))","v":"NA"},null,"Check Valves - Acid - Stainless Steel",2,1,1,2,1,1,2,1,1,0,2,1,1,2,1,1,2,1,1,0,0]
["7.3.2","Sodium Hydroxide - Polypropylene/PVC",{"$f":"tot_NaOH_chv","v":0},"units",{"$f":"IF(C197=0,\"NA\",NaOH_valve_size)","v":"NA"},"",{"$f":"IF(C197=0,\"NA\",IF(curve=1,NaOH_valve_size,VLOOKUP(NaOH_valve_size,pp_chv_cost_cl,2)))","v":"NA"},"",{"$f":"IF(C197=0,\"NA\",IF(curve=1,pp_chv_eq_naoh,VLOOKUP(NaOH_valve_size,pp_chv_cost_cl,3)))","v":"NA"},"--",{"$f":"IF(C196=0,\"NA\",VLOOKUP(NaOH_valve_size,pp_chv_cost_cl,IF(ss_cat=\"large\",4,5)))","v":"NA"},null,"Check Valves - Sodium Hydroxide - Polypropylene/PVC",1,2,2,1,2,2,1,2,2,0,1,2,2,1,2,2,1,2,2,0,0]
["7.3.2","Sodium Hydroxide - Stainless Steel",{"$f":"tot_NaOH_chv","v":0},"units",{"$f":"IF(C198=0,\"NA\",NaOH_valve_size)","v":"NA"},"",{"$f":"IF(C198=0,\"NA\",IF(curve=1,NaOH_valve_size,VLOOKUP(NaOH_valve_size,ss_chv_cost_cl,2)))","v":"NA"},"",{"$f":"IF(C198=0,\"NA\",IF(curve=1,ss_chv_eq_naoh,VLOOKUP(NaOH_valve_size,ss_chv_cost_cl,3)))","v":"NA"},"--",{"$f":"IF(C197=0,\"NA\",VLOOKUP(NaOH_valve_size,ss_chv_cost_cl,IF(ss_cat=\"large\",4,5)))","v":"NA"},null,"Check Valves - Sodium Hydroxide - Stainless Steel",2,1,1,2,1,1,2,1,1,0,2,1,1,2,1,1,2,1,1,0,0]
["7.3.3","Corrosion Control Chemical - Polypropylene/PVC",{"$f":"IF(chem_type=1,0,tot_chem_chv)","v":4},"units",{"$f":"IF(C199=0,\"NA\",IF(chem_type=1,\"NA\",cc_valve_size))","v":0.5},"in. diam",{"$f":"IF(chem_type=1,\"NA\",IF(curve=1,cc_valve_size,VLOOKUP(cc_valve_size,pp_chv_cost_cl,2)))","v":0.5},"in. diam",{"$f":"IF(chem_type=1,\"NA\",IF(curve=1,pp_chv_eq_cc,VLOOKUP(cc_valve_size,pp_chv_cost_cl,3)))","v":67.545258479250009},270.18103391700004,{"$f":"IF(chem_type=1,\"NA\",VLOOKUP(cc_valve_size,pp_chv_cost_cl,IF(ss_cat=\"large\",4,5)))","v":20},1,"Check Valves - Corrosion Control Chemical - Polypropylene/PVC",1,2,2,1,2,2,1,2,2,0,{"$f":"IF(chem_type=1,0,1)","v":1},{"$f":"IF(chem_type=1,0,2)","v":2},{"$f":"IF(chem_type=1,0,2)","v":2},{"$f":"IF(chem_type=1,0,1)","v":1},{"$f":"IF(chem_type=1,0,2)","v":2},{"$f":"IF(chem_type=1,0,2)","v":2},{"$f":"IF(chem_type=1,0,1)","v":1},{"$f":"IF(chem_type=1,0,2)","v":2},{"$f":"IF(chem_type=1,0,2)","v":2},1,13.509051695850001]
["7.3.3","Corrosion Control Chemical - Stainless Steel",{"$f":"IF(chem_type=1,0,tot_chem_chv)","v":4},"units",{"$f":"IF(C200=0,\"NA\",IF(chem_type=1,\"NA\",cc_valve_size))","v":0.5},"in. diam",{"$f":"IF(chem_type=1,\"NA\",IF(curve=1,cc_valve_size,VLOOKUP(cc_valve_size,ss_chv_cost_cl,2)))","v":0.5},"in. diam",{"$f":"IF(chem_type=1,\"NA\",IF(curve=1,ss_chv_eq_cc,VLOOKUP(cc_valve_size,ss_chv_cost_cl,3)))","v":499.04088892537504},1996.1635557015002,{"$f":"IF(chem_type=1,\"NA\",VLOOKUP(cc_valve_size,ss_chv_cost_cl,IF(ss_cat=\"large\",4,5)))","v":20},0,"Check Valves - Corrosion Control Chemical - Stainless Steel",2,1,1,2,1,1,2,1,1,0,{"$f":"IF(chem_type=1,0,2)","v":2},{"$f":"IF(chem_type=1,0,1)","v":1},{"$f":"IF(chem_type=1,0,1)","v":1},{"$f":"IF(chem_type=1,0,2)","v":2},{"$f":"IF(chem_type=1,0,1)","v":1},{"$f":"IF(chem_type=1,0,1)","v":1},{"$f":"IF(chem_type=1,0,2)","v":2},{"$f":"IF(chem_type=1,0,1)","v":1},{"$f":"IF(chem_type=1,0,1)","v":1},0,0]
["7.3.4","Inlet - Polypropylene/PVC",{"$f":"tot_in_chv","v":1},"units",{"$f":"IF(C201=0,\"NA\",in_valve_size)","v":1.5},"in. diam",{"$f":"IF(curve=1,in_valve_size,VLOOKUP(in_valve_size,pp_chv_cost_cl,2))","v":1.5},"in. diam",{"$f":"IF(curve=1,pp_chv_eq_in,VLOOKUP(in_valve_size,pp_chv_cost_cl,3))","v":160.69101379025},160.69101379025,{"$f":"VLOOKUP(in_valve_size,pp_chv_cost_cl,IF(ss_cat=\"large\",4,5))","v":20},1,"Check Valves - Inlet - Polypropylene/PVC",1,2,3,1,2,3,1,2,3,0,1,2,3,1,2,3,1,2,3,1,8.0345506895124998]
["7.3.4","Inlet - Stainless Steel",{"$f":"tot_in_chv","v":1},"units",{"$f":"IF(C202=0,\"NA\",in_valve_size)","v":1.5},"in. diam",{"$f":"IF(curve=1,in_valve_size,VLOOKUP(in_valve_size,ss_chv_cost_cl,2))","v":1.5},"in. diam",{"$f":"IF(curve=1,ss_chv_eq_in,VLOOKUP(in_valve_size,ss_chv_cost_cl,3))","v":808.70502676212504},808.70502676212504,{"$f":"VLOOKUP(in_valve_size,ss_chv_cost_cl,IF(ss_cat=\"large\",4,5))","v":20},0,"Check Valves - Inlet - Stainless Steel",3,3,1,3,3,1,3,3,1,0,3,3,1,3,3,1,3,3,1,0,0]
["7.3.4","Inlet - Cast Iron",{"$f":"tot_in_chv","v":1},"units",{"$f":"IF(C203=0,\"NA\",in_valve_size)","v":1.5},"in. diam",{"$f":"IF(curve=1,in_valve_size,VLOOKUP(in_valve_size,ci_chv_cost_cl,2))","v":1.5},"in. diam",{"$f":"IF(curve=1,ci_chv_eq_in,VLOOKUP(in_valve_size,ci_chv_cost_cl,3))","v":"contact vendor"},"--",{"$f":"VLOOKUP(in_valve_size,ci_chv_cost_cl,IF(ss_cat=\"large\",4,5))","v":20},0,"Check Valves - Inlet - Cast Iron",2,1,2,2,1,2,2,1,2,0,2,1,2,2,1,2,2,1,2,0,0]
["7.3.5","Bypass - Polypropylene/PVC",{"$f":"IF(bp_pct=0,0,tot_bp_chv)","v":0},"units",{"$f":"IF(bp_pct=0,\"NA\",bypass_valve_size)","v":"NA"},{"$f":"IF(bp_pct=0,\" \",\"in. diam\")","v":" "},{"$f":"IF(bp_pct=0,\"NA\",(IF(curve=1,bypass_valve_size,VLOOKUP(bypass_valve_size,pp_chv_cost_cl,2))))","v":"NA"},{"$f":"IF(bp_pct=0,\" \",\"in. diam\")","v":" "},{"$f":"IF(bp_pct=0,\"NA\",(IF(curve=1,pp_chv_eq_bp,VLOOKUP(bypass_valve_size,pp_chv_cost_cl,3))))","v":"NA"},"--",{"$f":"IF(C204=0,\"NA\",VLOOKUP(E204,pp_chv_cost_cl,IF(ss_cat=\"large\",4,5)))","v":"NA"},null,"Check Valves - Bypass - Polypropylene/PVC",{"$f":"IF(retrofit=1,$W204*X204,IF(ISBLANK(X204),\"\",X204))","v":1},{"$f":"IF(retrofit=1,$W204*Y204,IF(ISBLANK(Y204),\"\",Y204))","v":2},{"$f":"IF(retrofit=1,$W204*Z204,IF(ISBLANK(Z204),\"\",Z204))","v":3},{"$f":"IF(retrofit=1,$W204*AA204,IF(ISBLANK(AA204),\"\",AA204))","v":1},{"$f":"IF(retrofit=1,$W204*AB204,IF(ISBLANK(AB204),\"\",AB204))","v":2},{"$f":"IF(retrofit=1,$W204*AC204,IF(ISBLANK(AC204),\"\",AC204))","v":3},{"$f":"IF(retrofit=1,$W204*AD204,IF(ISBLANK(AD204),\"\",AD204))","v":1},{"$f":"IF(retrofit=1,$W204*AE204,IF(ISBLANK(AE204),\"\",AE204))","v":2},{"$f":"IF(retrofit=1,$W204*AF204,IF(ISBLANK(AF204),\"\",AF204))","v":3},0,1,2,3,1,2,3,1,2,3,{"$f":"IF(ISERROR(K204*L204),0,IF(K204<1,0,L204))","v":0},{"$f":"IF(AG204,J204/K204,0)","v":0}]
["7.3.5","Bypass - Stainless Steel",{"$f":"IF(bp_pct=0,0,tot_bp_chv)","v":0},"units",{"$f":"IF(bp_pct=0,\"NA\",bypass_valve_size)","v":"NA"},{"$f":"IF(bp_pct=0,\" \",\"in. diam\")","v":" "},{"$f":"IF(bp_pct=0,\"NA\",(IF(curve=1,bypass_valve_size,VLOOKUP(bypass_valve_size,ss_chv_cost_cl,2))))","v":"NA"},{"$f":"IF(bp_pct=0,\" \",\"in. diam\")","v":" "},{"$f":"IF(bp_pct=0,\"NA\",(IF(curve=1,ss_chv_eq_bp,VLOOKUP(bypass_valve_size,ss_chv_cost_cl,3))))","v":"NA"},"--",{"$f":"IF(C205=0,\"NA\",VLOOKUP(E205,ss_chv_cost_cl,IF(ss_cat=\"large\",4,5)))","v":"NA"},null,"Check Valves - Bypass - Stainless Steel",3,3,1,3,3,1,3,3,1,0,3,3,1,3,3,1,3,3,1,0,0]
["7.3.5","Bypass - Cast Iron",{"$f":"IF(bp_pct=0,0,tot_bp_chv)","v":0},"units",{"$f":"IF(bp_pct=0,\"NA\",bypass_valve_size)","v":"NA"},{"$f":"IF(bp_pct=0,\" \",\"in. diam\")","v":" "},{"$f":"IF(bp_pct=0,\"NA\",(IF(curve=1,bypass_valve_size,VLOOKUP(bypass_valve_size,ci_chv_cost_cl,2))))","v":"NA"},{"$f":"IF(bp_pct=0,\" \",\"in. diam\")","v":" "},{"$f":"IF(bp_pct=0,\"NA\",(IF(curve=1,ci_chv_eq_bp,VLOOKUP(bypass_valve_size,ci_chv_cost_cl,3))))","v":"NA"},"--",{"$f":"IF(C206=0,\"NA\",VLOOKUP(E206,ci_chv_cost_cl,IF(ss_cat=\"large\",4,5)))","v":"NA"},null,"Check Valves - Bypass - Cast Iron",2,1,2,2,1,2,2,1,2,0,2,1,2,2,1,2,2,1,2,0,0]
["8.","Instrumentation",null,null,null,null,null,null,null,null,null,null,null,null,null,null,null,null,null,null,null,null,null,null,null,null,null,null,null,null,null,null,0,0]
["8.1","Flow Meters - Inlet and Outlet",null,null,null,null,null,null,null,null,null,null,null,null,null,null,null,null,null,null,null,null,null,null,null,null,null,null,null,null,null,null,0,0]
["8.1.1","Orifice Plate",{"$f":"tot_fm_in","v":1},"units",{"$f":"in_meter_size","v":1.5},"in. diam",{"$f":"IF(curve=1,in_meter_size,VLOOKUP(in_meter_size,op_fm_cost_cl,2))","v":1.5},"in. diam",{"$f":"IF(curve=1,op_fm_eq_in,VLOOKUP(in_meter_size,op_fm_cost_cl,3))","v":2883.36523860225},{"$f":"IF(C209=0,\"--\",IF(I209=\"contact vendor\",\"--\",C209*I209))","v":2883.36523860225},{"$f":"VLOOKUP(in_meter_size,op_fm_cost_cl,IF(ss_cat=\"large\",4,5))","v":14},0,{"$f":"$B$207&\" - \"&$B$208&\" - \"&B209","v":"Instrumentation - Flow Meters - Inlet and Outlet - Orifice Plate"},{"$f":"IF(retrofit=1,$W209*X209,IF(ISBLANK(X209),\"\",X209))","v":3},4,4,3,4,4,3,{"$f":"IF(retrofit=1,$W209*AE209,IF(ISBLANK(AE209),\"\",AE209))","v":3},4,0,3,4,4,3,4,4,3,3,4,0,0]
["8.1.1","Propeller",{"$f":"tot_fm_in","v":1},"units",{"$f":"in_meter_size","v":1.5},"in. diam",{"$f":"IF(curve=1,in_meter_size,VLOOKUP(in_meter_size,prop_fm_cost_cl,2))","v":1.5},"in. diam",{"$f":"IF(curve=1,prop_fm_eq_in,VLOOKUP(in_meter_size,prop_fm_cost_cl,3))","v":1902.93784887225},1902.93784887225,{"$f":"VLOOKUP(in_meter_size,prop_fm_cost_cl,IF(ss_cat=\"large\",4,5))","v":14},1,{"$f":"$B$207&\" - \"&$B$208&\" - \"&B210","v":"Instrumentation - Flow Meters - Inlet and Outlet - Propeller"},1,2,3,1,2,3,4,4,2,0,1,2,3,1,2,3,4,4,2,1,135.92413206230358]
["8.1.1","Venturi",{"$f":"tot_fm_in","v":1},"units",{"$f":"in_meter_size","v":1.5},"in. diam",{"$f":"IF(curve=1,in_meter_size,VLOOKUP(in_meter_size,ven_fm_cost_cl,2))","v":1.5},"in. diam",{"$f":"IF(curve=1,ven_fm_eq_in,VLOOKUP(in_meter_size,ven_fm_cost_cl,3))","v":4021.2751682277503},4021.2751682277503,{"$f":"VLOOKUP(in_meter_size,ven_fm_cost_cl,IF(ss_cat=\"large\",4,5))","v":14},0,{"$f":"$B$207&\" - \"&$B$208&\" - \"&B211","v":"Instrumentation - Flow Meters - Inlet and Outlet - Venturi"},2,1,2,2,1,2,1,2,3,0,2,1,2,2,1,2,1,2,3,0,0]
["8.1.1","Magnetic",{"$f":"tot_fm_in","v":1},"units",{"$f":"in_meter_size","v":1.5},"in. diam",{"$f":"IF(curve=1,in_meter_size,VLOOKUP(in_meter_size,mag_fm_cost_cl,2))","v":1.5},"in. diam",{"$f":"IF(curve=1,mag_fm_eq_in,VLOOKUP(in_meter_size,mag_fm_cost_cl,3))","v":2619.0838298265321},2619.0838298265321,{"$f":"VLOOKUP(in_meter_size,mag_fm_cost_cl,IF(ss_cat=\"large\",4,5))","v":14},0,{"$f":"$B$207&\" - \"&$B$208&\" - \"&B212","v":"Instrumentation - Flow Meters - Inlet and Outlet - Magnetic"},4,3,1,4,3,1,2,1,1,0,4,3,1,4,3,1,2,1,1,0,0]
["8.2","Flow Meters - Process",null,null,null,null,null,null,null,null,null,null,null,null,null,null,null,null,null,null,null,null,null,null,null,null,null,null,null,null,null,null,0,0]
["8.2.1","Orifice Plate",{"$f":"tot_fm_proc","v":2},"units",{"$f":"proc_meter_size","v":1.5},"in. diam",{"$f":"IF(curve=1,proc_meter_size,VLOOKUP(proc_meter_size,op_fm_cost_cl,2))","v":1.5},"in. diam",{"$f":"IF(curve=1,op_fm_eq_proc,VLOOKUP(proc_meter_size,op_fm_cost_cl,3))","v":2883.36523860225},{"$f":"IF(C214=0,\"--\",IF(I214=\"contact vendor\",\"--\",C214*I214))","v":5766.7304772044999},{"$f":"VLOOKUP(proc_meter_size,op_fm_cost_cl,IF(ss_cat=\"large\",4,5))","v":14},0,{"$f":"$B$207&\" - \"&$B$213&\" - \"&B214","v":"Instrumentation - Flow Meters - Process - Orifice Plate"},{"$f":"IF(retrofit=1,$W214*X214,IF(ISBLANK(X214),\"\",X214))","v":3},4,4,3,4,4,3,{"$f":"IF(retrofit=1,$W214*AE214,IF(ISBLANK(AE214),\"\",AE214))","v":3},4,0,3,4,4,3,4,4,3,3,4,0,0]
["8.2.1","Propeller",{"$f":"tot_fm_proc","v":2},"units",{"$f":"proc_meter_size","v":1.5},"in. diam",{"$f":"IF(curve=1,proc_meter_size,VLOOKUP(proc_meter_size,prop_fm_cost_cl,2))","v":1.5},"in. diam",{"$f":"IF(curve=1,prop_fm_eq_proc,VLOOKUP(proc_meter_size,prop_fm_cost_cl,3))","v":1902.93784887225},3805.8756977445,{"$f":"VLOOKUP(proc_meter_size,prop_fm_cost_cl,IF(ss_cat=\"large\",4,5))","v":14},1,{"$f":"$B$207&\" - \"&$B$213&\" - \"&B215","v":"Instrumentation - Flow Meters - Process - Propeller"},1,2,3,1,2,3,4,4,2,0,1,2,3,1,2,3,4,4,2,1,271.84826412460717]
["8.2.1","Venturi",{"$f":"tot_fm_proc","v":2},"units",{"$f":"proc_meter_size","v":1.5},"in. diam",{"$f":"IF(curve=1,proc_meter_size,VLOOKUP(proc_meter_size,ven_fm_cost_cl,2))","v":1.5},"in. diam",{"$f":"IF(curve=1,ven_fm_eq_proc,VLOOKUP(proc_meter_size,ven_fm_cost_cl,3))","v":4021.2751682277503},8042.5503364555007,{"$f":"VLOOKUP(proc_meter_size,ven_fm_cost_cl,IF(ss_cat=\"large\",4,5))","v":14},0,{"$f":"$B$207&\" - \"&$B$213&\" - \"&B216","v":"Instrumentation - Flow Meters - Process - Venturi"},2,1,2,2,1,2,1,2,3,0,2,1,2,2,1,2,1,2,3,0,0]
["8.2.1","Magnetic",{"$f":"tot_fm_proc","v":2},"units",{"$f":"proc_meter_size","v":1.5},"in. diam",{"$f":"IF(curve=1,proc_meter_size,VLOOKUP(proc_meter_size,mag_fm_cost_cl,2))","v":1.5},"in. diam",{"$f":"IF(curve=1,mag_fm_eq_proc,VLOOKUP(proc_meter_size,mag_fm_cost_cl,3))","v":2619.0838298265321},5238.1676596530642,{"$f":"VLOOKUP(proc_meter_size,mag_fm_cost_cl,IF(ss_cat=\"large\",4,5))","v":14},0,{"$f":"$B$207&\" - \"&$B$213&\" - \"&B217","v":"Instrumentation - Flow Meters - Process - Magnetic"},4,3,1,4,3,1,2,1,1,0,4,3,1,4,3,1,2,1,1,0,0]
["8.3","Air Flow Meters",null,null,null,null,null,null,null,null,null,null,null,null,null,null,null,null,null,null,null,null,null,null,null,null,null,null,null,null,null,null,0,0]
["8.3.1","Rotameter",{"$f":"tot_fm_air","v":2},"units","NA",null,"NA",null,{"$f":"VLOOKUP(0,gas_fm_cost_cl,3)","v":1704.2859148311979},{"$f":"IF(C219=0,\"--\",IF(I219=\"contact vendor\",\"--\",C219*I219))","v":3408.5718296623959},{"$f":"VLOOKUP(0,gas_fm_cost_cl,IF(ss_cat=\"large\",4,5))","v":14},1,{"$f":"$B$207&\" - \"&B218&\" - \"&B219","v":"Instrumentation - Air Flow Meters - Rotameter"},{"$f":"IF(retrofit=1,$W219*X219,IF(ISBLANK(X219),\"\",X219))","v":1},1,1,1,1,1,1,{"$f":"IF(retrofit=1,$W219*AE219,IF(ISBLANK(AE219),\"\",AE219))","v":1},{"$f":"IF(retrofit=1,$W219*AF219,IF(ISBLANK(AF219),\"\",AF219))","v":1},0,1,1,1,1,1,1,1,1,1,1,243.46941640445684]
["8.4","High/Low Alarms (for chemical tanks)",{"$f":"tot_chem_alarm","v":1},"units","NA",null,"NA",null,{"$f":"VLOOKUP(0,alarm_cost_cl,3)","v":644.29028036571617},644.29028036571617,{"$f":"VLOOKUP(0,alarm_cost_cl,IF(ss_cat=\"large\",4,5))","v":14},1,{"$f":"$B$207&\" - \"&B220","v":"Instrumentation - High/Low Alarms (for chemical tanks)"},1,1,1,1,1,1,1,1,1,0,1,1,1,1,1,1,1,1,1,1,46.020734311836868]
["8.5","Temperature Meters",{"$f":"temp_meters","v":1},"units","NA",null,"NA",null,{"$f":"VLOOKUP(0,temp_meter_cost_cl,3)","v":522.62094023815598},522.62094023815598,{"$f":"VLOOKUP(0,temp_meter_cost_cl,IF(ss_cat=\"large\",4,5))","v":14},1,"Instrumentation - Temperature Meters",1,1,1,1,1,1,1,1,1,0,1,1,1,1,1,1,1,1,1,1,37.330067159868285]
["8.6","pH Meters",{"$f":"pH_controls","v":2},"units","NA",null,"NA",null,{"$f":"VLOOKUP(0,pH_meter_cost_cl,3)","v":2185.4726555323537},4370.9453110647073,{"$f":"VLOOKUP(0,pH_meter_cost_cl,IF(ss_cat=\"large\",4,5))","v":14},1,"Instrumentation - pH Meters",1,1,1,1,1,1,1,1,1,0,1,1,1,1,1,1,1,1,1,1,312.21037936176481]
["8.7","Total Dissolved Solids Monitors",{"$f":"num_TDS","v":0},"units","NA",null,"NA",null,{"$f":"IF(C223=0,\"NA\",VLOOKUP(0,TDS_monitor_cost_cl,3))","v":"NA"},"--",{"$f":"IF(C223=0,\"NA\",VLOOKUP(0,TDS_monitor_cost_cl,IF(ss_cat=\"large\",4,5)))","v":"NA"},null,"Instrumentation - Total Dissolved Solids Monitors",1,1,1,1,1,1,1,1,1,0,1,1,1,1,1,1,1,1,1,0,0]
["8.8","Turbidity meters",{"$f":"tot_turb_meters","v":0},"units","NA",null,"NA",null,{"$f":"IF(C224=0,\"NA\",VLOOKUP(0,turbidimeter_cost_cl,3))","v":"NA"},"--",{"$f":"IF(C224=0,\"NA\",VLOOKUP(0,turbidimeter_cost_cl,IF(ss_cat=\"large\",4,5)))","v":"NA"},null,"Instrumentation - Turbidity meters",1,1,1,1,1,1,1,1,1,0,1,1,1,1,1,1,1,1,1,0,0]
["8.9","Electrical Enclosure",{"$f":"elec_encl","v":1},"units","NA",null,"NA",null,{"$f":"VLOOKUP(0,elec_encl_cost_cl,3)","v":1125},1125,{"$f":"VLOOKUP(0,elec_encl_cost_cl,IF(ss_cat=\"large\",4,5))","v":17},1,"Instrumentation - Electrical Enclosure",1,1,1,1,1,1,1,1,1,0,1,1,1,1,1,1,1,1,1,1,66.17647058823529]
["9.","System Controls",null,null,null,null,null,null,null,null,null,null,null,null,null,null,null,null,null,null,null,null,null,null,null,null,null,null,null,null,null,null,{"$f":"IF(ISERROR(K226*L226),0,IF(K226<1,0,L226))","v":0},{"$f":"IF(AG226,J226/K226,0)","v":0}]
["9.1","PLC Units",null,null,null,null,null,null,null,null,null,null,null,null,null,null,null,null,null,null,null,null,null,null,null,null,null,null,null,null,null,null,0,0]
["9.1.1","PLC racks/power supplies",{"$f":"IF(manual=1,0,plc_rack)","v":1},"units","NA",null,"NA",null,{"$f":"IF(C228=0,\"NA\",VLOOKUP(0,plc_rack_cost_cl,3))","v":348.87132842256426},{"$f":"IF(C228=0,\"--\",IF(I228=\"contact vendor\",\"--\",C228*I228))","v":348.87132842256426},{"$f":"IF(C228=0,\"NA\",VLOOKUP(0,plc_rack_cost_cl,IF(ss_cat=\"large\",4,5)))","v":8},1,{"$f":"$B$226&\" - \"&$B$227&\" - \"&B228","v":"System Controls - PLC Units - PLC racks/power supplies"},{"$f":"IF(retrofit=1,$W228*X228,IF(ISBLANK(X228),\"\",X228))","v":1},{"$f":"IF(retrofit=1,$W228*Y228,IF(ISBLANK(Y228),\"\",Y228))","v":1},{"$f":"IF(retrofit=1,$W228*Z228,IF(ISBLANK(Z228),\"\",Z228))","v":1},{"$f":"IF(retrofit=1,$W228*AA228,IF(ISBLANK(AA228),\"\",AA228))","v":1},{"$f":"IF(retrofit=1,$W228*AB228,IF(ISBLANK(AB228),\"\",AB228))","v":1},{"$f":"IF(retrofit=1,$W228*AC228,IF(ISBLANK(AC228),\"\",AC228))","v":1},{"$f":"IF(retrofit=1,$W228*AD228,IF(ISBLANK(AD228),\"\",AD228))","v":1},{"$f":"IF(retrofit=1,$W228*AE228,IF(ISBLANK(AE228),\"\",AE228))","v":1},{"$f":"IF(retrofit=1,$W228*AF228,IF(ISBLANK(AF228),\"\",AF228))","v":1},0,1,1,1,1,1,1,1,1,1,1,43.608916052820533]
["9.1.2","CPUs",{"$f":"IF(manual=1,0,plc_cpu)","v":2},"units","NA",null,"NA",null,{"$f":"IF(C229=0,\"NA\",VLOOKUP(0,plc_cpu_cost_cl,3))","v":521.83546674806814},1043.6709334961363,{"$f":"IF(C229=0,\"NA\",VLOOKUP(0,plc_cpu_cost_cl,IF(ss_cat=\"large\",4,5)))","v":8},1,{"$f":"$B$226&\" - \"&$B$227&\" - \"&B229","v":"System Controls - PLC Units - CPUs"},1,1,1,1,1,1,1,1,1,0,1,1,1,1,1,1,1,1,1,1,130.45886668701704]
["9.1.3","I/O discrete input modules",{"$f":"IF(manual=1,0,plc_discrete_input)","v":1},"units","NA",null,"NA",null,{"$f":"IF(C230=0,\"NA\",VLOOKUP(0,plc_discrete_input_cost_cl,3))","v":276.30421456568109},276.30421456568109,{"$f":"IF(C230=0,\"NA\",VLOOKUP(0,plc_discrete_input_cost_cl,IF(ss_cat=\"large\",4,5)))","v":8},1,"System Controls - PLC Units - I/O discrete input modules",1,1,1,1,1,1,1,1,1,0,1,1,1,1,1,1,1,1,1,1,34.538026820710137]
["9.1.4","I/O discrete output modules",{"$f":"IF(manual=1,0,plc_discrete_output)","v":1},"units","NA",null,"NA",null,{"$f":"IF(C231=0,\"NA\",VLOOKUP(0,plc_discrete_output_cost_cl,3))","v":341.71318814884199},341.71318814884199,{"$f":"IF(C231=0,\"NA\",VLOOKUP(0,plc_discrete_output_cost_cl,IF(ss_cat=\"large\",4,5)))","v":8},1,"System Controls - PLC Units - I/O discrete output modules",1,1,1,1,1,1,1,1,1,0,1,1,1,1,1,1,1,1,1,1,42.714148518605249]
["9.1.5","I/O combination analog modules",{"$f":"IF(manual=1,0,plc_combination_analog)","v":3},"units","NA",null,"NA",null,{"$f":"IF(C232=0,\"NA\",VLOOKUP(0,plc_combination_analog_cost_cl,3))","v":538.26867927154467},1614.806037814634,{"$f":"IF(C232=0,\"NA\",VLOOKUP(0,plc_combination_analog_cost_cl,IF(ss_cat=\"large\",4,5)))","v":8},1,"System Controls - PLC Units - I/O combination analog modules",1,1,1,1,1,1,1,1,1,0,1,1,1,1,1,1,1,1,1,1,201.85075472682925]
["9.1.6","Ethernet modules",{"$f":"IF(manual=1,0,plc_ethernet)","v":2},"units","NA",null,"NA",null,{"$f":"IF(C233=0,\"NA\",VLOOKUP(0,plc_ethernet_cost_cl,3))","v":547.77375078255295},1095.5475015651059,{"$f":"IF(C233=0,\"NA\",VLOOKUP(0,plc_ethernet_cost_cl,IF(ss_cat=\"large\",4,5)))","v":8},1,"System Controls - PLC Units - Ethernet modules",1,1,1,1,1,1,1,1,1,0,1,1,1,1,1,1,1,1,1,1,136.94343769563824]
["9.1.7","Base expansion modules",{"$f":"IF(manual=1,0,plc_base_expansion)","v":0},"units","NA",null,"NA",null,{"$f":"IF(C234=0,\"NA\",VLOOKUP(0,plc_base_expansion_cost_cl,3))","v":"NA"},"--",{"$f":"IF(C234=0,\"NA\",VLOOKUP(0,plc_base_expansion_cost_cl,IF(ss_cat=\"large\",4,5)))","v":"NA"},null,"System Controls - PLC Units - Base expansion modules",1,1,1,1,1,1,1,1,1,0,1,1,1,1,1,1,1,1,1,0,0]
["9.1.8","Base expansion controller modules",{"$f":"IF(manual=1,0,plc_base_expansion_controller)","v":0},"units","NA",null,"NA",null,{"$f":"IF(C235=0,\"NA\",VLOOKUP(0,plc_base_expansion_controller_cost_cl,3))","v":"NA"},"--",{"$f":"IF(C235=0,\"NA\",VLOOKUP(0,plc_base_expansion_controller_cost_cl,IF(ss_cat=\"large\",4,5)))","v":"NA"},null,"System Controls - PLC Units - Base expansion controller modules",1,1,1,1,1,1,1,1,1,0,1,1,1,1,1,1,1,1,1,0,0]
["9.1.9","UPSs",{"$f":"IF(manual=1,0,ups)","v":1},"units","NA",null,"NA",null,{"$f":"IF(C236=0,\"NA\",VLOOKUP(0,ups_cost_cl,3))","v":416.78213070467206},416.78213070467206,{"$f":"IF(C236=0,\"NA\",VLOOKUP(0,ups_cost_cl,IF(ss_cat=\"large\",4,5)))","v":8},1,"System Controls - PLC Units - UPSs",1,1,1,1,1,1,1,1,1,0,1,1,1,1,1,1,1,1,1,1,52.097766338084007]
["9.2","Operator Equipment",null,null,null,null,null,null,null,null,null,null,null,null,null,null,null,null,null,null,null,null,null,null,null,null,null,null,null,null,null,null,0,0]
["9.2.1","Drive controllers",{"$f":"IF(manual=1,0,tot_switches)","v":7},"units","NA",null,"NA",null,{"$f":"IF(C238=0,\"NA\",VLOOKUP(0,switch_cost_cl,3))","v":984.59764286548318},6892.1835000583824,{"$f":"IF(C238=0,\"NA\",VLOOKUP(0,switch_cost_cl,IF(ss_cat=\"large\",4,5)))","v":14},1,{"$f":"$B$226&\" - \"&$B$237&\" - \"&B238","v":"System Controls - Operator Equipment - Drive controllers"},{"$f":"IF(retrofit=1,$W238*X238,IF(ISBLANK(X238),\"\",X238))","v":1},1,1,1,1,1,1,{"$f":"IF(retrofit=1,$W238*AE238,IF(ISBLANK(AE238),\"\",AE238))","v":1},1,0,1,1,1,1,1,1,1,1,1,1,492.29882143274159]
["9.2.2","Operator interface units",{"$f":"IF(manual=1,0,plc_interface)","v":2},"units","NA",null,"NA",null,{"$f":"IF(C239=0,\"NA\",VLOOKUP(ss_cat,plc_op_interface_cost_cl,3,FALSE))","v":2390.7875590067538},4781.5751180135076,{"$f":"IF(C239=0,\"NA\",VLOOKUP(ss_cat,plc_op_interface_cost_cl,IF(ss_cat=\"large\",4,5),FALSE))","v":8},1,{"$f":"$B$226&\" - \"&$B$237&\" - \"&B239","v":"System Controls - Operator Equipment - Operator interface units"},1,1,1,1,1,1,1,1,1,0,1,1,1,1,1,1,1,1,1,1,597.69688975168845]
["9.2.3","PC Workstations",{"$f":"IF(OR(manual=1,ss_cat=\"small\"),0,workstations)","v":0},"units","NA",null,"NA",null,{"$f":"IF(C240=0,\"NA\",VLOOKUP(0,pc_workstation_cost_cl,3))","v":"NA"},"--",{"$f":"IF(C240=0,\"NA\",VLOOKUP(0,pc_workstation_cost_cl,IF(ss_cat=\"large\",4,5)))","v":"NA"},null,{"$f":"$B$226&\" - \"&$B$237&\" - \"&B240","v":"System Controls - Operator Equipment - PC Workstations"},1,1,1,1,1,1,1,1,1,0,1,1,1,1,1,1,1,1,1,0,0]
["9.2.4","Printers - laser jet",{"$f":"IF(OR(manual=1,ss_cat=\"small\"),0,printers)","v":0},"units","NA",null,"NA",null,{"$f":"IF(C241=0,\"NA\",VLOOKUP(0,laser_printer_cost_cl,3))","v":"NA"},"--",{"$f":"IF(C241=0,\"NA\",VLOOKUP(0,laser_printer_cost_cl,IF(ss_cat=\"large\",4,5)))","v":"NA"},null,{"$f":"$B$226&\" - \"&$B$237&\" - \"&B241","v":"System Controls - Operator Equipment - Printers - laser jet"},1,1,1,1,1,1,1,1,1,0,1,1,1,1,1,1,1,1,1,0,0]
["9.2.5","Printers - dot matrix",{"$f":"IF(OR(manual=1,ss_cat=\"small\"),0,printers)","v":0},"units","NA",null,"NA",null,{"$f":"IF(C242=0,\"NA\",VLOOKUP(0,dotmatrix_printer_cost_cl,3))","v":"NA"},"--",{"$f":"IF(C242=0,\"NA\",VLOOKUP(0,dotmatrix_printer_cost_cl,IF(ss_cat=\"large\",4,5)))","v":"NA"},null,{"$f":"$B$226&\" - \"&$B$237&\" - \"&B242","v":"System Controls - Operator Equipment - Printers - dot matrix"},1,1,1,1,1,1,1,1,1,0,1,1,1,1,1,1,1,1,1,0,0]
["9.3","Controls Software",null,null,null,null,null,null,null,null,null,null,null,null,null,null,null,null,null,null,null,null,null,null,null,null,null,null,null,null,null,null,0,0]
["9.3.1","Operator interface software",{"$f":"IF(OR(manual=1,ss_cat=\"small\"),0,plc_interface)","v":0},"units","NA",null,"NA",null,{"$f":"IF(manual=1,\"NA\",VLOOKUP(0,op_interface_software_cost_cl,3))","v":159.73214000968537},"--",{"$f":"IF(C244=0,\"NA\",VLOOKUP(0,op_interface_software_cost_cl,IF(ss_cat=\"large\",4,5)))","v":"NA"},null,{"$f":"$B$226&\" - \"&$B$243&\" - \"&B244","v":"System Controls - Controls Software - Operator interface software"},{"$f":"IF(retrofit=1,$W244*X244,IF(ISBLANK(X244),\"\",X244))","v":1},1,1,1,1,1,1,{"$f":"IF(retrofit=1,$W244*AE244,IF(ISBLANK(AE244),\"\",AE244))","v":1},1,0,1,1,1,1,1,1,1,1,1,0,0]
["9.3.2","PLC programming software",{"$f":"IF(OR(manual=1,ss_cat=\"small\"),0,workstations)","v":0},"units","NA",null,"NA",null,{"$f":"IF(manual=1,\"NA\",VLOOKUP(0,plc_software_cost_cl,3))","v":369.87636299627394},"--",{"$f":"IF(C245=0,\"NA\",VLOOKUP(0,plc_software_cost_cl,IF(ss_cat=\"large\",4,5)))","v":"NA"},null,{"$f":"$B$226&\" - \"&$B$243&\" - \"&B245","v":"System Controls - Controls Software - PLC programming software"},1,1,1,1,1,1,1,1,1,0,1,1,1,1,1,1,1,1,1,0,0]
["9.3.3","PLC data collection software",{"$f":"IF(OR(manual=1,ss_cat=\"small\"),0,workstations)","v":0},"units","NA",null,"NA",null,{"$f":"IF(manual=1,\"NA\",VLOOKUP(0,plc_data_software_cost_cl,3))","v":348.2845956132428},"--",{"$f":"IF(C246=0,\"NA\",VLOOKUP(0,plc_data_software_cost_cl,IF(ss_cat=\"large\",4,5)))","v":"NA"},null,{"$f":"$B$226&\" - \"&$B$243&\" - \"&B246","v":"System Controls - Controls Software - PLC data collection software"},1,1,1,1,1,1,1,1,1,0,1,1,1,1,1,1,1,1,1,0,0]
["9.3.4","Plant intelligence software",{"$f":"IF(OR(manual=1,ss_cat=\"small\"),0,workstations)","v":0},"units","NA",null,"NA",null,{"$f":"IF(OR(manual=1,ss_cat=\"small\"),\"NA\",VLOOKUP(0,plant_intel_software_cost_cl,3))","v":"NA"},"--",{"$f":"IF(C247=0,\"NA\",VLOOKUP(0,plant_intel_software_cost_cl,IF(ss_cat=\"large\",4,5)))","v":"NA"},null,{"$f":"$B$226&\" - \"&$B$243&\" - \"&B247","v":"System Controls - Controls Software - Plant intelligence software"},1,1,1,1,1,1,1,1,1,0,1,1,1,1,1,1,1,1,1,0,0]
["10.","Offgas Pollution Control Equipment",null,null,null,null,null,null,null,null,null,null,null,null,null,null,null,null,null,null,null,null,null,null,null,null,null,null,null,null,null,null,0,0]
["10.1","Thermal Oxidizer - No Heat Recovery",{"$f":"IF(og_opt1<>0,0,tot_TOs)","v":0},"units",{"$f":"IF(C249=0,\"NA\",TO_size)","v":"NA"},{"$f":"IF(C249=0,\"\",\"cfm\")","v":""},{"$f":"IF(C249=0,\"NA\",IF(curve=1,TO_size,VLOOKUP(TO_size,og_to_cost_cl,2)))","v":"NA"},{"$f":"IF(C249=0,\"\",\"cfm\")","v":""},{"$f":"IF(C249=0,\"NA\",IF(curve=1,og_TO_eq,VLOOKUP(TO_size,og_to_cost_cl,3)))","v":"NA"},"--",{"$f":"IF(C249=0,\"NA\",VLOOKUP(TO_size,og_to_cost_cl,IF(ss_cat=\"large\",4,5)))","v":"NA"},null,{"$f":"$B$248&\" - \"&B249","v":"Offgas Pollution Control Equipment - Thermal Oxidizer - No Heat Recovery"},{"$f":"IF(retrofit=1,$W249*X249,IF(ISBLANK(X249),\"\",X249))","v":1},1,1,1,1,1,1,{"$f":"IF(retrofit=1,$W249*AE249,IF(ISBLANK(AE249),\"\",AE249))","v":1},{"$f":"IF(retrofit=1,$W249*AF249,IF(ISBLANK(AF249),\"\",AF249))","v":1},0,1,1,1,1,1,1,1,1,1,0,0]
["10.1","Thermal Oxidizer - Recuperative",{"$f":"IF(og_opt1<>1,0,tot_TOs)","v":0},"units",{"$f":"IF(C250=0,\"NA\",TO_size)","v":"NA"},"",{"$f":"IF(C250=0,\"NA\",IF(curve=1,TO_size,VLOOKUP(TO_size,og_torec_cost_cl,2)))","v":"NA"},"",{"$f":"IF(C250=0,\"NA\",IF(curve=1,og_torec_eq,VLOOKUP(TO_size,og_torec_cost_cl,3)))","v":"NA"},"--",{"$f":"IF(C250=0,\"NA\",VLOOKUP(TO_size,og_torec_cost_cl,IF(ss_cat=\"large\",4,5)))","v":"NA"},null,"Offgas Pollution Control Equipment - Thermal Oxidizer - Recuperative",1,1,1,1,1,1,1,1,1,0,1,1,1,1,1,1,1,1,1,0,0]
["10.1","Thermal Oxidizer - Regenerative/Flameless",{"$f":"IF(og_opt1<>2,0,tot_TOs)","v":0},"units",{"$f":"IF(C251=0,\"NA\",TO_size)","v":"NA"},"",{"$f":"IF(C251=0,\"NA\",IF(curve=1,TO_size,VLOOKUP(TO_size,og_toreg_cost_cl,2)))","v":"NA"},"",{"$f":"IF(C251=0,\"NA\",IF(curve=1,og_toreg_eq,VLOOKUP(TO_size,og_toreg_cost_cl,3)))","v":"NA"},"--",{"$f":"IF(C251=0,\"NA\",VLOOKUP(TO_size,og_toreg_cost_cl,IF(ss_cat=\"large\",4,5)))","v":"NA"},null,"Offgas Pollution Control Equipment - Thermal Oxidizer - Regenerative/Flameless",1,1,1,1,1,1,1,1,1,0,1,1,1,1,1,1,1,1,1,0,0]
["10.1","Catalytic Oxidizer - No Heat Recovery",{"$f":"IF(og_opt1<>0,0,tot_COs)","v":0},"units",{"$f":"IF(C252=0,\"NA\",CO_size)","v":"NA"},"",{"$f":"IF(C252=0,\"NA\",IF(curve=1,CO_size,VLOOKUP(CO_size,og_co_cost_cl,2)))","v":"NA"},"",{"$f":"IF(C252=0,\"NA\",IF(curve=1,og_co_eq,VLOOKUP(CO_size,og_co_cost_cl,3)))","v":"NA"},"--",{"$f":"IF(C252=0,\"NA\",VLOOKUP(CO_size,og_co_cost_cl,IF(ss_cat=\"large\",4,5)))","v":"NA"},null,"Offgas Pollution Control Equipment - Catalytic Oxidizer - No Heat Recovery",1,1,1,1,1,1,1,1,1,0,1,1,1,1,1,1,1,1,1,0,0]
["10.1","Catalytic Oxidizer - Recuperative",{"$f":"IF(og_opt1<>1,0,tot_COs)","v":0},"units",{"$f":"IF(C253=0,\"NA\",CO_size)","v":"NA"},"",{"$f":"IF(C253=0,\"NA\",IF(curve=1,CO_size,VLOOKUP(CO_size,og_corec_cost_cl,2)))","v":"NA"},"",{"$f":"IF(C253=0,\"NA\",IF(curve=1,og_corec_eq,VLOOKUP(CO_size,og_corec_cost_cl,3)))","v":"NA"},"--",{"$f":"IF(C253=0,\"NA\",VLOOKUP(CO_size,og_corec_cost_cl,IF(ss_cat=\"large\",4,5)))","v":"NA"},null,"Offgas Pollution Control Equipment - Catalytic Oxidizer - Recuperative",1,1,1,1,1,1,1,1,1,0,1,1,1,1,1,1,1,1,1,0,0]
["10.1","Catalytic Oxidizer - Regenerative",{"$f":"IF(og_opt1<>2,0,tot_COs)","v":0},"units",{"$f":"IF(C254=0,\"NA\",CO_size)","v":"NA"},"",{"$f":"IF(C254=0,\"NA\",IF(curve=1,CO_size,VLOOKUP(CO_size,og_coreg_cost_cl,2)))","v":"NA"},"",{"$f":"IF(C254=0,\"NA\",IF(curve=1,og_coreg_eq,VLOOKUP(CO_size,og_coreg_cost_cl,3)))","v":"NA"},"--",{"$f":"IF(C254=0,\"NA\",VLOOKUP(CO_size,og_coreg_cost_cl,IF(ss_cat=\"large\",4,5)))","v":"NA"},null,"Offgas Pollution Control Equipment - Catalytic Oxidizer - Regenerative",1,1,1,1,1,1,1,1,1,0,1,1,1,1,1,1,1,1,1,0,0]
["10.1","Gas-phase GAC Adsorber",{"$f":"tot_GAC_beds","v":0},"units",{"$f":"IF(C255=0,\"NA\",GAC_bed_size)","v":"NA"},{"$f":"IF(C255=0,\"\",\"cu. ft\")","v":""},{"$f":"IF(C255=0,\"NA\",IF(curve=1,GAC_bed_size,VLOOKUP(GAC_bed_size,og_gac_cost_cl,2)))","v":"NA"},{"$f":"IF(C255=0,\"\",\"cu. ft\")","v":""},{"$f":"IF(C255=0,\"NA\",IF(curve=1,og_gac_eq,VLOOKUP(GAC_bed_size,og_gac_cost_cl,3)))","v":"NA"},"--",{"$f":"IF(C255=0,\"NA\",VLOOKUP(GAC_bed_size,og_gac_cost_cl,IF(ss_cat=\"large\",4,5)))","v":"NA"},null,{"$f":"$B$248&\" - \"&B255","v":"Offgas Pollution Control Equipment - Gas-phase GAC Adsorber"},{"$f":"IF(retrofit=1,$W255*X255,IF(ISBLANK(X255),\"\",X255))","v":1},1,1,1,1,1,1,1,1,0,1,1,1,1,1,1,1,1,1,{"$f":"IF(ISERROR(K255*L255),0,IF(K255<1,0,L255))","v":0},{"$f":"IF(AG255,J255/K255,0)","v":0}]
["10.2","Initial GAC Charge",{"$f":"GAC","v":0},"lbs","NA",null,"NA",null,{"$f":"IF(C256=0,\"NA\",IF(curve=1,gac_eq,VLOOKUP(GAC,gac_cost_cl,3)))","v":"NA"},"--",{"$f":"IF(C256=0,\"NA\",VLOOKUP(GAC,gac_cost_cl,IF(ss_cat=\"large\",4,5)))","v":"NA"},null,{"$f":"$B$248&\" - \"&B256","v":"Offgas Pollution Control Equipment - Initial GAC Charge"},1,1,1,1,1,1,1,1,1,0,1,1,1,1,1,1,1,1,1,{"$f":"IF(ISERROR(K256*L256),0,IF(K256<1,0,L256))","v":0},{"$f":"IF(AG256,J256/K256,0)","v":0}]
["11.","Retrofit Equipment"]
["11.1","Replacement Blowers",null,null,null,null,null,null,null,null,null,null,null,null,null,null,null,null,null,null,null,null,null,null,null,null,null,null,null,null,null,null,{"$f":"IF(ISERROR(K258*L258),0,IF(K258<1,0,L258))","v":0},{"$f":"IF(AG258,J258/K258,0)","v":0}]
["11.1.1","Centrifugal",{"$f":"IF(retrofit=1,r_tot_blowers,0)","v":0},"units",{"$f":"IF(C259=0,\"NA\",r_Q_Blower)","v":"NA"},{"$f":"IF(C259=0,\"\",\"cfm\")","v":""},{"$f":"IF(C259=0,\"NA\",IF(curve=1,r_Q_Blower,VLOOKUP(r_Q_Blower,cent_blow_cost_cl,2)))","v":"NA"},{"$f":"IF(C259=0,\"\",\"cfm\")","v":""},{"$f":"IF(C259=0,\"NA\",IF(curve=1,r_cent_blow_eq,VLOOKUP(r_Q_Blower,cent_blow_cost_cl,3)))","v":"NA"},{"$f":"IF(C259=0,\"--\",IF(I259=\"contact vendor\",\"--\",C259*I259))","v":"--"},{"$f":"IF(C259=0,\"NA\",VLOOKUP(r_Q_Blower,cent_blow_cost_cl,IF(ss_cat=\"large\",4,5)))","v":"NA"},null,{"$f":"$B$257&\" - \"&$B$258&\" - \"&B259","v":"Retrofit Equipment - Replacement Blowers - Centrifugal"},{"$f":"IF(retrofit=1,$W259*X259,IF(ISBLANK(X259),\"\",X259))","v":1},1,2,1,1,2,1,1,2,1,1,1,2,1,1,2,1,1,2,{"$f":"IF(ISERROR(K259*L259),0,IF(K259<1,0,L259))","v":0},{"$f":"IF(AG259,J259/K259,0)","v":0}]
["11.1.1","Positive Displacement",{"$f":"IF(retrofit=1,r_tot_blowers,0)","v":0},"units",{"$f":"IF(C260=0,\"NA\",r_Q_Blower)","v":"NA"},{"$f":"IF(C260=0,\"\",\"cfm\")","v":""},{"$f":"IF(C260=0,\"NA\",IF(curve=1,r_Q_Blower,VLOOKUP(r_Q_Blower,pd_blow_cost_cl,2)))","v":"NA"},{"$f":"IF(C260=0,\"\",\"cfm\")","v":""},{"$f":"IF(C260=0,\"NA\",IF(curve=1,r_pd_blow_eq,VLOOKUP(r_Q_Blower,pd_blow_cost_cl,3)))","v":"NA"},"--",{"$f":"IF(C260=0,\"NA\",VLOOKUP(r_Q_Blower,pd_blow_cost_cl,IF(ss_cat=\"large\",4,5)))","v":"NA"},null,{"$f":"$B$257&\" - \"&$B$258&\" - \"&B260","v":"Retrofit Equipment - Replacement Blowers - Positive Displacement"},2,2,1,2,2,1,2,2,1,1,2,2,1,2,2,1,2,2,1,{"$f":"IF(ISERROR(K260*L260),0,IF(K260<1,0,L260))","v":0},{"$f":"IF(AG260,J260/K260,0)","v":0}]
["11.2","Additional Packing",{"$f":"IF(retrofit=1,r_Pv_ft,0)","v":0},"cubic ft",{"$f":"IF(C261=0,\"NA\",Packing_size)","v":"NA"},{"$f":"IF(C261=0,\"\",\"inches\")","v":""},{"$f":"IF(C261=0,\"NA\",IF(alt_pack_cost=\"\",VLOOKUP(Packing_size,packing_cost_cl,2),Packing_size))","v":"NA"},{"$f":"IF(C261=0,\"\",\"inches\")","v":""},{"$f":"IF(C261=0,\"NA\",IF(alt_pack_cost=\"\",VLOOKUP(Packing_size,packing_cost_cl,3),alt_pack_cost))","v":"NA"},"--",{"$f":"IF(C261=0,\"NA\",VLOOKUP(Packing_size,packing_cost_cl,IF(ss_cat=\"large\",4,5)))","v":"NA"},null,{"$f":"$B$257&\" - \"&B261","v":"Retrofit Equipment - Additional Packing"},1,1,1,1,1,1,1,1,1,1,1,1,1,1,1,1,1,1,1,{"$f":"IF(ISERROR(K261*L261),0,IF(K261<1,0,L261))","v":0},{"$f":"IF(AG261,J261/K261,0)","v":0}]
["11.3","Additional Aeration Column Shell Section(s)"]
["11.3.1","Stainless Steel",{"$f":"IF(OR(retrofit=0,r_xtraheight=0),0,TOT_COL)","v":0},"units",{"$f":"IF(C263=0,\"NA\",r_col_vol-col_vol)","v":"NA"},{"$f":"IF(C263=0,\"\",\"gal\")","v":""},{"$f":"IF(C263=0,\"NA\",r_col_vol-col_vol)","v":"NA"},{"$f":"IF(C263=0,\"\",\"gal\")","v":""},{"$f":"IF(C263=0,\"NA\",r_ss_shell_inc)","v":"NA"},{"$f":"IF(C263=0,\"--\",IF(I263=\"contact vendor\",\"--\",C263*I263))","v":"--"},{"$f":"IF(C263=0,\"NA\",VLOOKUP(col_vol,ss_shell_cost_cl,IF(ss_cat=\"large\",4,5)))","v":"NA"},null,{"$f":"$B$257&\" - \"&$B$262&\" - \"&B263","v":"Retrofit Equipment - Additional Aeration Column Shell Section(s) - Stainless Steel"},{"$f":"IF(retrofit=1,$W263*X263,IF(ISBLANK(X263),\"\",X263))","v":3},3,1,3,3,1,3,3,1,1,3,3,1,3,3,1,3,3,1,{"$f":"IF(ISERROR(K263*L263),0,IF(K263<1,0,L263))","v":0},{"$f":"IF(AG263,J263/K263,0)","v":0}]
["11.3.1","Fiberglass",{"$f":"IF(OR(retrofit=0,r_xtraheight=0),0,TOT_COL)","v":0},"units",{"$f":"IF(C264=0,\"NA\",r_col_vol-col_vol)","v":"NA"},{"$f":"IF(C264=0,\"\",\"gal\")","v":""},{"$f":"IF(C264=0,\"NA\",r_col_vol-col_vol)","v":"NA"},{"$f":"IF(C264=0,\"\",\"gal\")","v":""},{"$f":"IF(C264=0,\"NA\",r_fg_shell_inc)","v":"NA"},"--",{"$f":"IF(C264=0,\"NA\",VLOOKUP(col_vol,fg_shell_cost_cl,IF(ss_cat=\"large\",4,5)))","v":"NA"},null,{"$f":"$B$257&\" - \"&$B$262&\" - \"&B264","v":"Retrofit Equipment - Additional Aeration Column Shell Section(s) - Fiberglass"},1,2,2,1,2,2,1,2,2,1,1,2,2,1,2,2,1,2,2,0,0]
["11.3.1","Aluminum",{"$f":"IF(OR(retrofit=0,r_xtraheight=0),0,TOT_COL)","v":0},"units",{"$f":"IF(C265=0,\"NA\",r_col_vol-col_vol)","v":"NA"},{"$f":"IF(C265=0,\"\",\"gal\")","v":""},{"$f":"IF(C265=0,\"NA\",r_col_vol-col_vol)","v":"NA"},{"$f":"IF(C265=0,\"\",\"gal\")","v":""},{"$f":"IF(C265=0,\"NA\",r_al_shell_inc)","v":"NA"},"--",{"$f":"IF(C265=0,\"NA\",VLOOKUP(col_vol,al_shell_cost_cl,IF(ss_cat=\"large\",4,5)))","v":"NA"},null,{"$f":"$B$257&\" - \"&$B$262&\" - \"&B265","v":"Retrofit Equipment - Additional Aeration Column Shell Section(s) - Aluminum"},2,1,3,2,1,3,2,1,3,1,2,1,3,2,1,3,2,1,3,0,0]
["11.4","Additional Liquid Redistributors",null,null,null,null,null,null,null,null,null,null,null,null,null,null,null,null,null,null,null,null,null,null,null,null,null,null,null,null,null,null,0,0]
["11.4.1","Stainless Steel",{"$f":"IF(OR(retrofit=0,r_xtraheight=0),0,r_tot_R)","v":0},"units",{"$f":"IF(C267=0,\"NA\",AREA)","v":"NA"},{"$f":"IF(C267=0,\"\",\"square m\")","v":""},{"$f":"IF(C267=0,\"NA\",IF(curve=1,AREA,VLOOKUP(AREA,ss_redist_cost_cl,2)))","v":"NA"},{"$f":"IF(C267=0,\"\",\"square m\")","v":""},{"$f":"IF(C267=0,\"NA\",IF(curve=1,ss_redist_eq,VLOOKUP(AREA,ss_redist_cost_cl,3)))","v":"NA"},{"$f":"IF(C267=0,\"--\",IF(I267=\"contact vendor\",\"--\",C267*I267))","v":"--"},{"$f":"IF(C267=0,\"NA\",VLOOKUP(AREA,ss_redist_cost_cl,IF(ss_cat=\"large\",4,5)))","v":"NA"},null,{"$f":"$B$257&\" - \"&$B$266&\" - \"&B267","v":"Retrofit Equipment - Additional Liquid Redistributors - Stainless Steel"},{"$f":"IF(retrofit=1,$W267*X267,IF(ISBLANK(X267),\"\",X267))","v":2},1,1,2,1,1,2,1,1,1,2,1,1,2,1,1,2,1,1,0,0]
["11.4.1","Plastic",{"$f":"IF(OR(retrofit=0,r_xtraheight=0),0,r_tot_R)","v":0},"units",{"$f":"IF(C268=0,\"NA\",AREA)","v":"NA"},{"$f":"IF(C268=0,\"\",\"square m\")","v":""},{"$f":"IF(C268=0,\"NA\",IF(curve=1,AREA,VLOOKUP(AREA,pl_redist_cost_cl,2)))","v":"NA"},{"$f":"IF(C268=0,\"\",\"square m\")","v":""},{"$f":"IF(C268=0,\"NA\",IF(curve=1,pl_redist_eq,VLOOKUP(AREA,pl_redist_cost_cl,3)))","v":"NA"},"--",{"$f":"IF(C268=0,\"NA\",VLOOKUP(AREA,pl_redist_cost_cl,IF(ss_cat=\"large\",4,5)))","v":"NA"},null,{"$f":"$B$257&\" - \"&$B$266&\" - \"&B268","v":"Retrofit Equipment - Additional Liquid Redistributors - Plastic"},1,2,2,1,2,2,1,2,2,1,1,2,2,1,2,2,1,2,2,0,0]
["11.5","Additional Process Piping",null,null,null,null,null,null,null,null,null,null,null,null,null,null,null,null,null,null,null,null,null,null,null,null,null,null,null,null,null,null,0,0]
["11.5.1","Ductile Iron",{"$f":"IF(retrofit=1,r_proc_pipe_length,0)","v":0},"lf",{"$f":"IF(C270=0,\"NA\",proc_pipe_diam)","v":"NA"},{"$f":"IF(C270=0,\"\",\"in. diam\")","v":""},{"$f":"IF(C270=0,\"NA\",IF(curve=1,proc_pipe_diam,VLOOKUP(proc_pipe_diam,di_pipe_cost_cl,2)))","v":"NA"},{"$f":"IF(C270=0,\"\",\"in. diam\")","v":""},{"$f":"IF(C270=0,\"NA\",IF(curve=1,di_pipe_eq_in,VLOOKUP(proc_pipe_diam,di_pipe_cost_cl,3)))","v":"NA"},{"$f":"IF(C270=0,\"--\",IF(I270=\"contact vendor\",\"--\",C270*I270))","v":"--"},{"$f":"IF(C270=0,\"NA\",VLOOKUP(proc_pipe_diam,di_pipe_cost_cl,IF(ss_cat=\"large\",4,5)))","v":"NA"},null,{"$f":"$B$257&\" - \"&$B$269&\" - \"&B270","v":"Retrofit Equipment - Additional Process Piping - Ductile Iron"},{"$f":"IF(retrofit=1,$W270*X270,IF(ISBLANK(X270),\"\",X270))","v":3},3,3,3,3,3,3,3,3,1,3,3,3,3,3,3,3,3,3,0,0]
["11.5.1","CPVC",{"$f":"IF(retrofit=1,r_proc_pipe_length,0)","v":0},"lf",{"$f":"IF(C271=0,\"NA\",proc_pipe_diam)","v":"NA"},{"$f":"IF(C271=0,\"\",\"in. diam\")","v":""},{"$f":"IF(C271=0,\"NA\",IF(curve=1,proc_pipe_diam,VLOOKUP(proc_pipe_diam,cpvc_pipe_cost_cl,2)))","v":"NA"},{"$f":"IF(C271=0,\"\",\"in. diam\")","v":""},{"$f":"IF(C271=0,\"NA\",IF(curve=1,cpvc_pipe_eq_in,VLOOKUP(proc_pipe_diam,cpvc_pipe_cost_cl,3)))","v":"NA"},"--",{"$f":"IF(C271=0,\"NA\",VLOOKUP(proc_pipe_diam,cpvc_pipe_cost_cl,IF(ss_cat=\"large\",4,5)))","v":"NA"},null,{"$f":"$B$257&\" - \"&$B$269&\" - \"&B271","v":"Retrofit Equipment - Additional Process Piping - CPVC"},2,1,4,2,1,4,2,1,4,1,2,1,4,2,1,4,2,1,4,0,0]
["11.5.1","PVC",{"$f":"IF(retrofit=1,r_proc_pipe_length,0)","v":0},"lf",{"$f":"IF(C272=0,\"NA\",proc_pipe_diam)","v":"NA"},{"$f":"IF(C272=0,\"\",\"in. diam\")","v":""},{"$f":"IF(C272=0,\"NA\",IF(curve=1,proc_pipe_diam,VLOOKUP(proc_pipe_diam,pvc_pipe_cost_cl,2)))","v":"NA"},{"$f":"IF(C272=0,\"\",\"in. diam\")","v":""},{"$f":"IF(C272=0,\"NA\",IF(curve=1,pvc_pipe_eq_in,VLOOKUP(proc_pipe_diam,pvc_pipe_cost_cl,3)))","v":"NA"},"--",{"$f":"IF(C272=0,\"NA\",VLOOKUP(proc_pipe_diam,pvc_pipe_cost_cl,IF(ss_cat=\"large\",4,5)))","v":"NA"},null,{"$f":"$B$257&\" - \"&$B$269&\" - \"&B272","v":"Retrofit Equipment - Additional Process Piping - PVC"},1,2,5,1,2,5,1,2,5,1,1,2,5,1,2,5,1,2,5,0,0]
["11.5.1","Stainless Steel",{"$f":"IF(retrofit=1,r_proc_pipe_length,0)","v":0},"lf",{"$f":"IF(C273=0,\"NA\",proc_pipe_diam)","v":"NA"},{"$f":"IF(C273=0,\"\",\"in. diam\")","v":""},{"$f":"IF(C273=0,\"NA\",IF(curve=1,proc_pipe_diam,VLOOKUP(proc_pipe_diam,ss_pipe_cost_cl,2)))","v":"NA"},{"$f":"IF(C273=0,\"\",\"in. diam\")","v":""},{"$f":"IF(C273=0,\"NA\",IF(curve=1,ss_pipe_eq_in,VLOOKUP(proc_pipe_diam,ss_pipe_cost_cl,3)))","v":"NA"},"--",{"$f":"IF(C273=0,\"NA\",VLOOKUP(proc_pipe_diam,ss_pipe_cost_cl,IF(ss_cat=\"large\",4,5)))","v":"NA"},null,{"$f":"$B$257&\" - \"&$B$269&\" - \"&B273","v":"Retrofit Equipment - Additional Process Piping - Stainless Steel"},5,5,1,5,5,1,5,5,1,1,5,5,1,5,5,1,5,5,1,0,0]
["11.5.1","Steel",{"$f":"IF(retrofit=1,r_proc_pipe_length,0)","v":0},"lf",{"$f":"IF(C274=0,\"NA\",proc_pipe_diam)","v":"NA"},{"$f":"IF(C274=0,\"\",\"in. diam\")","v":""},{"$f":"IF(C274=0,\"NA\",IF(curve=1,proc_pipe_diam,VLOOKUP(proc_pipe_diam,st_pipe_cost_cl,2)))","v":"NA"},{"$f":"IF(C274=0,\"\",\"in. diam\")","v":""},{"$f":"IF(C274=0,\"NA\",IF(curve=1,st_pipe_eq_in,VLOOKUP(proc_pipe_diam,st_pipe_cost_cl,3)))","v":"NA"},"--",{"$f":"IF(C274=0,\"NA\",VLOOKUP(proc_pipe_diam,st_pipe_cost_cl,IF(ss_cat=\"large\",4,5)))","v":"NA"},null,{"$f":"$B$257&\" - \"&$B$269&\" - \"&B274","v":"Retrofit Equipment - Additional Process Piping - Steel"},{"$f":"IF(retrofit=1,$W274*X274,IF(ISBLANK(X274),\"\",X274))","v":4},4,2,4,4,2,4,4,2,1,4,4,2,4,4,2,4,4,2,0,0]
[12,"Building Structures and HVAC",null,null,null,null,null,null,null,null,null,null,null,null,null,null,null,null,null,null,null,null,null,null,null,null,null,null,null,null,null,null,0,0]
["12.1","Building 1",null,null,null,null,null,null,null,null,null,null,null,null,null,null,null,null,null,null,null,null,null,null,null,null,null,null,null,null,null,null,0,0]
["12.1.1","Small Low Cost Shed",{"$f":"IF(total_fp<500,1,0)","v":1},"units",{"$f":"total_fp","v":190},"sf",{"$f":"total_fp","v":190},"sf",{"$f":"IF(C277=0,\"NA\",VLOOKUP(total_fp,bldg_shed_cost_cl,3))","v":41.981048759611276},{"$f":"IF(OR(I277=\"NA\",I277=\"contact vendor\"),\"--\",G277*I277)","v":7976.3992643261427},{"$f":"IF($C277=0,\"N/A\",VLOOKUP(total_fp,bldg_shed_cost_cl,IF(ss_cat=\"large\",4,5)))","v":20},1,{"$f":"B275&\" - \"&B276&\" - \"&B277","v":"Building Structures and HVAC - Building 1 - Small Low Cost Shed"},{"$f":"IF(retrofit=1,$W277*X277,IF(ISBLANK(X277),\"\",X277))","v":2},2,2,2,2,2,2,2,2,0,{"$f":"IF(include_buildings=1,2,0)","v":2},2,2,2,2,2,2,2,2,1,398.81996321630714,{"$f":"IF(AG277,K277,0)","v":20}]
["12.1.1","Low Quality",{"$f":"IF(total_fp>=500,1,0)","v":0},"units",{"$f":"total_fp","v":190},"sf",{"$f":"total_fp","v":190},"sf",{"$f":"IF(C278=0,\"NA\",IF(curve=1,bldg_lo_eq_1,VLOOKUP(total_fp, bldg_lo_cost_cl,3)))","v":"NA"},{"$f":"IF(OR(I278=\"NA\",I278=\"contact vendor\"),\"--\",G278*I278)","v":"--"},{"$f":"IF($C278=0,\"N/A\",VLOOKUP(total_fp,bldg_lo_cost_cl,IF(ss_cat=\"large\",4,5)))","v":"N/A"},0,{"$f":"B275&\" - \"&B276&\" - \"&B278","v":"Building Structures and HVAC - Building 1 - Low Quality"},1,"","",1,"","",1,"","",0,{"$f":"include_buildings","v":1},null,null,{"$f":"include_buildings","v":1},null,null,{"$f":"include_buildings","v":1},null,null,0,0,0]
["12.1.1","Medium Quality",{"$f":"IF(total_fp>=500,1,0)","v":0},"units",{"$f":"total_fp","v":190},"sf",{"$f":"total_fp","v":190},"sf",{"$f":"IF(C279=0,\"NA\",IF(curve=1,bldg_mid_eq_1,VLOOKUP(total_fp, bldg_mid_cost_cl,3)))","v":"NA"},{"$f":"IF(OR(I279=\"NA\",I279=\"contact vendor\"),\"--\",G279*I279)","v":"--"},{"$f":"IF($C279=0,\"N/A\",VLOOKUP(total_fp,bldg_mid_cost_cl,IF(ss_cat=\"large\",4,5)))","v":"N/A"},0,{"$f":"B275&\" - \"&B276&\" - \"&B279","v":"Building Structures and HVAC - Building 1 - Medium Quality"},"",1,"","",1,"","",1,"",0,null,{"$f":"include_buildings","v":1},null,null,{"$f":"include_buildings","v":1},null,null,{"$f":"include_buildings","v":1},null,0,0,0]
["12.1.1","High Quality",{"$f":"IF(total_fp>=500,1,0)","v":0},"units",{"$f":"total_fp","v":190},"sf",{"$f":"total_fp","v":190},"sf",{"$f":"IF(C280=0,\"NA\",IF(curve=1,bldg_hi_eq_1,VLOOKUP(total_fp, bldg_hi_cost_cl,3)))","v":"NA"},{"$f":"IF(OR(I280=\"NA\",I280=\"contact vendor\"),\"--\",G280*I280)","v":"--"},{"$f":"IF($C280=0,\"N/A\",VLOOKUP(total_fp,bldg_hi_cost_cl,IF(ss_cat=\"large\",4,5)))","v":"N/A"},0,{"$f":"B275&\" - \"&B276&\" - \"&B280","v":"Building Structures and HVAC - Building 1 - High Quality"},"","",1,"","",1,"","",1,0,null,null,{"$f":"include_buildings","v":1},null,null,{"$f":"include_buildings","v":1},null,null,{"$f":"include_buildings","v":1},0,0,0]
["12.2",{"$f":"\"Heating System\"&IF(build1_heat=\"heat pump\",\" (included with cooling system)\",\"\")","v":"Heating System"},null,null,null,null,null,null,null,null,null,null,null,null,null,null,null,null,null,null,null,null,null,null,null,null,null,null,null,null,null,null,0,0,0]
["12.2.1","Electric resistance",{"$f":"IF(build1_heat=\"heat pump\",\"NA\",IF(build1_need_heat,build1_zones,\"NA\"))","v":"NA"},{"$f":"IF(C282=\"NA\",\"\",\"zones\")","v":""},{"$f":"IF(C282=\"NA\",\"NA\",build1_heat_mbh)","v":"NA"},{"$f":"IF(C282=\"NA\",\"\",\"MBH\")","v":""},{"$f":"IF(C282=\"NA\",\"NA\",IF(curve=1,build1_heat_mbh,VLOOKUP(build1_heat_mbh,hvac_elec_cost_cl,2)))","v":"NA"},{"$f":"IF(C282=\"NA\",\"\",\"MBH\")","v":""},{"$f":"IF(C282=\"NA\",\"NA\",IF(curve=1,hvac_elec_eq_1,VLOOKUP(build1_heat_mbh,hvac_elec_cost_cl,3)))","v":"NA"},{"$f":"IF(OR(I282=\"NA\",I282=\"contact vendor\"),\"--\",C282*I282)","v":"--"},{"$f":"IF(C282=\"NA\",\"NA\",VLOOKUP(build1_heat_mbh,hvac_elec_cost_cl,IF(ss_cat=\"large\",4,5)))","v":"NA"},null,{"$f":"B275&\" - \"&B276&\" - \"&B281&\" - \"&B282","v":"Building Structures and HVAC - Building 1 - Heating System - Electric resistance"},{"$f":"IF(retrofit=1,0,IF(ISBLANK(X282),\"\",X282))","v":""},"","","","","","","","",0,{"$f":"IF(build1_heat=$B282,1,\"\")","v":""},"","","","","",{"$f":"IF(build1_heat=$B282,1,\"\")","v":""},"","",0,0,0]
["12.2.1","Natural gas non-condensing furnace",{"$f":"IF(build1_heat=\"heat pump\",\"NA\",IF(build1_need_heat,build1_zones,\"NA\"))","v":"NA"},{"$f":"IF(C283=\"NA\",\"\",\"zones\")","v":""},{"$f":"IF(C283=\"NA\",\"NA\",build1_heat_mbh)","v":"NA"},{"$f":"IF(C283=\"NA\",\"\",\"MBH\")","v":""},{"$f":"IF(C283=\"NA\",\"NA\",IF(curve=1,build1_heat_mbh,VLOOKUP(build1_heat_mbh,hvac_gas_non_cost_cl,2)))","v":"NA"},{"$f":"IF(C283=\"NA\",\"\",\"MBH\")","v":""},{"$f":"IF(C283=\"NA\",\"NA\",IF(curve=1,hvac_gas_non_eq_1,VLOOKUP(build1_heat_mbh,hvac_gas_non_cost_cl,3)))","v":"NA"},{"$f":"IF(OR(I283=\"NA\",I283=\"contact vendor\"),\"--\",C283*I283)","v":"--"},{"$f":"IF(C283=\"NA\",\"NA\",VLOOKUP(build1_heat_mbh,hvac_gas_non_cost_cl,IF(ss_cat=\"large\",4,5)))","v":"NA"},null,{"$f":"B275&\" - \"&B276&\" - \"&B281&\" - \"&B283","v":"Building Structures and HVAC - Building 1 - Heating System - Natural gas non-condensing furnace"},"","","","","","","","","",0,"","","","","","","","","",0,0,0]
["12.2.1","Natural gas condensing furnace",{"$f":"IF(build1_heat=\"heat pump\",\"NA\",IF(build1_need_heat,build1_zones,\"NA\"))","v":"NA"},{"$f":"IF(C284=\"NA\",\"\",\"zones\")","v":""},{"$f":"IF(C284=\"NA\",\"NA\",build1_heat_mbh)","v":"NA"},{"$f":"IF(C284=\"NA\",\"\",\"MBH\")","v":""},{"$f":"IF(C284=\"NA\",\"NA\",IF(curve=1,build1_heat_mbh,VLOOKUP(build1_heat_mbh,hvac_gas_cost_cl,2)))","v":"NA"},{"$f":"IF(C284=\"NA\",\"\",\"MBH\")","v":""},{"$f":"IF(C284=\"NA\",\"NA\",IF(curve=1,hvac_gas_eq_1,VLOOKUP(build1_heat_mbh,hvac_gas_cost_cl,3)))","v":"NA"},{"$f":"IF(OR(I284=\"NA\",I284=\"contact vendor\"),\"--\",C284*I284)","v":"--"},{"$f":"IF(C284=\"NA\",\"NA\",VLOOKUP(build1_heat_mbh,hvac_gas_cost_cl,IF(ss_cat=\"large\",4,5)))","v":"NA"},null,{"$f":"B275&\" - \"&B276&\" - \"&B281&\" - \"&B284","v":"Building Structures and HVAC - Building 1 - Heating System - Natural gas condensing furnace"},"","","","","","","","","",0,"","","","","","","","","",0,0,0]
["12.2.1","Standard efficiency oil furnace",{"$f":"IF(build1_heat=\"heat pump\",\"NA\",IF(build1_need_heat,build1_zones,\"NA\"))","v":"NA"},{"$f":"IF(C285=\"NA\",\"\",\"zones\")","v":""},{"$f":"IF(C285=\"NA\",\"NA\",build1_heat_mbh)","v":"NA"},{"$f":"IF(C285=\"NA\",\"\",\"MBH\")","v":""},{"$f":"IF(C285=\"NA\",\"NA\",IF(curve=1,build1_heat_mbh,VLOOKUP(E285,hvac_oil_std_cost_cl,2)))","v":"NA"},{"$f":"IF(C285=\"NA\",\"\",\"MBH\")","v":""},{"$f":"IF(C285=\"NA\",\"NA\",IF(curve=1,hvac_oil_std_eq_1,VLOOKUP(build1_heat_mbh,hvac_oil_std_cost_cl,3)))","v":"NA"},{"$f":"IF(OR(I285=\"NA\",I285=\"contact vendor\"),\"--\",C285*I285)","v":"--"},{"$f":"IF(C285=\"NA\",\"NA\",VLOOKUP(build1_heat_mbh,hvac_oil_std_cost_cl,IF(ss_cat=\"large\",4,5)))","v":"NA"},null,{"$f":"B275&\" - \"&B276&\" - \"&B281&\" - \"&B285","v":"Building Structures and HVAC - Building 1 - Heating System - Standard efficiency oil furnace"},"","","","","","","","","",0,"","","","","","","","","",0,0,0]
["12.2.1","Mid-efficiency oil furnace",{"$f":"IF(build1_heat=\"heat pump\",\"NA\",IF(build1_need_heat,build1_zones,\"NA\"))","v":"NA"},{"$f":"IF(C286=\"NA\",\"\",\"zones\")","v":""},{"$f":"IF(C286=\"NA\",\"NA\",build1_heat_mbh)","v":"NA"},{"$f":"IF(C286=\"NA\",\"\",\"MBH\")","v":""},{"$f":"IF(C286=\"NA\",\"NA\",IF(curve=1,build1_heat_mbh,VLOOKUP(build1_heat_mbh,hvac_oil_mid_cost_cl,2)))","v":"NA"},{"$f":"IF(C286=\"NA\",\"\",\"MBH\")","v":""},{"$f":"IF(C286=\"NA\",\"NA\",IF(curve=1,hvac_oil_mid_eq_1,VLOOKUP(build1_heat_mbh,hvac_oil_mid_cost_cl,3)))","v":"NA"},{"$f":"IF(OR(I286=\"NA\",I286=\"contact vendor\"),\"--\",C286*I286)","v":"--"},{"$f":"IF(C286=\"NA\",\"NA\",VLOOKUP(build1_heat_mbh,hvac_oil_mid_cost_cl,IF(ss_cat=\"large\",4,5)))","v":"NA"},null,{"$f":"B275&\" - \"&B276&\" - \"&B281&\" - \"&B286","v":"Building Structures and HVAC - Building 1 - Heating System - Mid-efficiency oil furnace"},"","","","","","","","","",0,{"$f":"IF(build1_heat=$B286,1,\"\")","v":""},"","","","","","","","",0,0,0]
["12.3",{"$f":"IF(build1_heat=\"heat pump\",\"Heating and \",\"\")&\"Cooling System\"","v":"Cooling System"},null,null,null,null,null,null,null,null,null,null,null,null,null,null,null,null,null,null,null,null,null,null,null,null,null,null,null,null,null,null,0,0,0]
["12.3.1","Air conditioner",{"$f":"IF(build1_need_cool,build1_zones,\"NA\")","v":"NA"},{"$f":"IF(C288=\"NA\",\"\",\"zones\")","v":""},{"$f":"IF(C288=\"NA\",\"NA\",build1_cooling_tons)","v":"NA"},{"$f":"IF(C288=\"NA\",\"\",\"tons\")","v":""},{"$f":"IF(C288=\"NA\",\"NA\",IF(curve=1,build1_cooling_tons,VLOOKUP(build1_cooling_tons,hvac_ac_cost_cl,2)))","v":"NA"},{"$f":"IF(C288=\"NA\",\"\",\"tons\")","v":""},{"$f":"IF(C288=\"NA\",\"NA\",IF(curve=1,hvac_ac_eq_1,VLOOKUP(build1_cooling_tons,hvac_ac_cost_cl,3)))","v":"NA"},{"$f":"IF(OR(I288=\"NA\",I288=\"contact vendor\"),\"--\",C288*I288)","v":"--"},{"$f":"IF(C288=\"NA\",\"NA\",VLOOKUP(build1_cooling_tons,hvac_ac_cost_cl,IF(ss_cat=\"large\",4,5)))","v":"NA"},null,{"$f":"B275&\" - \"&B276&\" - \"&B287&\" - \"&B288","v":"Building Structures and HVAC - Building 1 - Cooling System - Air conditioner"},{"$f":"IF(retrofit=1,0,IF(ISBLANK(X288),\"\",X288))","v":""},"","","","","","","","",0,{"$f":"IF(build1_cool=$B288,1,\"\")","v":""},"","","","","",{"$f":"IF(build1_cool=$B288,1,\"\")","v":""},"","",0,0,0]
["12.3.1","Heat pump",{"$f":"IF(AND(hp_ok_1,build1_need_cool),build1_zones,\"NA\")","v":"NA"},{"$f":"IF(C289=\"NA\",\"\",\"zones\")","v":""},{"$f":"IF(C289=\"NA\",\"NA\",build1_cooling_tons)","v":"NA"},{"$f":"IF(C289=\"NA\",\"\",\"tons\")","v":""},{"$f":"IF(C289=\"NA\",\"NA\",IF(curve=1,build1_cooling_tons,VLOOKUP(build1_cooling_tons,hvac_hp_cost_cl,2)))","v":"NA"},{"$f":"IF(C289=\"NA\",\"\",\"tons\")","v":""},{"$f":"IF(C289=\"NA\",\"NA\",IF(curve=1,hvac_hp_eq_1,VLOOKUP(build1_cooling_tons,hvac_hp_cost_cl,3)))","v":"NA"},{"$f":"IF(OR(I289=\"NA\",I289=\"contact vendor\"),\"--\",C289*I289)","v":"--"},{"$f":"IF(C289=\"NA\",\"NA\",VLOOKUP(build1_cooling_tons,hvac_hp_cost_cl,IF(ss_cat=\"large\",4,5)))","v":"NA"},null,{"$f":"B275&\" - \"&B276&\" - \"&B287&\" - \"&B289","v":"Building Structures and HVAC - Building 1 - Cooling System - Heat pump"},"","","","","","","","","",0,"","","","","","","","","",0,0,0]
["12.4","Concrete Pad",1,"units",{"$f":"conc_pad","v":4.6666666666666661},"cy",{"$f":"conc_pad","v":4.6666666666666661},"cy",{"$f":"VLOOKUP(0,conc_pad_cost_cl,3)","v":586.52146912500018},{"$f":"IF(I290=\"contact vendor\",\"--\",E290*I290)","v":2737.1001892500003},{"$f":"VLOOKUP(0,conc_pad_cost_cl,IF(ss_cat=\"large\",4,5))","v":37},1,{"$f":"B275&\" - \"&B290","v":"Building Structures and HVAC - Concrete Pad"},{"$f":"IF(retrofit=1,$W290*X290,IF(ISBLANK(X290),\"\",X290))","v":1},1,1,1,1,1,1,1,1,0,{"$f":"include_pad","v":1},1,1,1,1,1,1,1,1,1,73.975680790540551,37]
[null,null,null,null,null,null,null,null,null,null,null,null,null,null,null,null,null,null,null,null,null,null,null,null,null,null,null,null,null,null,null,null,"direct_for_UL","total_direct_depreciation","build_UL"]
["Total of direct line items above:",null,null,null,null,null,null,null,null,null,null,null,null,null,null,null,null,null,null,null,null,null,null,null,null,null,null,null,null,null,null,null,{"$f":"SUMPRODUCT(AG33:AG290,J33:J290)","v":190037.75204161817},{"$f":"SUM(AH33:AH290)","v":10979.084146012634},{"$f":"MAX(AI277:AI280)","v":20}]
[null,"Direct cost category","Total","Guidance"]
[null,"Process costs",{"$f":"SUMPRODUCT(J33:J275,L33:L275)","v":179344.80290606228},"Excludes alternate cost line items in italics, without a 1 in the \"Use?\" column. Includes installation, transportation, and O&P"]
[null,"Building costs",{"$f":"SUMPRODUCT(J277:J290,L277:L290)","v":10713.499453576143},"See indirect assumptions sheet to exclude buildings"]
[null,{"$f":"\"Total direct costs\"&IF(retrofit=1,\" for retrofit\",\"\")","v":"Total direct costs"},{"$f":"process_cost+building_cost","v":190058.30235963842},"Total of process and building costs"]
[]
["Add-on Cost Details (See indirect assumptions sheet to exclude individual add-on items)"]
[null,"Add-on Line Item","Total","Guidance"]
[null,"Permits",{"$f":"include_permits*permit_cost","v":{"$error":"#NAME?"}}]
[null,"Pilot Study",{"$f":"include_pilot*VLOOKUP(tech_name,CHOOSE(ss_cat2,pilot_cost_small_cl,pilot_cost_medium_cl,pilot_cost_large_cl),2,FALSE)","v":0},"No pilot study required for this technology"]
[null,"Land Cost",{"$f":"IF(retrofit=1,0,include_land*land_required*land_cost)","v":1386.5856969896595},{"$f":"IF(retrofit=1,\"Not required for retrofit\",\"For \"&TEXT(land_required,\"#0.00\")&\" acres\")","v":"For 0.06 acres"}]
[null,{"$f":"\"Total add-on costs\"&IF(retrofit=1,\" for retrofit\",\"\")","v":"Total add-on costs"},{"$f":"SUM(C300:C302)","v":{"$error":"#NAME?"}},"Total of permits, piloting, and land"]
[]
["Indirect Capital Cost Details (See indirect assumptions sheet to exclude individual indirect items)"]
[null,"Indirect Line Item","Total","Percent"]
[null,"Mobilization and Demobilization",{"$f":"(direct_cost+C309+C310+C311+C312+C313+C314+C315+C318)*D307","v":11740.075390067315},{"$f":"CHOOSE(ss_cat2,mob_pct_small,mob_pct_medium,mob_pct_large)","v":0.05}]
[null,"Architectural Fees for Treatment Building",{"$f":"IF(ss_cat2=1,include_arch_small,include_arch)*building_cost*D308","v":0},{"$f":"VLOOKUP(building_cost,architectural_table_cl,3)","v":0.09},{"$f":"IF(retrofit=1,\"No new building for retrofit\",\"Excluded by default for small systems\")","v":"Excluded by default for small systems"}]
[null,"Installation, Transportatation, and O&P",{"$f":"direct_cost*D309","v":0},{"$f":"inst_pct","v":0}]
[null,"Site Work",{"$f":"IF(retrofit=1,0,include_sitework*sitework_cost)","v":4628.3999999999996},null,{"$f":"IF(retrofit=1,\"Not required for retrofit\",\"Calculated based on system requirements.\")","v":"Calculated based on system requirements."}]
[null,"Yard Piping",{"$f":"IF(retrofit=1,0,include_yardpipe*yard_cost)","v":1175.4030632859467},null,{"$f":"IF(retrofit=1,\"Not required for retrofit\",\"Calculated based on system requirements.\")","v":"Calculated based on system requirements."}]
[null,"Geotechnical",{"$f":"IF(retrofit=1,0,IF(AW_DET<>0,1,IF(component_level=\"\",include_geo_low,IF(component_level=1,include_geo_medium,include_geo_high)))*geotech_cost)","v":1999.0918518518517},null,{"$f":"IF(retrofit=1,\"Not required for retrofit\",\"Calculated based on system requirements.\")","v":"Calculated based on system requirements."}]
[null,"Standby Power",{"$f":"IF(ss_cat2=1,include_standby_small,include_standby)*IF(retrofit=1,r_std_power_cost,std_power_cost)","v":0},null,"Calculated based on system requirements. Excluded by default for small systems."]
[null,"Electrical (including yard wiring)",{"$f":"process_cost*D314","v":17934.480290606229},{"$f":"elect_pct","v":0.1},"Percentage is applied only to process cost. Building direct costs include electrical components."]
[null,"Instrumentation and Control",{"$f":"direct_cost*D315","v":0},{"$f":"i_c_pct","v":0}]
[null,"Contingency",{"$f":"IF(component_level=\"\",include_conting_low,IF(component_level=1,include_conting_medium,include_conting_high))*(direct_cost+addon_cost+SUM(C307:C315,C317:C322))*D316","v":{"$error":"#NAME?"}},{"$f":"IF(component_level=\"\",include_conting_low,IF(component_level=1,include_conting_medium,include_conting_high))*VLOOKUP(direct_cost,contingency_table_cl,3)*complexity","v":0},"Included for high cost systems only."]
[null,"Process Engineering",38011.660471927687,{"$f":"CHOOSE(ss_cat2,eng_pct_small,eng_pct_medium,eng_pct_large)","v":0.2}]
[null,"Miscellaneous Allowance",19005.830235963844,{"$f":"misc_pct","v":0.1}]
[null,"Legal, Fiscal, and Administrative",3801.1660471927685,{"$f":"legal_pct","v":0.02}]
[null,"Sales Tax",0,{"$f":"tax_pct","v":0}]
[null,"Financing during Construction",{"$f":"direct_cost*D321","v":0},{"$f":"IF(ss_cat2=1,finance_pct_small,finance_pct)","v":0}]
[null,"Construction Management and GC Overhead",{"$f":"cm_cost","v":21602.319975784801}]
[null,{"$f":"\"Total indirect capital cost\"&IF(retrofit=1,\" for retrofit\",\"\")","v":"Total indirect capital cost"},{"$f":"indirect_cost_mult*direct_cost+indirect_cost_add","v":{"$error":"#NAME?"}},null,"Total of indirect line items"]
[]
["TOTAL CAPITAL COST DETAILS"]
[null,"Assumption","Value","Guidance"]
[null,"City Index",1,"User adjustable. Can be used to adjust estimated costs to be more reflective of a specific geographical location"]
[]
[null,"Capital Cost Category","Total"]
[null,"Total Direct Capital Cost (from above)",{"$f":"direct_cost","v":190058.30235963842}]
[null,"Total Add-on Cost (from above)",{"$f":"addon_cost","v":{"$error":"#NAME?"}}]
[null,"Total Indirect Cost (from above)",{"$f":"C323","v":{"$error":"#NAME?"}}]
[null,"Grand total capital cost (incorporating city index)",{"$f":"(direct_cost*(1+SUM(cul_indir_mult_table))+SUM(cul_indir_add_table))*C327","v":{"$error":"#NAME?"}}]
[]
["Annual Operating and Maintenance Cost Details (items in italics, without a 1 in the \"Use?\" column, represent alternate costs and are excluded from total)"]
[null,"Item","Quantity",null,"Unit Cost",null,"Total Cost ($/yr)","Use?","Guidance"]
[null,"Labor"]
[null,"Manager",{"$f":"Manager_LOE","v":22.835583333333336},"hrs/yr",{"$f":"VLOOKUP(design_flow,labor_table_cl,5)","v":40.849385314518059},"/hr",{"$f":"C338*E338","v":932.81954246512009},{"$f":"IF(retrofit=1,0,1)","v":1}]
[null,"Administrative",{"$f":"Clerical_LOE","v":22.835583333333336},"hrs/yr",{"$f":"VLOOKUP(design_flow,labor_table_cl,6)","v":27.519968906960059},"/hr",{"$f":"C339*E339","v":628.43454330562872},{"$f":"IF(retrofit=1,0,1)","v":1}]
[null,{"$f":"IF(retrofit=1,\"Incremental operator labor\",\"Operator\")","v":"Operator"},{"$f":"IF(retrofit=1,r_blower_labor,Operator_LOE)","v":228.35583333333335},"hrs/yr",{"$f":"VLOOKUP(design_flow,labor_table_cl,4)","v":28.817737383401102},"/hr",{"$f":"C340*E340","v":6580.6984349677123},1,"Includes labor for regular operations, maintenance, etc."]
[null,"Materials"]
[null,{"$f":"IF(retrofit=1,\"Incremental materials for PTA\",\"Materials for PTA\")","v":"Materials for PTA"},"calculated as a percentage of capital",null,null,null,{"$f":"IF(retrofit=1,r_pta_materials,pta_materials)","v":2460.7300101643086},1]
[null,"Materials for clearwell","calculated as a percentage of capital",null,null,null,{"$f":"tank_materials","v":35.593451325000011},{"$f":"IF(retrofit=1,0,1)","v":1}]
[null,"Materials for booster pumps","calculated as a percentage of capital",null,null,null,{"$f":"IF(ISERROR(pump_materials),\"contact vendor\",pump_materials)","v":119.20752210585357},1]
[null,{"$f":"IF(retrofit=1,\"Incremental materials for blowers\",\"Materials for blowers\")","v":"Materials for blowers"},"calculated as a percentage of capital",null,null,null,{"$f":"IF(retrofit=1,r_blow_materials,blow_materials)","v":561.8587615465334},1]
[null,"Facility maintenance (materials and labor)",{"$f":"total_fp","v":190},"sf",{"$f":"G346/C346","v":5.2250562508969765},"/sf/yr",{"$f":"bldg_maint_cost","v":992.76068767042557},{"$f":"IF(retrofit=1,0,1)","v":1}]
[null,"Media and Chemicals"]
[null,{"$f":"CHOOSE(chem_type,\"Corrosion control chemical\",\"Sodium Hexametaphosphate\",\"Tetrasodium Polyphosphate\")","v":"Sodium Hexametaphosphate"},{"$f":"IF(chem_type=1,0,cc_yr)","v":106.54350000000002},"lbs/yr",{"$f":"IF(chem_type=1,0,VLOOKUP(B348,chem_cost_cl,3,FALSE))","v":2.3467303894317206},"/lb",{"$f":"E348*C348","v":250.02886924641859},{"$f":"IF(retrofit=1,0,IF(C348=0,0,1))","v":1}]
[null,{"$f":"CHOOSE(acid_type,\"\",\"Hydrochloric Acid\",\"Sulfuric Acid\")","v":""},{"$f":"HCl_yr","v":0},"lbs/yr",{"$f":"IF(C349=0,0,VLOOKUP(B349,chem_cost_cl,3,FALSE))","v":0},"/lb",{"$f":"E349*C349","v":0},{"$f":"IF(retrofit=1,0,IF(C349=0,0,1))","v":0}]
[null,{"$f":"CHOOSE(acid_type,\"\",\"Sodium Hydroxide\",\"Sodium Hydroxide\")","v":""},{"$f":"NaOH_yr","v":0},"lbs/yr",{"$f":"IF(C349=0,0,VLOOKUP(B350,chem_cost_cl,3,FALSE))","v":0},"/lb",{"$f":"E350*C350","v":0},{"$f":"IF(retrofit=1,0,IF(C350=0,0,1))","v":0}]
[null,{"$f":"IF(Offgas_Tech=1,IF(og_opt2=0,\"Replacement virgin GAC\",\"Makeup GAC\"),\"\")","v":""},{"$f":"GAC_makeup","v":0},"lbs/yr",{"$f":"IF(Offgas_Tech=1,IF(curve=1,replace_gac_eq,VLOOKUP(GAC_makeup_cf,gac_cost_cl,3)),0)","v":0},"/lb",{"$f":"E351*C351","v":0},{"$f":"IF(retrofit=1,0,IF(C351=0,0,1))","v":0}]
[null,{"$f":"IF(AND(Offgas_Tech=1,og_opt2=1),\"Off-site GAC regeneration\",\"\")","v":""},{"$f":"IF(AND(Offgas_Tech=1,og_opt2=1),regen_yr,0)","v":0},"lbs/yr",{"$f":"IF(AND(Offgas_Tech=1,og_opt2=1),IF(curve=1,off_regen_eq,VLOOKUP(regen_yr_cf,off_regen_cost_cl,3)),0)","v":0},"/lb",{"$f":"E352*C352","v":0},{"$f":"IF(retrofit=1,0,IF(C352=0,0,1))","v":0}]
[null,"Energy"]
[null,{"$f":"IF(retrofit=1,\"Incremental energy for booster pumps\",\"Energy for booster pumps\")","v":"Energy for booster pumps"},{"$f":"IF(retrofit=1,r_pump_energy,pump_energy)","v":0.2952442325426245},"Mwh/yr",{"$f":"energy_cost_cl","v":0.10277862595419847},"/kwh",{"$f":"E354*C354*1000","v":30.344796541632796},1]
[null,{"$f":"IF(retrofit=1,\"Incremental energy for blowers\",\"Energy for blowers\")","v":"Energy for blowers"},{"$f":"IF(retrofit=1,r_blow_energy,blow_energy)","v":0.21275729527407117},"Mwh/yr",{"$f":"energy_cost_cl","v":0.10277862595419847},"/kwh",{"$f":"E355*C355*1000","v":21.866902470000721},1]
[null,"Energy for offgas treatment",{"$f":"CHOOSE(Offgas_Tech+1,0,0,TO_power_yr,CO_power_yr)","v":0},"Mwh/yr",{"$f":"energy_cost_cl","v":0.10277862595419847},"/kwh",{"$f":"E356*C356*1000","v":0},{"$f":"IF(retrofit=1,0,IF(C356=0,0,1))","v":0}]
[null,"Natural gas for offgas treatment",{"$f":"CHOOSE(Offgas_Tech+1,0,0,TO_ng_yr,CO_ng_yr)","v":0},"therms/yr",{"$f":"gas_cost_cl","v":1.0215033782528224},"/therm",{"$f":"E357*C357","v":0},{"$f":"IF(retrofit=1,0,IF(C357=0,0,1))","v":0}]
[null,{"$f":"IF(retrofit=1,\"Incremental energy for lighting\",\"Energy for lighting\")","v":"Energy for lighting"},{"$f":"IF(retrofit=1,r_lighting,lighting)","v":4.3387608333333334E-2},"Mwh/yr",{"$f":"energy_cost_cl","v":0.10277862595419847},"/kwh",{"$f":"E358*C358*1000","v":4.4593187679389317},{"$f":"IF(G358=0,0,1)","v":1}]
[null,"Energy for ventilation",{"$f":"ventilation","v":0.87843534545454527},"Mwh/yr",{"$f":"energy_cost_cl","v":0.10277862595419847},"/kwh",{"$f":"E359*C359*1000","v":90.284377795419829},{"$f":"IF(G359=0,0,1)","v":1}]
[null,"Energy for cooling"]
[null,"Air conditioning",{"$f":"IF(retrofit=1,0,cooling)","v":0},"Mwh/yr",{"$f":"energy_cost_cl","v":0.10277862595419847},"/kwh",{"$f":"E361*C361*1000","v":0},{"$f":"IF(retrofit=1,0,IF(C361=0,0,1))","v":0}]
[null,"Heat pump (cooling mode)",{"$f":"cooling_hp","v":0},"Mwh/yr",{"$f":"energy_cost_cl","v":0.10277862595419847},"/kwh",{"$f":"E362*C362*1000","v":0},{"$f":"IF(retrofit=1,0,IF(C362=0,0,1))","v":0}]
[null,"Energy for heating"]
[null,"Electric resistance",{"$f":"heating","v":0},"Mwh/yr",{"$f":"energy_cost_cl","v":0.10277862595419847},"/kwh",{"$f":"E364*C364*1000","v":0},{"$f":"IF(retrofit=1,0,IF(C364=0,0,1))","v":0}]
[null,"Heat pump",{"$f":"heating_hp","v":0},"Mwh/yr",{"$f":"energy_cost_cl","v":0.10277862595419847},"/kwh",{"$f":"E365*C365*1000","v":0},0]
[null,"Natural gas non-condensing furnace",{"$f":"IF(retrofit=1,0,heating_gas_non)","v":0},"therms/yr",{"$f":"gas_cost_cl","v":1.0215033782528224},"/therm",{"$f":"E366*C366","v":0},0]
[null,"Natural gas condensing furnace",{"$f":"IF(retrofit=1,0,heating_gas)","v":0},"therms/yr",{"$f":"gas_cost_cl","v":1.0215033782528224},"/therm",{"$f":"E367*C367","v":0},0]
[null,"Standard efficiency oil furnace",{"$f":"IF(retrofit=1,0,heating_diesel_non)","v":0},"gal/yr",{"$f":"diesel_cost_cl","v":3.9758333333333336},"/gal",{"$f":"E368*C368","v":0},0]
[null,"Mid-efficiency oil furnace",{"$f":"IF(retrofit=1,0,heating_diesel)","v":0},"gal/yr",{"$f":"diesel_cost_cl","v":3.9758333333333336},"/gal",{"$f":"E369*C369","v":0},0]
[null,"Residuals Discharge/Disposal"]
[null,"Spent offgas control media disposal",{"$f":"IF(disp_freq=0,0,spent_media/disp_freq)","v":0},"ton/yr",{"$f":"IF(C371=0,0,G371/C371)","v":0},"/ton",{"$f":"disposal_fee","v":0},{"$f":"IF(retrofit=1,0,IF(C371=0,0,1))","v":0}]
[null,"Miscellaneous Allowance",{"$f":"misc_pct","v":0.1},null,null,null,{"$f":"SUMPRODUCT(G338:G371,H338:H371) * misc_pct","v":1270.9087218371992},1]
[null,{"$f":"IF(retrofit=1,\"Total Annual Incremental O&M Cost for Retrofit\",\"Total Annual O&M Cost\")","v":"Total Annual O&M Cost"},null,null,null,null,{"$f":"SUMPRODUCT(G338:G372,H338:H372)","v":13979.99594020919}]
[]
["ANNUALIZED COSTS"]
[null,"Assumption","Value","Guidance"]
[null,"Discount rate",7.0000000000000007E-2,"User adjustable"]
[null,"Calculate households based on:","ground water","User adjustable"]
[null,"Household size (people per household)",2.6,"User adjustable"]
[]
[null,"Calculation","Value","Units"]
[null,"Useful Life (Reciprocal Weighted Average)",{"$f":"IF((total_direct_depreciation+IF(build_UL=0,0,(addon_cost+indirect_cost)/build_UL))=0,0,ROUND((direct_for_UL+IF(build_UL=0,0,addon_cost+indirect_cost))/(total_direct_depreciation+IF(build_UL=0,0,(addon_cost+indirect_cost)/build_UL)),1))","v":{"$error":"#NAME?"}},"years"]
[null,"Number of households served",{"$f":"IF(source_select=\"ground water\",(average_flow*1000/0.08558)^(1/1.0584),(average_flow*1000/0.14004)^(1/0.99703))/hh_size","v":24.672476399934606},"households"]
[null,"Annualized Cost",{"$f":"IF(useful_life=0,0,-PMT(Discount_rate,useful_life,ROUND(system_cost,0))+ROUND(om_cost,0))","v":{"$error":"#NAME?"}},"/year"]
[null,"Annualized cost per 1,000 gallons average flow",{"$f":"Annualized_Cost/(average_flow*365*1000)","v":{"$error":"#NAME?"}},"/kgal"]
[null,"Annualized cost per household",{"$f":"Annualized_Cost/households","v":{"$error":"#NAME?"}},"/household/year"]
[]
["Internal use"]
[null,"Mobilization and Demobilization",{"$f":"C307","v":11740.075390067315}]
[null,"Architectural Fees for Treatment Building",{"$f":"C308","v":0}]
[null,"Installation, Transportatation, and O&P",{"$f":"D309","v":0}]
[null,"Site Work",{"$f":"C310","v":4628.3999999999996}]
[null,"Yard Piping",{"$f":"C311","v":1175.4030632859467}]
[null,"Geotechnical",{"$f":"C312","v":1999.0918518518517}]
[null,"Standby Power",{"$f":"C313","v":0}]
[null,"Electrical (including yard wiring)",{"$f":"C314","v":17934.480290606229}]
[null,"Instrumentation and Control",{"$f":"D315","v":0}]
[null,"Contingency",{"$f":"D316","v":0}]
[null,"Process Engineering",{"$f":"C317","v":38011.660471927687}]
[null,"Miscellaneous Allowance",{"$f":"D318","v":0.1}]
[null,"Legal, Fiscal, and Administrative",{"$f":"D319","v":0.02}]
[null,"Sales Tax",{"$f":"D320","v":0}]
[null,"Financing during Construction",{"$f":"D321","v":0}]
[null,"Construction Management and GC Overhead",{"$f":"C322","v":21602.319975784801}]
[null,"Indirect cost multiplier",{"$f":"SUM(cul_indir_mult_table)","v":0.12000000000000001}]
[null,"Indirect costs added",{"$f":"SUM(cul_indir_add_table)-addon_cost","v":{"$error":"#NAME?"}}]
[null,"Subtotal indirect and add-on cost",{"$f":"C323+addon_cost","v":{"$error":"#NAME?"}}]
[]
[null,"Valid inputs:",{"$f":"INPUT!C32","v":true},{"$f":"INPUT!C42","v":true},{"$f":"INPUT!C49","v":true},{"$f":"INPUT!C54","v":true},{"$f":"INPUT!C70","v":true},{"$f":"INPUT!C81","v":true},{"$f":"INPUT!C97","v":true},{"$f":"INPUT!C114","v":true}]
[null,"Missing Cost?:",{"$f":"IF(COUNTIF(use_column,\"x\")>0,TRUE,FALSE)","v":false}]
[null,"Buildup error?",{"$f":"IF(COUNTIF(use_column,\"ec\")+COUNTIF(use_column,\"ep\")>0,TRUE,FALSE)","v":false}]

{"sheet":"Air and Packing Reference","index":4,"n_rows":131,"n_cols":14,"rows_kept":131,"cut":false,"hidden":false,"merged":[[125,0,127,1],[125,2,125,3],[125,4,125,5],[126,2,126,3],[126,4,126,5],[127,2,128,2],[127,4,128,4],[126,6,126,7],[127,6,128,6],[51,6,51,7],[52,6,52,7],[53,6,54,6],[73,6,73,7],[72,6,72,7],[100,6,101,6],[98,6,98,7],[61,6,61,7],[99,6,99,7],[125,6,125,7],[90,6,90,7],[91,6,92,6],[63,6,64,6],[89,6,89,7],[32,0,33,0],[53,4,54,4],[51,8,51,9],[61,0,63,1],[61,2,61,3],[62,2,62,3],[51,0,53,1],[51,2,51,3],[52,2,52,3],[61,8,61,9],[62,8,62,9],[51,4,51,5],[52,4,52,5],[63,2,64,2],[53,2,54,2],[53,8,54,8],[51,10,51,11],[52,10,52,11],[52,8,52,9],[53,10,54,10],[62,6,62,7],[61,10,61,11],[62,10,62,11],[99,10,99,11],[98,0,100,1],[98,2,98,3],[99,2,99,3],[98,4,98,5],[99,4,99,5],[100,8,101,8],[100,10,101,10],[100,2,101,2],[100,4,101,4],[98,10,98,11],[63,10,64,10],[62,12,62,13],[61,12,61,13],[74,4,75,4],[73,4,73,5],[72,4,72,5],[74,8,75,8],[73,8,73,9],[72,8,72,9],[63,8,64,8],[63,12,64,12],[61,4,61,5],[62,4,62,5],[98,8,98,9],[99,8,99,9],[81,0,83,1],[81,2,81,3],[83,4,84,4],[91,4,92,4],[89,4,89,5],[89,0,91,1],[89,2,89,3],[90,2,90,3],[91,2,92,2],[83,2,84,2],[82,2,82,3],[81,4,81,5],[90,4,90,5],[82,4,82,5],[74,6,75,6],[111,0,113,1],[113,2,114,2],[113,4,114,4],[111,2,111,3],[112,2,112,3],[111,4,111,5],[112,4,112,5],[72,0,74,1],[72,2,72,3],[73,2,73,3],[74,2,75,2]]}
["Reference data for the density and viscosity of air at various temperatures"]
[]
["Temperature (degrees K)","Viscosity (kg/m-s)","Density at 1 atm (kg/m3)"]
[250,1.6200000000000001E-5,1.4128000000000001]
[263,1.6800000000000002E-5,1.3420000000000001]
[268,1.7100000000000002E-5,1.3169999999999999]
[273,1.7400000000000003E-5,1.292]
[278,1.7600000000000001E-5,1.2689999999999999]
[283,1.7900000000000001E-5,1.2470000000000001]
[288,1.8100000000000003E-5,1.2250000000000001]
[293,1.8400000000000003E-5,1.204]
[298,1.8600000000000001E-5,1.1839999999999999]
[300,1.8700000000000004E-5,1.1774]
[303,1.8900000000000002E-5,1.165]
[350,2.1100000000000001E-5,0.998]
[]
["Note: viscosity is not strongly pressure-dependent and may be used over a fairly wide range of pressures"]
["Sources: "]
["Holman, J.P.  Heat Transfer.  New York: McGraw-Hill Book Company"]
["The Engineering Toolbox: Air - Absolute and Kinematic Viscosity; click to go to http://www.engineeringtoolbox.com"]
["Gas Viscosity Calculator; click to go to http://www.lmnoeng.com/Flow/GasViscosity.htm"]
["Wikipedia: Density of Air; click to go to http://en.wikipedia.org/wiki/Density_of_air"]
[]
["Reference Data for Packing Characteristics"]
["Sources:"]
["Source 1: M. Cummins, original PTA design program developed for EPA"]
["Source 2: Air Stripping and Aeration.  Table 5.8: Physical Characteristics of Packing Materials. p 5.17."]
["Source 3: Perry's Chemical Engineering Handbook, 6th Edition, 1984."]
["Source 4: Narbaitz et al. \"Evaluating Aeration-Stripping Media on the Pilot Scale.\" J. AWWA 94:9. September 2002."]
["Source 5: Goss, B. 2010. \"Chapter 6: Bonding of Low-Energy Plastics and Rubbers.\" Practical Guide to Adhesive Bonding of Small Engineering Plastic and Rubber Parts. iSmithers Rapra Publishing."]
[]
["Critical Surface Tension of Packing Materials"]
["Material","Source 3","Source 5"]
[null,"(kg/sec2 or N/m)","(N/m)"]
["Acetal",null,2.1999999999999999E-2]
["Carbon",5.6000000000000001E-2]
["Ceramic",6.0999999999999999E-2]
["Glass",7.2999999999999995E-2]
["Nylon 6",null,4.5999999999999999E-2]
["Paraffin",0.02]
["Polycarbonate",null,4.5999999999999999E-2]
["Polyethylene",3.3000000000000002E-2,3.1E-2]
["PET",null,"0.041 to 0.047"]
["Polymethylmethacrylate (acrylic)",null,3.9E-2]
["Polypropylene",null,2.9000000000000001E-2]
["Polystyrene",null,"0.035 to 0.037"]
["Polyvinylchloride",0.04,3.9E-2]
["PTFE",null,1.7999999999999999E-2]
["Steel",7.4999999999999997E-2]
[]
["Surface Area and Friction Factor for Plastic Saddles"]
["Packing size",null,"Source 1",null,"Source 1",null,"Source 4",null,"Source 2",null,"Source 3"]
[null,null,"Glitsch Saddles (polyethylene)",null,"Koch Saddles (polyethylene)",null,"Koch Flexisaddles (polypropylene)",null,"Saddles (unspecified plastic)",null,"Intalox Saddles (unspecified plastic)"]
[null,null,"Friction factor","Surface area of packing","Friction factor","Surface area of packing","Friction factor","Surface area of packing","Friction factor","Surface area of packing","Friction factor","Surface area of packing"]
["(in)","(mm)",null,"(m2/m3)",null,"(m2/m3)",null,"(m2/m3)",null,"(m2/m3)",null,"(m2/m3)"]
[1,25,33.200000000000003,203,30,207,null,null,null,null,null,206]
[1.5,null,null,null,20,108]
[2,50,21,98,15,89,null,null,20,110,null,108]
[3,75,16,66,null,null,null,88.6,16,89,null,88]
[]
["Surface Area and Friction Factor for Plastic Rings"]
["Packing size",null,"Source 1",null,"Source 4",null,"Source 1",null,"Source 4",null,"Source 2",null,"Source 3"]
[null,null,"Glitsch Cascade Minirings (polyethylene)",null,"Glitsch Cascade Minirings (polypropylene)",null,"Koch Flexirings (polyethylene)",null,"Koch Flexirings (polypropylene)",null,"Pall Rings (unspecified plastic)",null,"Pall Rings (polypropylene)"]
[null,null,"Friction factor","Surface area of packing","Friction factor","Surface area of packing","Friction factor","Surface area of packing","Friction factor","Surface area of packing","Friction factor","Surface area of packing","Friction factor","Surface area of packing"]
["(in)","(mm)",null,"(m2/m3)",null,"(m2/m3)",null,"(m2/m3)",null,"(m2/m3)",null,"(m2/m3)",null,"(m2/m3)"]
[{"$f":"B66*0.03937","v":0.62992000000000004},16,null,null,null,null,null,null,null,null,null,null,null,340]
[1,25,20.8,null,null,null,32.299999999999997,null,null,null,52,206,null,205]
[1.5,38,null,null,null,null,null,null,null,null,null,null,null,130]
[2,50,10.5,null,null,141,null,null,null,115,25,102,null,100]
[3.5,"88 or 90",null,null,null,null,null,null,null,null,16,85,null,85]
[]
["Surface Area and Friction Factor for Plastic Tri-packs"]
["Packing size",null,"Source 1",null,"Source 4",null,"Source 2",null,"Source 3"]
[null,null,"Jaeger Tri-packs (polyethylene)",null,"Jaeger Tri-packs (polypropylene)",null,"Tri-packs (unspecified plastic)",null,"Tri-packs (unspecified plastic)"]
[null,null,"Friction factor","Surface area of packing","Friction factor","Surface area of packing","Friction factor","Surface area of packing","Friction factor","Surface area of packing"]
["(in)","(mm)",null,"(m2/m3)",null,"(m2/m3)",null,"(m2/m3)",null,"(m2/m3)"]
[1,25,20,null,null,null,28,279]
[2,50,15,138,null,157,16,157,15,157]
[3.5,88,null,null,null,null,12,125,14,138]
[]
["Surface Area and Friction Factor for Plastic Telerettes"]
["Packing size",null,"Source 2",null,"Source 3"]
[null,null,"Tellerettes (unspecified plastic)",null,"Tellerettes (low-density Polyethylene)"]
[null,null,"Friction factor","Surface area of packing","Friction factor","Surface area of packing"]
["(in)","(mm)",null,"(m2/m3)",null,"(m2/m3)"]
[1,25,null,null,null,250]
[2,50,20,112]
[]
["Surface Area and Friction Factor for Other Plastic Packing"]
["Packing size",null,"Source 4",null,"Source 1",null,"Source 4"]
[null,null,"Nor-Pac (polypropylene)",null,"Norton Snowflakes (polyethylene)",null,"Norton Snowflakes (polypropylene)"]
[null,null,"Friction factor","Surface area of packing","Friction factor","Surface area of packing","Friction factor","Surface area of packing"]
["(in)","(mm)",null,"(m2/m3)",null,"(m2/m3)",null,"(m2/m3)"]
[1.5,28,null,145,11.1]
[2,50,null,100,11.1]
[3.7,94,null,null,11.1,null,null,91.8]
[]
["Surface Area and Friction Factor for Ceramic Saddles"]
["Packing size",null,"Source 1",null,"Source 2",null,"Source 2",null,"Source 3",null,"Source 3"]
[null,null,"Saddles",null,"Berl Saddles",null,"Intalox Saddles",null,"Berl Saddles",null,"Intalox Saddles"]
[null,null,"Friction factor","Surface area of packing","Friction factor","Surface area of packing","Friction factor","Surface area of packing","Friction factor","Surface area of packing","Friction factor","Surface area of packing"]
["(in)","(mm)",null,"(m2/m3)",null,"(m2/m3)",null,"(m2/m3)",null,"(m2/m3)",null,"(m2/m3)"]
[0.25,6,900,899,null,null,null,null,null,900,null,984]
[0.5,13,240,466,240,466,200,623,null,465,null,625]
[0.75,19,170,269]
[1,25,110,249,110,249,98,256,null,250,null,255]
[1.5,38,654,144,45,105,40,118,null,150,null,195]
[2,50,45,105,null,null,null,null,null,105,null,118]
[{"$f":"B109*0.03937","v":2.95275},75,null,null,null,null,22,92,null,null,null,92]
[]
["Surface Area and Friction Factor for Ceramic Rings"]
["Packing size",null,"Source 2",null,"Source 3"]
[null,null,"Raschig Rings",null,"Raschig Rings"]
[null,null,"Friction factor","Surface area of packing","Friction factor","Surface area of packing"]
["(in)","(mm)",null,"(m2/m3)",null,"(m2/m3)"]
[0.25,6,null,null,null,710]
[0.5,13,580,364,null,370]
[{"$f":"B118*0.03937","v":0.74803000000000008},19,null,null,null,240]
[1,25,155,190,null,190]
[1.4960600000000002,38,null,null,null,120]
[1.9685000000000001,50,65,92,null,92]
[2.95275,75,37,62,null,62]
[3.9370000000000003,100,null,null,null,46]
[]
["Surface Area and Friction Factor for Structured Packing"]
["Packing size",null,"Source 4",null,"Source 4",null,"Source 4"]
[null,null,"Munters No. 12060 (polyvinylchloride)",null,"Kompac (polypropylene)",null,"Koch Flexipac (polypropylene)"]
[null,null,"Friction factor","Surface area of packing","Friction factor","Surface area of packing","Friction factor","Surface area of packing"]
["(in)","(mm)",null,"(m2/m3)",null,"(m2/m3)",null,"(m2/m3)"]
[0.63,16,null,223]
[2,50,null,null,null,110,null,131]

{"sheet":"Critical Design Assumptions","index":5,"n_rows":173,"n_cols":7,"rows_kept":173,"cut":false,"hidden":false,"merged":[]}
["Default Critical Design Assumptions"]
["Users may change any of the cells in the Value column; cells in gold are most important and may vary based on contaminant treated and site-specific conditions"]
[]
["Assumption","Range Name","Value","Units","Guidance"]
["Cost estimating method","curve",1,"<-- enter 1 to use cost equations, leave blank to use lookup tables for component costs","Keeping this assumption with a value of 1 is strongly recommended; the cost equations method is more appropriate for national cost estimating and will be more accurate for nearly all user-specified designs"]
[]
["Tower Design Constraints"]
["Minimum packing height to diameter ratio","Min_d_rat_cda",1.5,"x tower diameter","Constraint is to maintain a practical geometry for radon removal, which in theory could operate with a low packing height.  Constraint not relevant to more conventional contaminants because design program will require high packing height to achieve removal."]
["Maximum packing height to diameter ratio","Max_d_rat_cda",10,"x tower diameter","Maximum is <10 due to need to consider structural stability of tower (Richard E. Hubel, Tim O'Brien, American Water Works Service Company)."]
["Maximum packing height","Max_pack_std",6.1,"meters","Maximum tower height depends on local considerations; 6.1 meters corresponds to 20 feet"]
["Maximum packing height for difficult contaminants","Max_pack_MTBE",13,"meters","Currently used for MTBE; 13 meters is approximately 43 feet"]
["Maximum tower area","Max_Area_cda",7.258,"square meters","Based on a maximum tower diamter of 10 ft; can be larger if towers are constructed on-site (Richard E. Hubel, Tim O'Brien, American Water Works Service Company)."]
["Minimum tower area","Min_Area_cda",1.8249999999999999E-2,"square meters","Based on a minimum diameter of 0.5 feet"]
["Overdesign sensitivity","P_REM_INC",0.05,null,"Used by design program when overdesign is required. Lower values will allow more precise designs, but increase processing time."]
["Operating Pressure","Op_Press",1,"atm"]
["Spacing between liquid redistribution rings","ring_space",2,"meters"]
["Freeboard above packing material","Free_Board_Col",1,"meters"]
["Minimum number of towers","min_col",2,"units","Minimum of two units allows for operational reundancy; system can operate at reduced flow with one tower out of service"]
["Number of redundant towers for small systems","NRD_small",0,"units","PTA towers are out of service infrequently, so small systems typically do not require a redundant tower (O'Brien Peer Review Comments)"]
["Redundancy frequency for large systems","redund_freq",0,null,"Add a tower for every x operating towers, rounded up. 0 indicates no redundant towers; redundancy not required with minimum of two towers"]
[]
["Pumps, Blowers, Piping"]
["Safety factor for pumps","pump_safety_factor",0.25,null,"Used for both booster and chemical metering pumps"]
["Number of redundant booster pumps","NRD_pump",0,"units","Multiple pump approach eliminates need for redundant pumps"]
["Number of redundant blowers","NRD_blower",0,"units","Multiple blower approach eliminates need for redundant blowers"]
["Number of redundant chemical metering pumps","NRD_cm_pump",1,"pumps"]
["Minimum average flow as percentage of design","min_avg_flow",0.1,null,"The minimum ratio of average flow to design flow. If the ratio falls below this value, it will trigger a warning on the INPUT sheet. If this value is zero, no minimum is enforced."]
["Air pipe length per tower","air_L",100,"feet/tower"]
[]
["Bypass Flow"]
["Percent of Total Flow that is Bypassed","bp_pct",0,null,"0% is default consistent with the type of cost curves that EPA will need for its national cost simulation model"]
[]
["Clearwell design"]
["Freeboard","freeboard",3,"feet"]
["Overexcavation","overexcavate",4,"ft","2 feet each side in each dimension"]
["Concrete thickness","conc_thick",1,"ft"]
[]
["Chemical usage"]
["Days per year of chemical feed","chem_freq",365,"days per year","Default of 365 assumes continuous addition. Reduce days per year to simulate intermittent addition."]
["Chemical storage required","cstore_days",30,"days","Adjust this value if intermittent addition is chosen"]
["Include a separate day tank if daily volume is x or greater","day_tank_needed",5,"gal"]
["Chemical tank mixer horsepower","cmix_hp_per",0.25,"hp per 1000 gal"]
[]
["Corrosion control chemicals",null,null,null,"Chemical additions below are to prevent scaling and corrosion, and may depend on influent water quality"]
["Corrosion control chemical chosen","chem_type",2,"<-- 1 for no corrosion control chemical, 2 for sodium hexametaphosphate, 3 for tetrasodium polyphosphate"]
["Dosage of sodium hexametaphosphate","sh_dose",5,"mg/l","Addition of sodium hexametaphosphate or tetrasodium polyphosphate may be employed for scaling and corrosion control"]
["Sodium hexametaphospate solution strength","sh_strength",0.1,null,"Prepare solution @ 1 lb/gal/ BIF Chemicals Used in Water and Waste Water (Richard E. Hubel, Tim O'Brien, American Water Works Service Company)"]
["Specific gravity of sodium hexametaphosphate solution","sh_spgr",2.484]
["Dosage of tetrasodium polyphosphate","tp_dose",5,"mg/l"]
["Tetrasodium polyphospate solution strength","tp_strength",0.04,null,"Prepare solution @ 0.3 lb/gal/ BIF Chemicals Used in Water and Waste Water (Richard E. Hubel, Tim O'Brien, American Water Works Service Company)"]
["Specific gravity of tetrasodium polyphosphate solution","tp_spgr",2.484]
[]
["Acid/Caustic Addition",null,null,null,"Acid addition to lower pH may also be used to prevent scaling, although natural CO removal by PTA may render this unneccessary"]
["Type of acid","acid_type",1,"<-- 1 for no acid addition, 2 for HCl, 3 for H2SO4"]
["Initial water pH","pHo",7.5]
["Alkalinity as CaCO3","alk_ppm",100,"ppm"]
["Target pH for treatment","pHf_selected",5.5]
["HCl solution strength","hcl_strength",0.36]
["HCl mg/meq","hcl_molwt",36.5,"mg/meq"]
["H2SO4 solution strength","H2SO4_strength",0.77669999999999995]
["H2SO4 mg/meq","H2SO4_molwt",{"$f":"98.1/2","v":49.05},"mg/meq"]
["NaOH solution strength","naoh_strength",0.5]
[]
["Chemical Constants"]
["Acceleration of gravity","G",9.81,"m/s2"]
["Gas law constant","R_C",8.2100000000000006E-2,"(atm m3)/(KM deg K)"]
["Molar volume of gas at STP","GO",22.4,"m3/kmole"]
["Standard temperature","TS",273,"Deg. Kelvin"]
["Standard pressure","PS",1,"atm"]
["Molecular weight of air","MWA",29,"kg/kmole"]
["Density of water","PW",999.7,"kg/m3","@10 C"]
["Viscosity of water","UW",1.307E-3,"kg/m s","@10 C"]
["Surface tension of water","SW",7.4200000000000002E-2,"kg/s2","@10 C, from StEPP"]
["Molecular Radius of Air","RA",0.37109999999999999,"nm"]
["Force Constant for Air","E_KA",78.599999999999994,"Deg. Kelvin"]
["Standard Pressure","P_S",101325,"N/m2"]
[]
["Valves and Instrumentation"]
["See the Valve Table at the bottom of this page for additional assumptions relating to valves"]
["Number of manual valves on influent and treated water line","tot_man_valves",2,"valves"]
[]
["Number of check valves on influent line","tot_in_chv",1,"valves"]
["Number of check valves on bypass line","tot_bp_chv",1,"valves"]
["Number of check valves on acid line per chemical pump","HCl_chv_pump",2,"valves/pump"]
["Number of check valves on caustic line per chemical pump","NaOH_chv_pump",2,"valves/pump"]
["Number of check valves on corrosion chemical line per chemical pump","chem_chv_pump",2,"valves/pump"]
[]
["Flow meters for influent and treated water line","tot_fm_in",1,"units","Only on treated water line in this technology"]
["Flow meters for process line per tower","fm_proc",1,"units/tower"]
["Flow meters for air line per tower","fm_air",1,"units/tower"]
["High/low alarms per chemical tank","alarm_chem",1,"units/tank"]
["pH meters","pH_controls",2,"units","One for influent line, one for treated water line"]
["Temperature meters","temp_meters",1,"units","One for influent line"]
["TDS monitors","num_TDS",0,"units"]
["Turbidity meters","turb_meters",1,"units","One for treated water line"]
["Turbidity meters (for small systems <1 MGD)","turb_meters_small",0,"units","Reduced instrumentation for small systems"]
["Number of electrical enclosures","elec_encl",1,"units"]
[]
["System Controls"]
["See the I/O Port Table at the bottom of this page for additional assumptions relating to system controls"]
["Controllers are used only under full automation"]
["To change the degree of automation, change the number of controllers to zero for the appropriate items."]
["Drive controllers per booster pump","S_booster_pump",1,"units"]
["Drive controllers per blower","S_blower",1,"units"]
["Drive controllers per chemical metering pump","S_cm_pump",1,"units"]
["Drive controllers per thermal oxidizer","S_TO",2,"units","One for burners, one for secondary air"]
["Drive controllers per catalytic oxidizer","S_CO",2,"units","One for burners, one for secondary air"]
["Drive controllers per mixer","S_mix",1,"units"]
[]
["Number of CPUs","plc_cpu",2,"units","One CPU is needed to run the local and expansion bases and modules (max 8192 I/O); using two to provide redundancy"]
["Ethernet modules","plc_ethernet ",2,"units","One ethernet module is needed; using two to provide redundancy"]
["Operator interfaces","plc_interface",2,"units","Two to provide redundancy in the event of SCADA node failure"]
["UPSs","ups",1,"unit","UPS protects the PLC system from undesired outages and surges that can adversely affect the performance of the PLC unit"]
["Computer workstations per x operators","workstation_ratio",1,"operator/workstation","Minimum will always be one, but larger systems will have multiple workstations to control the system"]
["Number of shifts","shifts_day",3,"shifts/day","Used to determine number of workstations"]
["Printers per x computer workstations","printer_ratio",4,"workstations/printer","Minimum will always be one, but larger systems will have multiple printers"]
[]
["Structure/Floorplan"]
["Maximum access space per tower or tank","max_space_vessels",6,"feet","This is the MAXIMUM; space between towers and tanks defaults to tower or tank diameter, up to this maximum.  Maximum provides space for sandblasting and painting for large tanks (5-8 feet per Richard E. Hubel, Peter Keenan, American Water Works Service Company)."]
["Access space for each pump","space_pumps",4,"feet","Used for both pumps and blowers; provide a minimum of 3 ft (1 m) of clear space around each item of equipment (American Water Works Association and American Society of Civil Engineers. Water Treatment Plant Design. Third Edition. New York: McGraw Hill, 1998. Pp. 695)."]
["Fire truck buffer requirements","fire_buffer",40,"feet"]
["Buffer space around other sides of buildings","non_fire_buffer",10,"feet"]
["Building height","Building_height",20,"feet"]
["Office space per employee","space_office",100,"square ft"]
["Office space per employee for small systems","space_office_small",0,"square ft","Small systems do not require office space"]
["Concrete pad thickness","pad_thick",{"$f":"6/12","v":0.5},"feet"]
["Concrete pad thickness for small systems","pad_thick_small",{"$f":"4/12","v":0.33333333333333331},"feet"]
[]
[]
["Valve Table"]
["Under assumptions below, valves are motorized for fully automated systems, manual for semi-automated and manual systems"]
["To change the degree of automation, the user may replace the numbers in each of the blue columns."]
["Number of control valves of x type on y line per z","Lookup name","Manual","Semi-auto","Fully Auto","Units"]
["Number of motor/air operated control valves on process line per tower","proc_MOV_vessel",0,0,1,"valves/tower"]
["Number of motor/air operated control valves on process line per booster pump ","proc_MOV_pump",0,0,2,"valves/pump"]
["Number of motor/air operated control valves on air line per tower","air_MOV_vessel",0,0,1,"valves/tower"]
["Number of motor/air operated control valves on caustic lines per pump ","NaOH_MOV_pump",0,0,2,"valves/pump"]
["Number of motor/air operated control valves on acid lines per pump ","HCl_MOV_pump",0,0,2,"valves/pump"]
["Number of motor/air operated control valves on corrosion chemical lines per pump ","chem_MOV_pump",0,0,2,"valves/pump"]
["Number of motor/air operated control valves on by-pass line","tot_bp_MOVs",0,0,1,"valves"]
["Number of motor/air operated control valves per day tank","chem_mov_day",0,0,1,"valves/tank"]
["Number of manual valves per day tank","chem_man_day",1,1,0,"valves/tank"]
["Number of motor/air operated control valves per offgas control unit","air_MOV_og",0,0,1,"valves/unit"]
["Additional motor/air operated control valves with offgas control","add_MOV_og",0,0,1,"valve","For emergency direct venting"]
["Number of manual control valves on process line per tower ","proc_man_vessel",1,1,0,"valves/tower"]
["Number of manual control valves on process line per booster pump ","proc_man_pump",2,2,0,"valves/pump"]
["Number of manual control valves on air line per tower ","air_man_vessel",1,1,0,"valves/tower"]
["Number of manual control valves on caustic lines per pump ","NaOH_man_pump",2,2,0,"valves/pump"]
["Number of manual control valves on acid lines per pump ","HCl_man_pump",2,2,0,"valves/pump"]
["Number of manual control valves on corrosion chemical lines per pump ","chem_man_pump",2,2,0,"valves/pump"]
["Number of manual control valves on by-pass line","tot_bp_man",1,1,0,"valves"]
["Number of manual control valves per offgas control unit","air_man_og",1,1,0,"valves/unit"]
["Additional manual control valves with offgas control","add_man_og",1,1,0,"valve","For emergency direct venting"]
[]
[]
["I/O Port Table"]
["Full automation includes all inputs and outputs, semi-automated uses inputs only, manual control uses neither"]
["To change the degree of automation, the user may replace the numbers in each of the blue columns."]
["I/O Ports needed per….","Lookup name","Discrete Inputs","Discrete Outputs","Analog Inputs","Analog Outputs","Guidance"]
["Alarm (including level switch/alarms, high/low alarms, low alarms)","alarm",1,1,0,0]
["Catalytic oxidizer","CO",3,2,2,1,"Air flow: 2 AI, 1 AO, Temperature controller: 1 DI, 1 DO, Automated shut down: 1 DI, 1 DO, LEL sensor: 1 DI"]
["Air flow meter (rotameter)","flow_air",0,0,1,0]
["Magnetic flow meter","flow_mag",0,0,1,0]
["Orifice plate flow meter","flow_op",0,0,2,1,"Additional analog input because flow meters include pressure gauges"]
["Propeller flow meter","flow_prop",0,0,1,0]
["Venturi flow meter","flow_ven",0,0,2,1,"Additional analog input because flow meters include pressure gauges"]
["pH meter","ph",0,0,1,0]
["Drive controller","switch",3,1,0,0]
["TDS monitor","TDS",1,0,0,0]
["Temperature meter","temp",0,0,1,0]
["Thermal oxidizer","TO",3,2,2,1,"Air flow: 2 AI, 1 AO, Temperature controller: 1 DI, 1 DO, Automated shut down: 1 DI, 1 DO, LEL sensor: 1 DI"]
["Turbidity meter","turb",0,0,1,0]
["Motor/air operated valve","valve",0,0,1,1]

{"sheet":"O&M Assumptions","index":6,"n_rows":61,"n_cols":5,"rows_kept":61,"cut":false,"hidden":false,"merged":[]}
["Default O&M Assumptions"]
["Users may change any of the cells in the Value column"]
[]
["Assumption","Range Name","Value","Units","Guidance"]
["Materials"]
["Cost for parts & maintenance for pumps and blowers","pump_maintenance",0.01,"of capital cost","For calculating cost of actual maintenance materials; not to be confused with depreciation; 5% would be too high (Richard E. Hubel, Peter Keenan, American Water Works Service Company, Inc)"]
["Cost for parts & maintenance for PTA towers","PTA_maintenance",0.04,"of capital cost","For calculating cost of actual maintenance materials; not to be confused with depreciation"]
[]
["Labor"]
["Mangerial LOE as a percent of average technical labor ","Manager_percent",0.1,"fraction"]
["Administrative LOE as a percent of average technical labor ","Clerical_percent",0.1,"fraction"]
[]
["Operating LOE assumptions"]
["Minutes per instrument per day","uloe_inst",5,"min/day","For manual systems only"]
["Recording operating paramenters for automated systems","uloe_inst_auto",5,"min/day","For semiautomated and automated systems"]
["Minutes per pump, blower, and offgas unit per day","uloe_pump",5,"min/day","For manual and semiautomated systems"]
["Minutes per valve per week","uloe_valve",5,"min/week","For manual and semiautomated systems"]
["Minutes per 100 sf per day","uloe_fp",1,"min/100 sf/day"]
["Hours per media changeout","uloe_throwaway",4,"hours/bed/event","For systems with GAC offgas treatment"]
[]
["Maintenance LOE assumptions"]
["Maintenance LOE for instruments (includes calibration)","uloe_inst_maint",10,"min/month"]
["Maintenance LOE for pumps","uloe_pump_maint",30.25,"hours/year","Based on vendor recommended maintenance activities; applied to large, frequently operated pumps only"]
["Maintenance LOE for valves","uloe_valve_maint",5,"min/year","Applied to main process valves only"]
["Maintenance LOE for chemical supply systems","uloe_chem_maint",60,"min/month"]
[]
["Energy"]
["Additional pump head required","add_head",3.5,"meters","Pump head = tower packing height + clearwell depth + this addition"]
["Pump efficiency","PUMP_EFF",0.75]
["Blower efficiency","BLOW_EFF",0.7]
[]
["Lighting and HVAC"]
["Lighting power per sf, low-quality buildings and sheds","lighting_power_low",1,"W/sf","1, 2, and 4 W/sf are the assumptions used for building capital costs."]
["Lighting power per sf, mid-quality buildings","lighting_power_mid",2,"W/sf"]
["Lighting power per sf, high-quality buildings","lighting_power_high",4,"W/sf"]
[]
["Ventilation air change rate for pump room","Air_changes_pump",20,"air changes/hr","Could be lower (annual average 3 changes/hr) in a northern climate"]
["Ventilation air change rate for chemical storage","Air_changes_chem_storage",2,"air changes/hr"]
["Ventilation air change rate for offices","Air_changes_office",2,"air changes/hr"]
["Pressure drop across the fan","Fan_pressure_drop",0.25,"lbs/ft2"]
[null,null,null,null,"Number of days per year where natural ventilation is applicable cannot be greater than 365 days"]
["Number of mechanical ventilation days per year (small system)","fan_days_small",90,"days/year","For small systems (<1 MGD)"]
["Number of mechanical ventilation days per year (medium system)","fan_days_medium",120,"days/year","For medium systems (1 - 10 MGD)"]
["Number of mechanical ventilation days per year (large system)","fan_days_large",185,"days/year","For large systems (> 10 MGD)"]
[]
["R-value for walls","R_wall",13,"hr-sf-degF/BTU","Assumes standard building materials. If higher R-value materials are desired, user may also need to adjust the cost of building materials."]
["R-value for ceilings","R_ceiling",38,"hr-sf-degF/BTU","Assumes standard building materials. If higher R-value materials are desired, user may also need to adjust the cost of building materials."]
["Annual heating degree days","heat_DD",4923,"degree days","Heating and cooling assumptions should be consistent with one another. Assumed values are for a climate that results in a total energy usage for heating and cooling equal to the national median."]
["Annual cooling degree days","cool_DD",1697,"degree days","Heating and cooling assumptions should be consistent with one another. Assumed values are for a climate that results in a total energy usage for heating and cooling equal to the national median."]
["Heating ventilation/infiltration load","heat_viload",168679,"BTU/cfm","Heating and cooling assumptions should be consistent with one another. Assumed values are for a climate that results in a total energy usage for heating and cooling equal to the national median."]
["Cooling ventilation/infiltration load","cool_viload",51771,"BTU/cfm","Heating and cooling assumptions should be consistent with one another. Assumed values are for a climate that results in a total energy usage for heating and cooling equal to the national median."]
["Electric resistance heating efficiency","resist_eff",0.98,null,"See Appendix E"]
["Heat pump heating coefficient of performance","COP",3.2,null,"See Appendix E"]
["Natural gas non-condensing furnace efficiency","gas_non_eff",0.8,null,"See Appendix E"]
["Natural gas condensing furnace efficiency","gas_eff",0.95,null,"See Appendix E"]
["Standard oil furnace efficiency","diesel_non_eff",0.78,null,"See Appendix E"]
["Mid-efficiency oil furnace efficiency","diesel_eff",0.85,null,"See Appendix E"]
["Air conditioning EER","EER",11,"Whr/BTU","See Appendix E"]
["Heat pump cooling mode EER","hp_EER",10.1,"Whr/BTU","See Appendix E"]
[]
["Heating oil heat content","diesel_heat_content",139000,"BTU/gal","U.S. DOE, Energy Information Administration."]

{"sheet":"Indirect Assumptions","index":7,"n_rows":129,"n_cols":5,"rows_kept":129,"cut":false,"hidden":false,"merged":[[109,0,110,0],[109,1,110,1],[109,2,109,4],[120,0,121,0],[120,1,121,1],[120,2,120,4]]}
["Default Assumptions for Indirect and Add-On Costs"]
["Users may change any of the cells in the Value column"]
[]
["Assumption","Range Name","Value","Units","Guidance"]
["Permits"]
["Include permit costs?","include_permits",1,"<--- enter 1 for yes, 0 for no"]
["Always include NEPA compliance costs?","include_NEPA",0,"<--- enter 1 for yes, 2 for no","Default of 0 means NEPA compliance is included in the high component cost estimate only. Selecting 1 means NEPA compliance will be included in all estimates. Selecting 0 means NEPA compliance will never be included."]
["HCl strength to trigger RMP requirement","HCl_strength_RMP",0.37]
["HCl quantity to trigger RMP requirement","HCl_quant_RMP",15000,"lbs"]
[]
["Pilot Study"]
["Include pilot study costs?","include_pilot",1,"<--- enter 1 for yes, 0 for no"]
[]
["Land"]
["Include land costs?","include_land",1,"<--- enter 1 for yes, 0 for no"]
[]
["Mobilization and Demobilization"]
["Mobilization percentage for small systems","mob_pct_small",0.05,"of direct capital cost","Typically 2-5% of the estimated construction cost. Enter 0% to exclude."]
["Mobilization percentage for medium systems","mob_pct_medium",0.04,"of direct capital cost"]
["Mobilization percentage for large systems","mob_pct_large",0.02,"of direct capital cost"]
[]
["Architectural Fees for Treatment Building"]
["Include architectural fee?","include_arch",1,"<--- enter 1 for yes, 0 for no","Must be added to building cost. Change for special considerations. Includes structural, mechanical, and electrical engineering for building only."]
["Include architectural fee for small systems?","include_arch_small",0,"<--- enter 1 for yes, 0 for no"]
[]
["Installation, Transportatation, and O&P"]
["Installation, Transportatation, and O&P percentage","inst_pct",0,"of direct capital cost","Included in line item unit costs. Add a percentage for special considerations such as a remote site or high cost location."]
[]
["Sitework"]
["Include sitework costs?","include_sitework",1,"<--- enter 1 for yes, 0 for no"]
[]
["Yard Piping"]
["Include yard piping costs?","include_yardpipe",1,"<--- enter 1 for yes, 0 for no"]
["Frost depth","frost",38,"inches","Should be consistent with (reflect same climate as) heating and cooling assumptions on O&M assumptions page"]
["Minimum trench depth to top of pipe","min_trench_depth",36,"inches","US Army Corps of Engineers recommended minimum cover for distribution pipes of 2.5 ft in grassed areas, 3 ft if buried under pavement or roadways but not less than frost penetration depth (USACOE 1984)"]
["Soil density","soil_dens",97,"lb/cubic ft.","Based on soil density of loamy sand (1.55 gm/cc)"]
["Coefficient of passive pressure","Coeff_Kp",3]
["Reduction factor","Reduction",0.46700000000000003]
["Bedding depth below pipe","bedding_depth",6,"inches"]
["Bedding depth surrounding the pipe","bedding_pct",0.25,"of pipe diameter"]
["Trench inside angle","trench_angle",{"$f":"RADIANS(45)","v":0.78539816339744828},"radians"]
["Pipe length from water source to the boundary of the 10 foot buffer","yard_in",0,"feet","Use if technology is first step in treatment process"]
["Pipe length the boundary of the 10 foot buffer to distribution network","yard_out",0,"feet","Use if technology is last step in treatment process"]
[]
["Geotechnical"]
["Include geotechnical costs for low cost systems?","include_geo_low",0,"<--- enter 1 for yes, 0 for no","Note: geotechnical is always included when a clearwell is present, regardless of the numbers entered here, because of excavation requirements"]
["Include geotechnical costs for medium cost systems?","include_geo_medium",0,"<--- enter 1 for yes, 0 for no"]
["Include geotechnical costs for high cost systems?","include_geo_high",1,"<--- enter 1 for yes, 0 for no"]
["Test pit length","pit_length",4,"feet"]
["Test pit width","pit_width",4,"feet"]
["Test pit depth","pit_depth",7,"feet"]
["Borehole depth with no clearwell","bore_depth_nobasin",10,"feet"]
["Borehole depth for shallow clearwells","bore_depth_min",25,"feet"]
["Borehole depth for deep clearwells","bore_depth_max",50,"feet"]
["Basin excavation depth above which deeper boreholes are needed","deep_bore_need",20,"feet","Large systems with deep basins require deeper investigation"]
["Basin excavation depth above which deeper boreholes are needed","bore_need",2000,"square feet","Without clearwells, only large systems need boreholes"]
["Minimum number of boreholes","min_holes",4]
["Borehole needed every x square feet","hole_per_sf",1000,"square feet"]
["Boreholes per job","hole_per_job",24,"boreholes/job"]
["Linear feet bored per day","hole_per_day",55.5,"l.f./day","RS Means Costworks 2001"]
[]
["Standby Power"]
["Include standby power costs?","include_standby",1,"<--- enter 1 for yes, 0 for no"]
["Include standby power costs for small systems?","include_standby_small",0,"<--- enter 1 for yes, 0 for no"]
["Design safety factor for standby power","std_safety_factor",0,null,"Default 0%. Apply a percentage to increase standby power requirements."]
["Include heating in standby power","need_heat",0,"<--- enter 1 for yes, 0 for no","If a system uses gas or diesel heat, heating will not be included in standby power, regardless of this assumption."]
["Include cooling in standby power","need_cool",0,"<--- enter 1 for yes, 0 for no","If both heating and cooling are included, standby power requirements will be based on the maximum of the two"]
["Minimum standby power generator size","min_standby",1.5,"kW"]
[]
["Electrical (including yard wiring)"]
["Electrical percentage","elect_pct",0.1,"of direct cost"]
[]
["Instrumentation and Control"]
["Instrumentation and control percentage","i_c_pct",0,"of direct cost","Included as a direct cost line item"]
[]
["Contingency"]
["Include contingency costs for low cost systems?","include_conting_low",0,"<--- enter 1 for yes, 0 for no"]
["Include contingency costs for medium cost systems?","include_conting_medium",0,"<--- enter 1 for yes, 0 for no"]
["Include contingency costs for high cost systems?","include_conting_high",1,"<--- enter 1 for yes, 0 for no"]
["Technology complexity factor","complexity",1,null,"Technology-specific factor. See Appendices for details. Low complexity = 0.5; Average complexity = 1.0; High complexity = 1.5; Very high complexity = 2.0."]
[]
["Process Engineering"]
["Engineering percentage for small systems","eng_pct_small",0.2,"of direct capital cost","Enter 0% to exclude"]
["Engineering percentage for medium systems","eng_pct_medium",0.12,"of direct capital cost"]
["Engineering percentage for large systems","eng_pct_large",0.08,"of direct capital cost"]
[]
["Miscellaneous Allowance"]
["Miscellaneous allowance percentage","misc_pct",0.1,"of direct capital cost","Enter 0% to exclude"]
[]
["Legal, Fiscal, and Administrative"]
["Legal percentage","legal_pct",0.02,"of direct capital cost","Enter 0% to exclude. Highly site-specific. Can range from 2-5% of equipment, installation, construction, electrical, and standby power."]
[]
["Sales Tax"]
["Sales tax percentage","tax_pct",0,"of direct capital cost","May be exempt if constructed with public funds. May be as high as 7.25% of equipment and construction, with national average 4.75%."]
[]
["Financing during Construction"]
["Financing percentage","finance_pct",0.05,"of direct capital cost","Enter 0% to exclude. Typically assumed to be one year's interest on capital cost."]
["Financing percentage for small systems","finance_pct_small",0,"of direct capital cost","Small system construction assumed to take less than one year"]
[]
["Construction Management and General Contractor Overhead"]
["Builder's risk insurance percentage","br_ins_pct",3.3999999999999998E-3,null,"Enter 0% to exclude. 0.34% is national average rate. RSMeans Building Construction Cost Data 2009, reference section R01100-070"]
["Include performance bond cost?","include_bond",1,"<--- enter 1 for yes, 0 for no"]
["Include construction management cost?","include_cm",1,"<--- enter 1 for yes, 0 for no"]
[]
["Buildings"]
["Include buildings in total capital cost?","include_buildings",1,"<--- enter 1 for yes, 0 for no"]
["Include concrete pad in total capital cost?","include_pad",1,"<--- enter 1 for yes, 0 for no"]
[]
["Heating Table (1=include heating in buildings and O&M, 0 = do not include heating)"]
["Component Level","Range Name","System Size"]
[null,null,"Small (<1 mgd)","Medium (1-10 mgd)","Large (>10 mgd)"]
["low cost","heating_table",0,1,1]
["mid cost",null,1,1,1]
["high cost",null,1,1,1]
["Buildings less than 500 ft2 (other than those used for chlorine storage)"]
["low cost","heating_table_shed",0,0,1]
["mid cost",null,0,0,1]
["high cost",null,1,1,1]
[]
["Cooling Table (1=include cooling in buildings and O&M, 0 = do not include cooling)"]
["Component Level","Range Name","System Size"]
[null,null,"Small (<1 mgd)","Medium (1-10 mgd)","Large (>10 mgd)"]
["low cost","cooling_table",0,0,1]
["mid cost",null,0,1,1]
["high cost",null,1,1,1]
["Buildings less than 500 ft2 (other than those used for chlorine storage)"]
["low cost","cooling_table_shed",0,0,0]
["mid cost",null,0,0,0]
["high cost",null,0,0,0]

{"sheet":"Offgas Assumptions","index":8,"n_rows":45,"n_cols":6,"rows_kept":45,"cut":false,"hidden":false,"merged":[[27,0,28,0],[27,1,28,1]]}
["Default Offgas Assumptions"]
["Users may change any of the cells in the Value column"]
[]
["Assumption","Range Name","Value","Units","Guidance"]
["Specific heat of air","cpa",1.01,"kJ/kg-deg C","Rough assumption to account for high temperature and relative humidity in this application"]
[]
["GAC"]
["GAC Density","GAC_density",30,"lbs/cu ft","Bulk density, not particle density.  GAC density range of 22-30 lb/cubic ft; lignite GAC approximately 22 and bituminous GAC approximately 28 lb/cubic ft (Randal J. Braker, General Manager, Duck River Utility Commission)"]
["Redundant GAC beds","NRD_GAC",0,"units","Most of the unit costs are for dual bed units, which should provide sufficient redundancy."]
["Freundlich isotherm constant K for MTBE","K",80,"(mg/g)(L/mg)^1/n","Ramakrishnan et al. (2004), assumes 20% relative humidity.  See source for values at other relative humidity assumptions."]
["Freundlich isotherm constant 1/n for MTBE","1_n",0.32,null,"Ramakrishnan et al. (2004), assumes 20% relative humidity.  See source for values at other relative humidity assumptions."]
["Makeup carbon for off-site regeneration","makeup_rate_off",0.3,null,"Makeup carbon needs are higher for transport and regeneration off-site -- 30% (Richard E. Hubel, Peter Keenan, American Water Works Service Company)."]
["Miles to non-hazardous solid waste disposal site","non_haz_miles",10,"miles","For spent carbon disposal"]
[]
["Thermal Oxidizer"]
["Redundant TO units","NRD_TO",0,"units"]
["Excess air required","TO_ex_air",2,null,"Thermal oxidizers typically require 180% to 550% excess air"]
["Recuperative system heat recovery","TO_rec_eff",0.7,null,"U.S. EPA, 2006; CMRP, 2000"]
["Regenerative system heat recovery","TO_reg_eff",0.95,null,"U.S. EPA, 2006; CMRP, 2000; van der Vaart et al. 1994"]
[]
["Catalytic Oxidizer"]
["Redundant CO units","NRD_CO",0,"units"]
["Excess air required","CO_ex_air",2,null,"Thermal oxidizers typically require 180% to 550% excess air"]
["Recuperative system heat recovery","CO_rec_eff",0.7,null,"U.S. EPA, 2006; CMRP, 2000"]
["Regenerative system heat recovery","CO_reg_eff",0.95,null,"U.S. EPA, 2006; CMRP, 2000; van der Vaart et al. 1994"]
[]
["Contaminant Specific Assumptions Table"]
["Contaminant Number","Contaminant","Heating Value","GAC Bed Residence Time","TO Operating Temperature","CO Operating Temperature"]
[null,null,"(BTU/gal)","(sec)","(deg C)","(deg C)"]
[1,"MTBE",93500,3,816,288]
[2,"Radon",0,0,0,0]
[3,"TCE",0,6.4,1093,500]
[4,"PCE",0,6.4,1093,500]
[5,"Vinyl Chloride",0,6.4,1093,500]
[6,"Carbon Tetrachloride",0,6.4,1093,500]
[7,"Benzene",0,6.4,1093,500]
[8,"1,2-Dichloropropane",0,6.4,1093,500]
[9,"Methylene Chloride",0,6.4,1093,500]
[10,"1,2-Dichloroethane",0,6.4,1093,500]
[11,"1,3-Butadiene",0,6.4,1093,500]
[12,"1,1-Dichloroethane",0,6.4,1093,500]
[13,"1,1,1,2-Tetrachloroethane",0,6.4,1093,500]
[14,"1,1,2,2-Tetrachloroethane",0,6.4,1093,500]
[15,"1,2,3-Trichloropropane",0,6.4,1093,500]
[16,"Other"]

{"sheet":"Onda","index":9,"n_rows":53,"n_cols":5,"rows_kept":53,"cut":false,"hidden":false,"merged":[]}
["Onda Calculations"]
[]
["Calculation","Range Name","Value","Units","Guidance"]
["Inputs"]
["Liquid Loading",null,{"$f":"L_LOAD","v":6.5861483130000027E-3},"m3/m2 s","Calculated on tower design, displayed here for reference"]
["Air Loading",null,{"$f":"GAS_L","v":0.61251179310900028},"m3/m2 s","Calculated on tower design, for reference"]
["Percent removal or effluent concentration","Units_rem",{"$f":"IF(Units_rem_I=\"percent removal\",1,2)","v":2},"<--- 1 for percent removal, 2 for effluent concentration"]
["Henry's Co-efficient for Onda","ONDA_H",{"$f":"HENRY","v":0.187},"atm m3/m3","From Inputs"]
[]
["Calculated Values"]
["Reynold's number","NR",{"$f":"PW*L_LOAD/(AP*UW)","v":32.086766838562092}]
["Froude number","FR",{"$f":"(L_LOAD^2*AP)/(G)","v":6.9421446354034117E-4}]
["Weber number","NW",{"$f":"(PW*L_LOAD^2)/(SW*AP)","v":3.7224523491297861E-3}]
["Wetted Surface Area","AW",{"$f":"AP*(1-EXP(-1.45*((SP/SW)^0.75)*(NR^0.1)*(FR^(-0.05))*(NW^0.2)))","v":64.127488195152893},null,"Equation 18.56 from the Chemical Engineers Handbook, 5th Ed."]
["Liquid phase Reynold's number","NRW",{"$f":"(PW*L_LOAD)/(AW*UW)","v":78.556365381468652}]
["Schmidt number","SCW",{"$f":"UW/(PW*DW)","v":2051.4761405084564}]
["Air phase Reynold's number","NRA",{"$f":"(+GAS_L*MWA)/(AP*UA*GO)","v":282.17059312683011}]
["Schmidt number","SCA",{"$f":"UA/(PA*DA)","v":1.7915897896682653}]
["Shape factor","SHAPE",{"$f":"AP*DP","v":7.9756}]
["Liquid phase Sherwood number","SHW",{"$f":"0.0051*(NRW^(2/3))*(SCW^(-0.5))*(SHAPE^0.4)","v":4.7391072921478504E-3},null,"Equation 18-55 from the Chemical Engineer's Handbook, 5th ed."]
["Liquid phase co-efficient","ONDA_KL",{"$f":"(SHW)/((PW)/(UW*G))^(1/3)","v":1.1093148890868957E-4},"m/s"]
["Air phase Sherwood number","SHA",{"$f":"5.23*(NRA^0.7)*(SCA^0.33)*(SHAPE^(-2))","v":5.1748994556698413},null,"Equation 18-68 from the Chemical Engineer's Handbook, 5th ed."]
["Air phase co-efficient","ONDA_KG",{"$f":"(SHA)/((R_C*T/(AP*DA)))","v":2.8016893209530807E-4},"kmole/m2 s atm"]
["Overall coefficient","KLA",{"$f":"(AW/((1/ONDA_KL)+(1/(ONDA_KG*ONDA_H*R_C*TS/PS))))","v":6.4997367466518149E-3},"/s"]
["Design Kla (with Safety Factor)","DES_KLA",{"$f":"KLA/SF_KLA","v":4.6426691047512965E-3}]
["Diffusion coefficient through air","DA",{"$f":"C44","v":8.0121302121808956E-6},"m2/s","Treybal; Eq. 2.37"]
["Diffusion coefficient through water","DW",{"$f":"C53","v":6.37293406367019E-10},"m2/s","Treybal: Eq. 2.44"]
[]
["Diffusion Co-efficient Through Air Using the Wilke-Lee modification of the Hirschfelder-Bird-Spotz Method; Treybal Equation 2.37"]
["Inputs"]
["Temperature",null,{"$f":"T","v":283},"Deg. Kelvin","From Inputs, displayed here for reference"]
["Molecular Weight of Contaminant","MW",{"$f":"MW_IN","v":131.38999999999999},"kg/kilomole","From Inputs"]
["Molar Volume of Contaminant","MV",{"$f":"MV_IN","v":0.10199999999999999},"m3/kilomole","From Inputs"]
["Boiling Point of Contaminant","TB",{"$f":"TB_IN","v":359.7},"Deg. Kelvin","From Inputs"]
["Melting Point of Contaminant","TM",{"$f":"TM_IN","v":0},"Deg. Kelvin","From Inputs"]
[]
["Calculated Values"]
["X","X",{"$f":"SQRT((1/MW)+(1/MWA))","v":0.20516746310064984},null,"Input to Equation 2.37, Treybal"]
["Radius","Radius",{"$f":"1.18*(MV^(1/3))","v":0.55133478994592056},null,"Equation 2.38, Treybal"]
["Molecular separation at collision","R_ab",{"$f":"(RA+RADIUS)/2","v":0.46121739497296027},null,"Known as Rca in Cummins"]
["E_kc","E_kc",{"$f":"IF(TB>0,1.15*TB,1.92*TM)","v":413.65499999999997},null,"Input for estimating value of collision integral"]
["K_te","Kt_e",{"$f":"T/(SQRT(E_KA*E_KC))","v":1.5694808586319255},null,"Input for estimating value of collision integral"]
["Collision Integral","F_KT_E",{"$f":"EXP(-0.33789+LN(KT_E)*(-0.44268+LN(KT_E)*(0.081488*LN(KT_E)*(-0.0070712))))","v":0.58421949334746248},null,"Input to Equation 2.37, Treybal, calculated from relation derived by Cummins"]
["Diffusion Co-efficient Through Air",null,{"$f":"0.0001*(1.084-0.249*X)*(T^1.5)*X/(P_S*(R_AB^2)*F_KT_E)","v":8.0121302121808956E-6},"m2/s"]
[]
["Diffusion Co-efficient Through Water Using the Wilke and Chang Method recommended by Treybal (For Radon)"]
["Inputs"]
["Temperature",null,{"$f":"T","v":283},null,"From Inputs, displayed here for reference"]
["Molar Volume of Compound",null,{"$f":"MV","v":0.10199999999999999},null,"From Inputs, displayed here for reference"]
["X_1","X_1",7.4815000000000004E-16,null,"Constant portion of the Wilke and Chang equation: 1.17E-16 * (2.26 * Molecular Weight of Water) ^ (1/2); where molecular weight of water = 18"]
[]
["Calculated Value"]
["Diffusion Co-efficient Through Water, Dw",null,{"$f":"X_1*T/(UW*(MV^0.6))","v":6.37293406367019E-10},"m2/s"]

{"sheet":"Tower Design","index":10,"n_rows":91,"n_cols":22,"rows_kept":91,"cut":false,"hidden":false,"merged":[]}
["Tower Design Calculations"]
["This sheet calculates the design size and other parameters of the PTA system"]
[]
["Calculation","Range Name","Value","Units","Guidance"]
["From Inputs"]
["Maximum Design Flow (metric)","Qw",{"$f":"IF(df_units=\"cubic meters/second\",(1-bp_pct)*QW_IN,IF(df_units=\"MGD\",(1-bp_pct)*QW_IN*0.04583,IF(df_units=\"gpm\",(1-bp_pct)*QW_IN*0.04583*24*60/1000000,\"Unspecified units\")))","v":1.3749000000000001E-3},"m3/s","Converted to SI units if entered in others by user"]
["Daily Production Flow (metric)","Qwa",{"$f":"IF(af_units=\"cubic meters/second\",(1-bp_pct)*QWA_IN,IF(af_units=\"MGD\",(1-bp_pct)*QWA_IN*0.04583,IF(af_units=\"gpm\",(1-bp_pct)*QWA_IN*0.04583*24*60/1000000,QWA_IN*QW)))","v":3.2081000000000004E-4},"m3/s","Converted to SI units if entered in others by user"]
["Design flow in MGD","design_flow",{"$f":"QW/0.04583","v":0.03},"MGD","Design flow expressed in MGD"]
["Average flow in MGD","average_flow",{"$f":"QWA/0.04583","v":7.0000000000000001E-3},"MGD","Average flow expressed in MGD"]
["Design Flow Rate","design_flow_rate",{"$f":"(QW/0.04583)*1000000/(24*60)","v":20.833333333333332},"gpm","Design flow expressed in gpm"]
["Average Flow Rate","average_flow_rate",{"$f":"(QWA/0.04583)*1000000/(24*60)","v":4.8611111111111107},"gpm","Average flow expressed in gpm"]
["Bypass Flow Rate","bp_flow_rate",{"$f":"bp_pct/(1-bp_pct)*Design_Flow_Rate","v":0},"gpm"]
["Target Percent Removal (from user input)","Rem_in",{"$f":"IF(Units_rem=1,Rem_I,IF(Units_rem=2,1-Rem_I/Influent_conc,\"Error\"))","v":0.9},null,"Used by design macro"]
["Target Contaminant","contam",3,"<--- 1 for MTBE, 2 for Radon, 3 for TCE, 4 for PCE, etc."]
["Actual Percent Removal","P_REM",0.9,null,"Selected by design macro, may exceed user input target removal in systems that must be oversized for Radon"]
[]
["Clearwell Size"]
["Access space per tower","space_vessels",{"$f":"IF(D*3.28>max_space_vessels,max_space_vessels,ROUND(D*3.28,0))","v":1},"feet"]
["Working Volume","W_vol",{"$f":"QW*AW_DET*60","v":0.41247},"m3","Based on the design flow and detention time"]
["Clearwell Length","AirWell_L",{"$f":"IF(AW_DET=0,0,IF(TOT_COL=1,ROUND((D+2*space_vessels/3.28),2),IF(ROUND(SQRT(TOT_COL),3)=SQRT(TOT_COL),(ROUND(SQRT(((TOT_COL)*(D+space_vessels/3.28)^2)),0)/(D+space_vessels/3.28)*(D+space_vessels/3.28)+0.5*space_vessels),(ROUNDUP(SQRT(((TOT_COL)*(D+space_vessels/3.28)^2)),0)/(D+space_vessels/3.28)*(D+space_vessels/3.28)+0.5*space_vessels))))","v":1.5},"m"]
["Clearwell Width","AirWell_W",{"$f":"IF(AW_DET=0,0,IF(TOT_COL=1,ROUND((D+2*space_vessels/3.28),2),IF(ROUND(SQRT(TOT_COL),3)=SQRT(TOT_COL),(ROUND(SQRT(((TOT_COL)*(D+space_vessels/3.28)^2)),0)/(D+space_vessels/3.28)*(D+space_vessels/3.28)+0.5*space_vessels),(ROUNDUP(SQRT(((TOT_COL)*(D+space_vessels/3.28)^2)),0)/(D+space_vessels/3.28)*(D+space_vessels/3.28)+0.5*space_vessels))))","v":1.5},"m"]
["Clearwell Depth","AirWell_D",{"$f":"IF(AW_DET=0,0,freeboard/3.28+W_VOL/(AIRWELL_L*AIRWELL_W))","v":1.0979541463414635},"m"]
["Clearwell Volume","clearwell_gal",{"$f":"AIRWELL_L*AIRWELL_W*AIRWELL_D*264.2","v":652.67884229268293},"gal"]
["Concrete Volume","Concrete_Vol",{"$f":"ROUNDUP((2*AIRWELL_D*AIRWELL_L+2*AIRWELL_D*AIRWELL_W+2*AIRWELL_W*AIRWELL_L)*1.2*conc_thick/3.28,0)","v":5},"m3"]
["Concrete Volume in yards","concrete_Vol_yd",{"$f":"CONCRETE_VOL*1.308","v":6.54},"cubic yd"]
["Excavation Volume in yards","x_vol_yd",{"$f":"IF(AW_DET=0,0,ROUNDUP(((AIRWELL_W*3.28+overexcavate)*(AIRWELL_L*3.28+overexcavate)*(AIRWELL_D*3.28+overexcavate)+0.5*(3*(AIRWELL_D*3.28+overexcavate)*(AIRWELL_W*3.28+overexcavate)*(AIRWELL_D*3.28+overexcavate)))/27,0))","v":52},"cubic yd"]
["Backfill Volume in yards","b_vol_yd",{"$f":"ROUNDUP(x_vol_yd-((AIRWELL_W*3.28)*(AIRWELL_L*3.28)*(AIRWELL_D*3.28))/27,0)","v":49},"cubic yd"]
[]
["Tower Design"]
["1. Start with liquid loading of 25gpm and minimum feasible air to water ratio; macro modifies these to obtain realistic designs"]
["Liquid Loading","L_Load",6.5861483130000027E-3,"m3/m2 - sec"]
["Ratio","Ratio",93,null,"Air to Water Ratio, selected by design macro"]
[]
["2. Calculate tower diameter using Cummins' approach"]
["Total Operating Area","Tot_Area",{"$f":"QW/L_LOAD","v":0.20875630712508669},"m2"]
["Maximum Tower Area, m2","Max_Area",{"$f":"Max_Area_cda","v":7.258},"m2"]
["Minimum Tower Area, m2","Min_Area",{"$f":"Min_Area_cda","v":1.8249999999999999E-2},"m2"]
["Number of Operating Towers","Num_col",{"$f":"IF(TOT_AREA>MAX_AREA,ROUNDUP(TOT_AREA/MAX_AREA,0),min_col)","v":2},"units","Rounded up to the next whole integer if greater than one as per Cummins"]
["Tower Diameter","D",{"$f":"ROUND(SQRT((4*TOT_AREA)/(PI()*NUM_COL)),2)","v":0.36},"m"]
["Number of redundant towers","NRD_col",{"$f":"IF(NRD_I<>\"\",NRD_I,IF(design_flow>=1,IF(redund_freq=0,0,ROUNDUP(NUM_COL/redund_freq,0)),NRD_small))","v":0},"units"]
["Total Number of Towers (including redundancy)","TOT_COL",{"$f":"NUM_COL+NRD_col","v":2},"units"]
[]
["3. Calculate packing height using Cummins' approach"]
["Strip_Factor","Strip_Factor",{"$f":"RATIO*DES_HENRY/OP_PRESS","v":12.422142857142859}]
["Design Henry","Des_Henry",{"$f":"HENRY/SF_HENRY","v":0.13357142857142859},"atm m3/m3","Henry with Safety Factor"]
["Design Kla","Des_Kla",{"$f":"DES_KLA","v":4.6426691047512965E-3},"/s","Calculated on Onda, displayed here for reference"]
["HTU","HTU",{"$f":"L_LOAD/DES_KLA","v":1.4186124757975438}]
["NTU","NTU",{"$f":"IF(STRIP_FACTOR<=P_REM,1000000,(STRIP_FACTOR/(STRIP_FACTOR-1))*LN(((1/(1-P_REM))*(STRIP_FACTOR-1)+1)/(STRIP_FACTOR)))","v":2.4223801642759848}]
["Packing Height","Pack_ht",{"$f":"HTU*NTU","v":3.4364187221664158},"m"]
[]
["4. Calculate other design parameters"]
["Gas Loading","G_Load",{"$f":"L_LOAD*RATIO","v":0.61251179310900028},"m3/m2 . s"]
["Air_Flow","Air_Flow",{"$f":"TOT_AREA*GAS_L","v":0.12786570000000003},"m3/s"]
[]
["5. Calculate air gradient using approach from Cummins' FNDel_p"]
["Conversion factor for N/m2 to psi","N_m2_to_psi",1.45E-4]
["Min_del_p","Min_del_p",0.4,"N/m2 (or pascal)"]
["Max_del_p","Max_del_p",1500,"N/m2 (or pascal)"]
["Air Gradient","AIR_GRADIENT",{"$f":"AIR_GRADIENT","v":20.321428509599155},"N/m2 . m","Calculated below, displayed here for reference"]
["Air Pressure","Air_P",{"$f":"AIR_GRADIENT*PACK_HT+500","v":569.83293739155295},"N/m2 . m"]
["Air Pressure in psi","Air_P_psi",{"$f":"AIR_P*N_m2_to_psi","v":8.2625775921775182E-2},"psi","Calculated for reference"]
[]
["6. Calculate additional tower dimensions"]
["Tower Volume","col_vol",{"$f":"Shell_Height*AREA*264.17","v":121.32373803711515},"gal"]
["Shell Height","Shell_height",{"$f":"ROUND(PACK_HT+Free_Board_Col,1)","v":4.4000000000000004},"m","Packing Height plus freeboard above packing from CDA"]
["Area Per Tower","Area",{"$f":"TOT_AREA/NUM_COL","v":0.10437815356254335},"m2","Cross-sectional area per tower"]
["Number of redistribution rings","N_R",{"$f":"IF(PACK_HT<=ring_space,0,ROUNDUP(PACK_HT/ring_space,0)-1)","v":1},"units","Changed from original Cummins design to round up, remove extra ring at top"]
["Total redistribution rings","tot_R",{"$f":"N_R*TOT_COL","v":2},"units"]
[]
["7. Calculate packing parameters"]
["Nominal packing size","DP",{"$f":"Packing_size*(2.54/100)","v":5.0799999999999998E-2},"m","Calculated based on packing size in Input"]
["Total Packing Volume","Pv",{"$f":"PACK_HT*AREA*TOT_COL","v":0.71737408217497023},"m3"]
["Total Packing Volume (cubic feet)","Pv_ft",{"$f":"PV*(3.28)^3","v":25.314375228201527},"ft3"]
[]
["Internal Use - Air Gradient Calculations",null,"From Cummins' FNDel_p -- actual air gradient found in final column"]
["Log_step",null,{"$f":"(LN(MAX_DEL_P)-LN(MIN_DEL_P))/2","v":4.1147555594822283},{"$f":"C76*0.5","v":2.0573777797411141},1.0286888898705571,0.51434444493527853,0.25717222246763927,0.12858611123381963,6.4293055616909817E-2,3.2146527808454908E-2,1.6073263904227454E-2,8.0366319521137271E-3,4.0183159760568635E-3,2.0091579880284318E-3,1.0045789940142159E-3,5.0228949700710794E-4,2.5114474850355397E-4,1.2557237425177699E-4,6.2786187125888493E-5]
["Air gradient",null,{"$f":"SQRT(MAX_DEL_P*MIN_DEL_P)","v":24.494897427831781},{"$f":"C77*EXP(SIGN(L_LOAD-C90)*D76)","v":3.1301691601465746},{"$f":"D77*EXP(SIGN(L_LOAD-D90)*E76)","v":8.7563218596367669},14.645313441401102,18.940312841808236,21.539290153371759,20.198041833191176,20.857887802341001,20.52531340524893,20.361020082465846,20.279367233523111,20.320152644639851,20.340576099911317,20.330361807653869,20.325256585152445,20.322704454667669,{"$f":"R77*EXP(SIGN(L_LOAD-R90)*S76)","v":20.321428509599155},"Air_Gradient","N/m2 . m","In Cummins model, this is called del_p but actually its air gradient"]
["Mass Ratio",null,{"$f":"RATIO*1.29/PW","v":0.12000600180054015},{"$f":"RATIO*1.29/PW","v":0.12000600180054015},0.12000600180054015,0.12000600180054015,0.12000600180054015,0.12000600180054015,0.12000600180054015,0.12000600180054015,0.12000600180054015,0.12000600180054015,0.12000600180054015,0.12000600180054015,0.12000600180054015,0.12000600180054015,0.12000600180054015,0.12000600180054015,0.12000600180054015]
["X_Axis",null,{"$f":"SQRT(PA/(PW-PA))/C78","v":0.29448721636074032},{"$f":"SQRT(PA/(PW-PA))/D78","v":0.29448721636074032},0.29448721636074032,0.29448721636074032,0.29448721636074032,0.29448721636074032,0.29448721636074032,0.29448721636074032,0.29448721636074032,0.29448721636074032,0.29448721636074032,0.29448721636074032,0.29448721636074032,0.29448721636074032,0.29448721636074032,0.29448721636074032,0.29448721636074032,"X_Axis",null,"X Axis in Treybal"]
["X_11",null,{"$f":"LOG10(X_AXIS)","v":-0.5309335531162348},{"$f":"LOG10(D79)","v":-0.5309335531162348},-0.5309335531162348,-0.5309335531162348,-0.5309335531162348,-0.5309335531162348,-0.5309335531162348,-0.5309335531162348,-0.5309335531162348,-0.5309335531162348,-0.5309335531162348,-0.5309335531162348,-0.5309335531162348,-0.5309335531162348,-0.5309335531162348,-0.5309335531162348,-0.5309335531162348,"X_11"]
["Y_11",null,{"$f":"LOG10(C77)","v":1.3890756251918217},0.49556780825989211,0.94232171672585696,1.1656986709588393,1.2773871480753305,1.3332313866335761,1.3053092673544533,1.3192703269940147,1.312289797174234,1.3087995322643435,1.3070543998093984,1.3079269660368711,1.3083632491506072,1.3081451075937391,1.308036036815305,1.307981501426088,{"$f":"LOG10(AIR_GRADIENT)","v":1.3079542337314796},"Y_11"]
["Z",null,-4.1088300999999996,-4.1088300999999996,-4.1088300999999996,-4.1088300999999996,-4.1088300999999996,-4.1088300999999996,-4.1088300999999996,-4.1088300999999996,-4.1088300999999996,-4.1088300999999996,-4.1088300999999996,-4.1088300999999996,-4.1088300999999996,-4.1088300999999996,-4.1088300999999996,-4.1088300999999996,-4.1088300999999996]
["Z",null,{"$f":"Z-0.43342855*X_11","v":-3.8787083399264821},{"$f":"D82-0.43342855*D80","v":-3.8787083399264821},-3.8787083399264821,-3.8787083399264821,-3.8787083399264821,-3.8787083399264821,-3.8787083399264821,-3.8787083399264821,-3.8787083399264821,-3.8787083399264821,-3.8787083399264821,-3.8787083399264821,-3.8787083399264821,-3.8787083399264821,-3.8787083399264821,-3.8787083399264821,-3.8787083399264821]
["Z",null,{"$f":"C83-0.28514237*X_11*X_11","v":-3.9590872474481347},{"$f":"D83-0.28514237*D80*D80","v":-3.9590872474481347},-3.9590872474481347,-3.9590872474481347,-3.9590872474481347,-3.9590872474481347,-3.9590872474481347,-3.9590872474481347,-3.9590872474481347,-3.9590872474481347,-3.9590872474481347,-3.9590872474481347,-3.9590872474481347,-3.9590872474481347,-3.9590872474481347,-3.9590872474481347,-3.9590872474481347]
["Z",null,{"$f":"C84+1.2885509*Y_11","v":-2.1691926004391502},{"$f":"D84+1.2885509*D81","v":-3.3205229021038232},-2.7448577512714865,-2.4570251758553185,-2.3131088881472346,-2.2411507442931926,-2.2771298162202136,-2.2591402802567027,-2.2681350482384581,-2.2726324322293356,-2.2748811242247746,-2.2737567782270549,-2.2731946052281957,-2.2734756917276253,-2.2736162349773403,-2.2736865066021976,-2.2737216424146265]
["Z",null,{"$f":"C85-0.15087096*Y_11*Y_11","v":-2.4603028087147836},{"$f":"D85-0.15087096*D81*D81","v":-3.3575749168390523},-2.8788266704843681,-2.6620366915264384,-2.5592877381023267,-2.5093247704039841,-2.5341886285020125,-2.5217272930152124,-2.5279506091491659,-2.5310677809232276,-2.5326277452370296,-2.5318476482112309,-2.5314576858500053,-2.531652659851312,-2.531750152236445,-2.5317988997751311,-2.5318232738810047]
["Z",null,{"$f":"C86-0.17824779*X_11*Y_11","v":-2.3288438413036463},{"$f":"D86-0.17824779*D80*D81","v":-3.3106755031753434},-2.7896474799469453,-2.5517176125521583,-2.438398714909618,-2.3831507751020609,-2.4106571192546964,-2.3968745407405927,-2.4037584783881982,-2.4072059609190859,-2.4089310806113007,-2.4080684058962953,-2.4076371546904669,-2.4078527731140751,-2.4079605877103587,-2.4080144963546202,-2.4080414510132817]
["Y_Axis",null,{"$f":"10^C87","v":4.6898198306722302E-3},4.8901760780713818E-4,1.6231270670721337E-3,2.8072583833556042E-3,3.6441922911468133E-3,4.1385597046317427E-3,3.88456936403026E-3,4.009825369816024E-3,3.9467673028177417E-3,3.915561404897492E-3,3.9000387255578414E-3,3.9077933913574349E-3,3.9116757285161024E-3,3.9097341426769421E-3,3.9087636627201027E-3,3.9082785009667354E-3,3.90803593964435E-3]
["Test Gas Loading (compare to G_load)",null,{"$f":"SQRT(Y_AXIS*PA*(PW-PA)/(CF*UW^0.1))/1.296","v":0.6709817512073587},{"$f":"SQRT(D88*PA*(PW-PA)/(CF*UW^0.1))/1.296","v":0.21666805154816338},0.39473795734218248,0.51912724604618254,0.59147074948442668,0.63031441863371507,0.61066646301796013,0.62043367107168146,0.6155359039414281,0.6130976464239537,0.61188117092533134,0.61248918766705107,0.61279336178628108,0.6126412609127756,0.61256522083655496,0.61252720338847799,0.61250819531193457,null,"m3/m2 . s"]
["Test Liquid Loading (compare to L_load)",null,{"$f":"C89/RATIO","v":7.2148575398640717E-3},2.3297639951415415E-3,4.2444941649697043E-3,5.5820133983460491E-3,6.3599005320906093E-3,6.7775743939109149E-3,6.5663060539565606E-3,6.6713297964696933E-3,6.6186656337787969E-3,6.592447811010255E-3,6.5793674293046379E-3,6.5859052437317323E-3,6.5891759331858177E-3,6.5875404399223184E-3,6.5867228046941392E-3,{"$f":"R89/RATIO","v":6.5863140149298709E-3},6.5861096270100495E-3,null,"m3/m2 . s"]
["Range Check ",null,{"$f":"IF(X_AXIS<0.015,\"X_Axis Out of Range\",IF(OR(C77<20,C77>1500),\"Del_p Out of Range\",\"Range is OK\"))","v":"Range is OK"},{"$f":"IF(D79<0.015,\"X_Axis Out of Range\",IF(OR(D77<20,D77>1500),\"Del_p Out of Range\",\"Range is OK\"))","v":"Del_p Out of Range"},"Del_p Out of Range","Del_p Out of Range","Del_p Out of Range","Range is OK","Range is OK","Range is OK","Range is OK","Range is OK","Range is OK","Range is OK","Range is OK","Range is OK","Range is OK","Range is OK",{"$f":"IF(S79<0.015,\"X_Axis Out of Range\",IF(OR(AIR_GRADIENT<20,AIR_GRADIENT>1500),\"Del_p Out of Range\",\"Range is OK\"))","v":"Range is OK"}]

{"sheet":"Retrofit","index":11,"n_rows":135,"n_cols":22,"rows_kept":135,"cut":false,"hidden":false,"merged":[]}
["Retrofit Calculations"]
[]
["Calculation","Range Name","Value","Units","Guidance"]
["1. INITIAL CALCULATIONS"]
["Is this a retrofit design?","retrofit",{"$f":"IF(retrofit_I=\"\",0,1)","v":0},"1 = retrofit, 0 = new treatment system"]
["Is there a new contaminant?","r_new_contam",{"$f":"IF(AND(retrofit=1,retrofit_I=\"retrofit for new contaminant\"),1,0)","v":0},"1 = new contaminant, 0 = same contaminant"]
["Percent removal or effluent concentration?","r_units_rem",{"$f":"IF(r_new_contam=1,IF(r_units_rem_I=\"percent removal\",1,2),Units_rem)","v":2},"1 = percent removal, 2 = effluent concentration"]
["Influent concentration","r_influent_conc",{"$f":"IF(r_new_contam=1,r_influent_conc_I,Influent_conc)","v":5},"ug/L"]
["Percent removal for retrofit","r_Rem_in",{"$f":"IF(r_units_rem=1,r_rem_I,IF(r_units_rem=2,1-r_rem_I/r_influent_conc,\"Error\"))","v":1}]
[null,"r_P_REM",{"$f":"r_Rem_in","v":1}]
["Additional available height per tower","r_xtraheight",{"$f":"IF(r_xtraheight_I=\"\",0,IF(r_xtraheight_units=\"meters\",r_xtraheight_I,IF(r_xtraheight_units=\"feet\",r_xtraheight_I/3.3,IF(r_xtraheight_units=\"fraction\",PACK_HT*r_xtraheight_I,\"Error\"))))","v":0},"meters"]
["Design Henry's coefficient for retrofit","r_DES_HENRY",{"$f":"IF(r_new_contam=1,r_Henry,HENRY)/SF_HENRY","v":0.13357142857142859},"atm m3/m3"]
["Molecular weight for retrofit","r_Mw",{"$f":"IF(r_new_contam=1,r_Mw_in,MW_IN)","v":131.38999999999999},"kg/kilomole"]
["Molar volume for retrofit","r_Mv",{"$f":"IF(r_new_contam=1,r_Mv_in,MV_IN)","v":0.10199999999999999},"m3/kilomole"]
["Boiling point for retrofit","r_Tb",{"$f":"IF(r_new_contam=1,r_Tb_in,TB_IN)","v":359.7},"degrees Kelvin"]
["Melting point for retrofit","r_Tm",{"$f":"IF(r_new_contam=1,r_Tm_in,TM_IN)","v":0},"degrees Kelvin"]
[]
["2. AIR TO WATER RATIO FOR RETROFIT"]
["Air to Water Ratio","r_RATIO",40,null,"Air to Water Ratio, selected by design macro"]
["Gas Loading","r_G_Load",{"$f":"L_LOAD*r_RATIO","v":0.26344593252000009},"m3/m2 . s"]
[]
["3. ONDA CALCULATIONS"]
["Henry's Co-efficient for Onda","r_ONDA_H",{"$f":"IF(r_new_contam=1,r_Henry,HENRY)","v":0.187},"atm m3/m3"]
["Reynold's number","r_NR",{"$f":"PW*L_LOAD/(AP*UW)","v":32.086766838562092}]
["Froude number","r_FR",{"$f":"(L_LOAD^2*AP)/(G)","v":6.9421446354034117E-4}]
["Weber number","r_NW",{"$f":"(PW*L_LOAD^2)/(SW*AP)","v":3.7224523491297861E-3}]
["Wetted Surface Area","r_AW",{"$f":"AP*(1-EXP(-1.45*((SP/SW)^0.75)*(r_NR^0.1)*(r_FR^(-0.05))*(r_NW^0.2)))","v":64.127488195152893}]
["Liquid phase Reynold's number","r_NRW",{"$f":"(PW*L_LOAD)/(r_AW*UW)","v":78.556365381468652}]
["X_1","r_X_1",7.4815000000000004E-16,null,"Calculated value in Cummins' original program"]
["Diffusion Co-efficient Through Water, Dw","r_DW",{"$f":"r_X_1*T/(UW*(r_Mv^0.6))","v":6.37293406367019E-10},"m2/s"]
["Schmidt number","r_SCW",{"$f":"UW/(PW*r_DW)","v":2051.4761405084564}]
["Air phase Reynold's number","r_NRA",{"$f":"(r_G_Load*MWA)/(AP*UA*GO)","v":121.36369596852907}]
["X","r_X",{"$f":"SQRT((1/r_Mw)+(1/MWA))","v":0.20516746310064984}]
["Radius","r_Radius",{"$f":"1.18*(r_Mv^(1/3))","v":0.55133478994592056}]
["Molecular separation at collision","r_R_ab",{"$f":"(RA+r_Radius)/2","v":0.46121739497296027}]
["E_kc","r_E_kc",{"$f":"IF(r_Tb>0,1.15*r_Tb,1.92*r_Tm)","v":413.65499999999997}]
["K_te","r_Kt_e",{"$f":"T/(SQRT(E_KA*r_E_kc))","v":1.5694808586319255}]
["Collision Integral","r_F_KT_E",{"$f":"EXP(-0.33789+LN(r_Kt_e)*(-0.44268+LN(r_Kt_e)*(0.081488*LN(r_Kt_e)*(-0.0070712))))","v":0.58421949334746248}]
["Diffusion Co-efficient Through Air","r_DA",{"$f":"0.0001*(1.084-0.249*r_X)*(T^1.5)*X/(P_S*(r_R_ab^2)*r_F_KT_E)","v":8.0121302121808956E-6}]
["Schmidt number","r_SCA",{"$f":"UA/(PA*r_DA)","v":1.7915897896682653}]
["Nominal packing size","r_DP",{"$f":"Packing_size*(2.54/100)","v":5.0799999999999998E-2}]
["Shape factor","r_SHAPE",{"$f":"AP*r_DP","v":7.9756},"m2/s"]
["Liquid phase Sherwood number","r_SHW",{"$f":"0.0051*(r_NRW^(2/3))*(r_SCW^(-0.5))*(r_SHAPE^0.4)","v":4.7391072921478504E-3}]
["Liquid phase co-efficient","r_ONDA_KL",{"$f":"(r_SHW)/((PW)/(UW*G))^(1/3)","v":1.1093148890868957E-4},"meters"]
["Air phase Sherwood number","r_SHA",{"$f":"5.23*(r_NRA^0.7)*(r_SCA^0.33)*(r_SHAPE^(-2))","v":2.8668557817092561}]
["Air phase co-efficient","r_ONDA_KG",{"$f":"(r_SHA)/((R_C*T/(AP*r_DA)))","v":1.5521150308586525E-4}]
["Overall coefficient","r_KLA",{"$f":"(r_AW/((1/r_ONDA_KL)+(1/(r_ONDA_KG*r_ONDA_H*R_C*TS/PS))))","v":6.0774170213408326E-3}]
["Design Kla (with Safety Factor)","r_DES_KLA",{"$f":"r_KLA/SF_KLA","v":4.3410121581005951E-3}]
[]
["4. PACKING HEIGHT REQUIRED FOR RETROFIT"]
["Strip Factor","r_Strip_Factor",{"$f":"r_RATIO*r_DES_HENRY/OP_PRESS","v":5.3428571428571434}]
["HTU","r_HTU",{"$f":"L_LOAD/r_DES_KLA","v":1.5171918605917392}]
["NTU","r_NTU",{"$f":"IF(retrofit=0,0,IF(r_Strip_Factor<=r_P_REM,1000000,(r_Strip_Factor/(r_Strip_Factor-1))*LN(((1/(1-r_P_REM))*(r_Strip_Factor-1)+1)/(r_Strip_Factor))))","v":0}]
["New packing height required","r_Pack_ht",{"$f":"r_HTU*r_NTU","v":0},"meters"]
["Check","r_Check_Pack",{"$f":"IF(r_Pack_ht<=(PACK_HT+r_xtraheight),TRUE,FALSE)","v":true}]
["Packing height for retrofit","New_Pack_ht",{"$f":"MAX(r_Pack_ht,PACK_HT)","v":3.4364187221664158},"meters","Assume the system won't remove any packing, even if new ratio allows slightly less packing height"]
[]
["5. AIR GRADIENT CALCULATIONS"]
["Min_del_p","Min_del_p",{"$f":"MIN_DEL_P","v":0.4},"N/m2 or pascal","From tower design page"]
["Max_del_p","Max_del_p",{"$f":"MAX_DEL_P","v":1500},"N/m2 or pascal","From tower design page"]
["Air Gradient","r_Air_Gradient",{"$f":"r_Air_Gradient","v":5.6333425715413092},"N/m2 . m","Calculated below, displayed here for reference"]
["Check","Check_Gradient",{"$f":"IF(r_Air_Gradient<20,FALSE,TRUE)","v":false}]
["Air Pressure","r_Air_P",{"$f":"r_Air_Gradient*New_Pack_ht+500","v":519.35852388122169},"N/m2 . m"]
["Air Pressure in psi","r_Air_P_psi",{"$f":"r_Air_P*N_m2_to_psi","v":7.5306985962777143E-2},"psi","Calculated for reference"]
[]
["6. EQUIPMENT CALCULATIONS"]
["New Blowers"]
["Design air flow","r_Air_Flow",{"$f":"TOT_AREA*r_G_Load","v":5.4996000000000003E-2},"m3/s"]
["Design air flow","r_design_air_flow",{"$f":"r_Air_Flow*35.31*60","v":116.51452560000001},"cfm"]
["Flow per blower","r_Q_Blower",{"$f":"IF(parallel_I=\"\",MIN(MAX(r_design_air_flow*average_flow/design_flow,r_design_air_flow/2),max_blow_size),r_design_air_flow/parallel_I)","v":58.257262800000007},"cfm"]
["Number of operating blowers","r_Parallel",{"$f":"IF(r_RATIO=RATIO,0,ROUNDUP(r_design_air_flow/r_Q_Blower,0))","v":2},"units"]
["Total blowers","r_tot_blowers",{"$f":"IF(r_Parallel=0,0,r_Parallel+NRD_blower)","v":2},"units","Includes redundancy"]
[]
["Incremental materials for blowers","r_blow_materials",{"$f":"IF(r_tot_blowers=0,0,pump_maintenance*(SUMPRODUCT(OUTPUT!J259:J260,OUTPUT!L259:L260)-SUMPRODUCT(OUTPUT!J62:J63,OUTPUT!L259:L260)))","v":0}]
[]
["Incremental blowers for O&M","r_blowers_added",{"$f":"IF(r_Parallel=0,0,r_Parallel-PARALLEL)","v":0},"units"]
["Incremental labor hours for blowers","r_blower_labor",{"$f":"IF(OR(manual=1,manual=2),r_blowers_added*uloe_pump*365/60,0)+r_blowers_added*uloe_pump_maint","v":0},"hr/yr","Includes both operation and maintenance"]
[]
["Incremental daily air flow","r_Daily_Air",{"$f":"(r_Air_Flow-AIR_FLOW)*QWA/QW","v":-1.7002930000000006E-2},"m3/s"]
["Incremental operating power","r_blower_pwr",{"$f":"r_Daily_Air*(r_Air_P/BLOW_EFF)","v":-12.615166609222491},"Watts"]
["Incremental energy for all active blowers","r_blow_energy",{"$f":"r_blower_pwr*24*365/1000000","v":-0.11050885949678903},"MWhr/yr"]
[]
["Additonal Packing"]
["Additional packing volume","r_Pv",{"$f":"New_Pack_ht*AREA*TOT_COL-PV","v":0},"m3"]
["Additional packing volume (cubic feet)","r_Pv_ft",{"$f":"r_Pv*(3.28)^3","v":0},"ft3"]
[]
["Incremental Equipment"]
["Incremental packing height increase","r_pack_ht_added",{"$f":"New_Pack_ht-PACK_HT","v":0},"meters"]
["New shell height","r_Shell_height",{"$f":"Shell_Height+r_xtraheight","v":4.4000000000000004},"meters"]
["New tower volume","r_col_vol",{"$f":"r_Shell_height*AREA*264.17","v":121.32373803711515},"gal"]
[]
["Original actual ring space","r_ring_space",{"$f":"Shell_Height/(N_R+1)","v":2.2000000000000002},"meters"]
["in feet","r_ring_space_ft",{"$f":"ROUNDUP(r_ring_space*3.3,1)","v":7.3},"feet"]
["Additional redistribution rings per tower","r_N_R",{"$f":"IF(r_xtraheight<=r_ring_space,0,ROUNDUP(r_xtraheight/r_ring_space,0)-1)","v":0},"units"]
["Total additional redistribution rings","r_tot_R",{"$f":"r_N_R*TOT_COL","v":0},"units"]
[]
["Incremental process pipe length","r_proc_pipe_length",{"$f":"r_xtraheight*3.28*TOT_COL","v":0},"feet"]
[]
["Incremental materials for towers","r_pta_materials",{"$f":"PTA_maintenance*SUMPRODUCT(OUTPUT!J263:J268,OUTPUT!L263:L268)","v":0}]
[]
["Incremental pump operating head","r_Head_O",{"$f":"r_pack_ht_added","v":0},"m - H20"]
["Incremental pressure head","r_Press_H",{"$f":"r_Head_O*PW*G","v":0},"N/m2"]
["Incremental pump operating power","r_PWR",{"$f":"IF(NUM_OF_PUMPS=0,0,QWA*(1+bp_pct)*(r_Press_H/PUMP_EFF))","v":0},"Watts"]
["Incremental energy for all active booster pumps","r_pump_energy",{"$f":"r_PWR*24*365/1000000","v":0},"MWhr/yr"]
[]
["Incremental lighting","r_lighting",{"$f":"MIN(1,(r_blower_labor+Operator_LOE)/(24*365))*(total_fp*lighting_energy_1)/1000-lighting","v":0},"MWhr/yr","If operator labor increases, lighting usage will increase"]
[]
["Standby Power"]
["Additional standby power for new blowers","r_std_power_blow",{"$f":"r_blow_energy*design_flow/average_flow/365/24*1000","v":-5.4064999753810676E-2},"kW"]
["Supplemental standby generator cost",null,{"$f":"IF(ISERROR(VLOOKUP(r_std_power_blow,std_gen_cost_cl,3)),0,VLOOKUP(r_std_power_blow,std_gen_cost_cl,3)*r_std_power_blow)","v":0}]
[]
["Incremental standby power useage for pumps",null,{"$f":"r_pump_energy*design_flow/average_flow/365/24*1000","v":0},"kW"]
["Total standby power required","r_std_power_pumps",{"$f":"std_power+C112","v":1.5},"kW"]
["Total standby power cost",null,{"$f":"VLOOKUP(r_std_power_pumps,std_gen_cost_cl,3)*r_std_power_pumps","v":1396.9796367638967}]
["Incremental standby power cost for pumps (opportunity cost)",null,{"$f":"C114-std_power_cost","v":0}]
[]
["Retrofit standby power cost","r_std_power_cost",{"$f":"C115+C110","v":0}]
[]
["Internal Use - Air Gradient Calculations",null,"From Cummins' FNDel_p -- actual air gradient found in final column"]
["Log_step",null,{"$f":"(LN(MAX_DEL_P)-LN(MIN_DEL_P))/2","v":4.1147555594822283},{"$f":"C120*0.5","v":2.0573777797411141},1.0286888898705571,0.51434444493527853,0.25717222246763927,0.12858611123381963,6.4293055616909817E-2,3.2146527808454908E-2,1.6073263904227454E-2,8.0366319521137271E-3,4.0183159760568635E-3,2.0091579880284318E-3,1.0045789940142159E-3,5.0228949700710794E-4,2.5114474850355397E-4,1.2557237425177699E-4,6.2786187125888493E-5]
["Air gradient",null,{"$f":"SQRT(MAX_DEL_P*MIN_DEL_P)","v":24.494897427831781},{"$f":"C121*EXP(SIGN(L_LOAD-C134)*D120)","v":3.1301691601465746},{"$f":"D121*EXP(SIGN(L_LOAD-D134)*E120)","v":8.7563218596367669},5.2353384457313075,6.7706948295543352,5.9537281551545496,5.5829904089218658,5.7653800557774089,5.6734523488961006,5.6280396275579081,5.6507003676224725,5.6393586153422905,5.6336962787459983,5.6308672428328483,5.6322815831650459,5.6329888865438509,{"$f":"R121*EXP(SIGN(L_LOAD-R134)*S120)","v":5.6333425715413092},"Air_Gradient","N/m2 . m","In Cummins model, this is called del_p but actually it's air gradient"]
["Mass Ratio",null,{"$f":"r_RATIO*1.29/PW","v":5.1615484645393617E-2},5.1615484645393617E-2,5.1615484645393617E-2,5.1615484645393617E-2,5.1615484645393617E-2,5.1615484645393617E-2,5.1615484645393617E-2,5.1615484645393617E-2,5.1615484645393617E-2,5.1615484645393617E-2,5.1615484645393617E-2,5.1615484645393617E-2,5.1615484645393617E-2,5.1615484645393617E-2,5.1615484645393617E-2,5.1615484645393617E-2,5.1615484645393617E-2]
["X_Axis",null,{"$f":"SQRT(PA/(PW-PA))/C122","v":0.68468277803872124},0.68468277803872124,0.68468277803872124,0.68468277803872124,0.68468277803872124,0.68468277803872124,0.68468277803872124,0.68468277803872124,0.68468277803872124,0.68468277803872124,0.68468277803872124,0.68468277803872124,0.68468277803872124,0.68468277803872124,0.68468277803872124,0.68468277803872124,0.68468277803872124,"X_Axis",null,"X Axis in Treybal"]
["X_11",null,{"$f":"LOG10(C123)","v":-0.16451059589026204},{"$f":"LOG10(D123)","v":-0.16451059589026204},-0.16451059589026204,-0.16451059589026204,-0.16451059589026204,-0.16451059589026204,-0.16451059589026204,-0.16451059589026204,-0.16451059589026204,-0.16451059589026204,-0.16451059589026204,-0.16451059589026204,-0.16451059589026204,-0.16451059589026204,-0.16451059589026204,-0.16451059589026204,-0.16451059589026204,"X_11"]
["Y_11",null,{"$f":"LOG10(C121)","v":1.3890756251918217},0.49556780825989211,0.94232171672585696,0.71894476249287442,0.83063323960936564,0.77478900105112003,0.74686688177199723,0.76082794141155863,0.75384741159177793,0.75035714668188758,0.7521022791368327,0.75122971290936014,0.75079342979562391,0.75057528823875574,0.75068435901718977,0.75073889440640673,{"$f":"LOG10(AIR_GRADIENT)","v":1.3079542337314796},"Y_11"]
["Z",null,-4.1088300999999996,-4.1088300999999996,-4.1088300999999996,-4.1088300999999996,-4.1088300999999996,-4.1088300999999996,-4.1088300999999996,-4.1088300999999996,-4.1088300999999996,-4.1088300999999996,-4.1088300999999996,-4.1088300999999996,-4.1088300999999996,-4.1088300999999996,-4.1088300999999996,-4.1088300999999996,-4.1088300999999996]
["Z",null,{"$f":"C126-0.43342855*C124","v":-4.0375265109636471},{"$f":"D126-0.43342855*D124","v":-4.0375265109636471},-4.0375265109636471,-4.0375265109636471,-4.0375265109636471,-4.0375265109636471,-4.0375265109636471,-4.0375265109636471,-4.0375265109636471,-4.0375265109636471,-4.0375265109636471,-4.0375265109636471,-4.0375265109636471,-4.0375265109636471,-4.0375265109636471,-4.0375265109636471,-4.0375265109636471]
["Z",null,{"$f":"C127-0.28514237*C124*C124","v":-4.0452435288334128},{"$f":"D127-0.28514237*D124*D124","v":-4.0452435288334128},-4.0452435288334128,-4.0452435288334128,-4.0452435288334128,-4.0452435288334128,-4.0452435288334128,-4.0452435288334128,-4.0452435288334128,-4.0452435288334128,-4.0452435288334128,-4.0452435288334128,-4.0452435288334128,-4.0452435288334128,-4.0452435288334128,-4.0452435288334128,-4.0452435288334128]
["Z",null,{"$f":"C128+1.2885509*C125","v":-2.2553488818244283},{"$f":"D128+1.2885509*D125","v":-3.4066791834891013},-2.831014032656765,-3.1188466080729333,-2.9749303203648489,-3.0468884642188909,-3.0828675361459119,-3.0648780001824019,-3.0738727681641569,-3.0783701521550344,-3.0761214601595959,-3.0772458061573151,-3.0778079791561748,-3.0780890656556048,-3.0779485224058898,-3.0778782507810325,-2.3598779237999046]
["Z",null,{"$f":"C129-0.15087096*C125*C125","v":-2.5464590901000612},{"$f":"D129-0.15087096*D125*D125","v":-3.4437311982243304},-2.9649829518696467,-3.1968290269738513,-3.0790239774034642,-3.1374559991840862,-3.1670248873278259,-3.1522110368181711,-3.159610610463552,-3.1633159109933273,-3.1614628012528492,-3.1623892412541905,-3.1628525474065348,-3.163084222020625,-3.1629683829187534,-3.1629104647139377,-2.6179795552662828]
["Z",null,{"$f":"C130-0.17824779*C124*C125","v":-2.5057263224364017},{"$f":"D130-0.17824779*D124*D125","v":-3.4291993411897996},-2.9373506395205515,-3.1757469422820384,-3.0546667788830102,-3.1147363575779528,-3.1451240241788527,-3.1299007844406175,-3.1375050527002886,-3.1413127005372092,-3.1394084171431582,-3.1403604439712858,-3.1408365435370236,-3.1410746148578101,-3.1409555774025901,-3.1408960600211002,-2.5796255629054086]
["Y_Axis",null,{"$f":"10^C131","v":3.1208556212875098E-3},3.7222081766394982E-4,1.155179200082516E-3,6.6719542202270117E-4,8.817251347607287E-4,7.6782746456821615E-4,7.1593892588029144E-4,7.4147961465298028E-4,7.2860969762024712E-4,7.2224958248767832E-4,7.2542343731387044E-4,7.2383496177273634E-4,7.2304188541747578E-4,7.2264563731428311E-4,7.228437372013215E-4,7.2294280526763596E-4,2.6325367165332368E-3]
["Test Gas Loading (compare to G_load)",null,{"$f":"SQRT(C132*PA*(PW-PA)/(CF*UW^0.1))/1.296","v":0.54735547708789445},{"$f":"SQRT(D132*PA*(PW-PA)/(CF*UW^0.1))/1.296","v":0.18903096822388651},0.33301002642437721,0.25308077648840305,0.29093719003724045,0.27149663463749835,0.26216252865066769,0.2667977957594827,0.2644722457702432,0.26331541187154678,0.26389333451427205,0.26360424967519902,0.2634597999013169,0.26338759816933965,0.2634236971059401,0.26344174802126707,0.50271268962183502,null,"m3/m2 . s"]
["Test Liquid Loading (compare to L_load)",null,{"$f":"C133/r_RATIO","v":1.3683886927197362E-2},4.7257742055971629E-3,8.3252506606094311E-3,6.3270194122100765E-3,7.2734297509310115E-3,6.7874158659374587E-3,6.5540632162666927E-3,6.6699448939870672E-3,6.6118061442560798E-3,6.5828852967886693E-3,6.5973333628568014E-3,6.5901062418799753E-3,6.5864949975329226E-3,6.5846899542334912E-3,6.5855924276485029E-3,6.5860437005316767E-3,1.2567817240545875E-2,null,"m3/m2 . s"]
["Range Check ",null,{"$f":"IF(X_AXIS<0.015,\"X_Axis Out of Range\",IF(OR(C121<20,C121>1500),\"Del_p Out of Range\",\"Range is OK\"))","v":"Range is OK"},{"$f":"IF(D123<0.015,\"X_Axis Out of Range\",IF(OR(D121<20,D121>1500),\"Del_p Out of Range\",\"Range is OK\"))","v":"Del_p Out of Range"},"Del_p Out of Range","Del_p Out of Range","Del_p Out of Range","Del_p Out of Range","Del_p Out of Range","Del_p Out of Range","Del_p Out of Range","Del_p Out of Range","Del_p Out of Range","Del_p Out of Range","Del_p Out of Range","Del_p Out of Range","Del_p Out of Range","Del_p Out of Range",{"$f":"IF(S123<0.015,\"X_Axis Out of Range\",IF(OR(AIR_GRADIENT<20,AIR_GRADIENT>1500),\"Del_p Out of Range\",\"Range is OK\"))","v":"Range is OK"}]

{"sheet":"Chemical Use","index":12,"n_rows":122,"n_cols":5,"rows_kept":122,"cut":false,"hidden":false,"merged":[]}
["Chemical Use and Storage Calculations"]
[]
["Calculation","Range Name","Value","Units","Guidance"]
["Maximum Tank Sizes"]
["Maximum chemical storage tank size","max_ctank_size",{"$f":"MAX(VLOOKUP(10^6,fg_cst_cost_cl,1)-1,VLOOKUP(10^6,pl_cst_cost_cl,1)-1,VLOOKUP(10^6,ss_cst_cost_cl,1)-1)","v":30025},"gal","The largest size for which costs are available"]
["Maximum chemical storage tank size excluding stainless steel","max_ctank_size_noSS",{"$f":"MAX(VLOOKUP(10^6,fg_cst_cost_cl,1)-1,VLOOKUP(10^6,pl_cst_cost_cl,1)-1)","v":30025},"gal","The largest size for which costs are available (excluding stainless, which is not compatible with acids)"]
[]
["Chemical Use and Storage - pH adjustment"]
["Acid solution strength","acid_strength",{"$f":"CHOOSE(acid_type,0,hcl_strength,H2SO4_strength)","v":0}]
["Acid mg/meq","acid_molwt",{"$f":"CHOOSE(acid_type,0,hcl_molwt,H2SO4_molwt)","v":0}]
["Maximum chemical tank mixer horsepower","cmix_hp_max",{"$f":"MAX(VLOOKUP(10^6,port_mix_cost_cl,1)-0.1,VLOOKUP(10^6,mount_mix_cost_cl,1)-0.1,VLOOKUP(10^6,imp_mix_cost_cl,1)-0.1)","v":20},"hp"]
[]
["Original pH"]
["llo","llo",{"$f":"10^(pHo-6.3)","v":15.848931924611144}]
["hlo","hlo",{"$f":"10^(pHo-10.3)","v":1.5848931924611095E-3}]
["do","do",{"$f":"1+llo+(hlo*llo)","v":16.87405078892624}]
["carbonic","carlo",{"$f":"1/do","v":5.9262592753143765E-2}]
["bicarbonate","bicarlo",{"$f":"llo/do","v":0.9392487982205292},null,"For reference"]
["carbonate","crbatelo",{"$f":"(hlo*llo)/do","v":1.488609026326995E-3}]
["Mole fraction at pH 4.3"]
["pHa","pHa",4.3]
["lalo","lalo",{"$f":"10^(pHa-6.3)","v":0.01}]
["halo","halo",{"$f":"10^(pHa-10.3)","v":9.9999999999999699E-7}]
["da","da",{"$f":"1+lalo+(halo*lalo)","v":1.0100000099999999}]
["carbonic","caralo",{"$f":"1/da","v":0.99009900009802976}]
["bicarbonate","bicaralo",{"$f":"lalo/da","v":9.9009900009802976E-3},null,"For reference"]
["carbonate","crbatealo",{"$f":"(halo*lalo)/da","v":9.9009900009802675E-9}]
["Mole fraction at final pH"]
["flc","flc",{"$f":"10^(pHf_selected-6.3)","v":0.1584893192461114}]
["fbc","fbc",{"$f":"10^(pHf_selected-10.3)","v":1.5848931924611101E-5}]
["dc","dc",{"$f":"1+flc+(fbc*flc)","v":1.1584918311325429}]
["carbonic","fcc",{"$f":"1/dc","v":0.86319123978837109}]
["bicarbonate","flbc",{"$f":"flc/dc","v":0.13680659197326583},null,"For reference"]
["carbonate","flcc",{"$f":"(fbc*flc)/dc","v":2.1682383630223377E-6}]
[]
["Alkalinity in meq","alk",{"$f":"alk_ppm/50","v":2},"meq/L"]
["Ct","Ct",{"$f":"alk/((caralo-carlo)+(crbatelo-crbatealo))","v":2.1451746827771876}]
["meq of acid required per liter","acid",{"$f":"Ct*((fcc-carlo)+(crbatelo-flcc)+10^(-pHf_selected)-10^(-pHo))","v":1.7277627713266719},"meq/L"]
["Weight of acid required per liter","mg_per_liter",{"$f":"acid*acid_molwt","v":0},"mg/L"]
["Average HCl per day","design_hcl_day",{"$f":"1000000*3.7854*mg_per_liter*2.2*average_flow/1000000","v":0},"lbs"]
["Initial HCl","HCl_init",{"$f":"cstore_days*design_hcl_day","v":0},"lbs"]
["Acid storage volume","HCl_store",{"$f":"IF(acid_type=1,0,cstore_days*design_hcl_day/VLOOKUP(acid_strength,IF(acid_type=2,hcl_table_cl,h2so4_table_cl),4))","v":0},"gal"]
["Number of acid tanks","HCl_tanks",{"$f":"ROUNDUP(HCl_store/max_ctank_size_noSS,0)","v":0},"unit"]
["Acid tank volume","HCl_tank_vol",{"$f":"IF(acid_type=1,0,HCl_store/HCl_tanks)","v":0},"gal"]
["Annual acid use","HCl_yr",{"$f":"design_hcl_day*365*(chem_freq/365)","v":0},"lbs"]
["Design acid flow","HCl_flow",{"$f":"IF(acid_type=1,0,(design_hcl_day/VLOOKUP(acid_strength,IF(acid_type=2,alarm_cost_cl,al_shell_cost_cl),4))*design_flow/average_flow/(24*60))","v":0},"gpm"]
["Number of metering pumps","HCl_pumps",{"$f":"IF(acid_type=1,0,ROUNDUP(HCl_flow*60*pump_safety_factor/max_cm_pump_size,0)+NRD_cm_pump)","v":0}]
["Pump rating","HCl_pump_rate",{"$f":"IF(HCl_pumps=0,0,(HCl_flow*60*pump_safety_factor)/(HCl_pumps-NRD_cm_pump))","v":0},"gph"]
["Acid day tank storage volume required (based on design flow)","day_tank_vol_needed_acid",{"$f":"HCl_flow*60*24","v":0},"gallons"]
["Number of acid day tanks","day_tanks_acid",{"$f":"IF(day_tank_vol_needed_acid<day_tank_needed,0,ROUNDUP(day_tank_vol_needed_acid/max_ctank_size_noSS,0))","v":0},"units"]
["Volume of acid day tanks","day_tank_vol_acid",{"$f":"IF(day_tanks_acid=0,0,day_tank_vol_needed_acid/day_tanks_acid)","v":0},"gallons"]
[]
["Mixers per storage tank","cmix_per_tank_acid",{"$f":"IF(HCl_tanks<>0,ROUNDUP(HCl_tank_vol/1000*cmix_hp_per/cmix_hp_max,0),0)","v":0},"units"]
["Number of acid storage tank mixers","cmixers_acid",{"$f":"IF(HCl_tanks<>0,HCl_tanks*cmix_per_tank_acid,0)","v":0},"units"]
["Mixer size for acid storage tanks","cmix_size_acid",{"$f":"IF(HCl_tanks<>0,HCl_tank_vol/1000*cmix_hp_per/cmix_per_tank_acid,0)","v":0},"hp"]
["Mixers per acid day tank","dmix_per_tank_acid",{"$f":"IF(day_tanks_acid<>0,ROUNDUP(day_tank_vol_acid/1000*cmix_hp_per/cmix_hp_max,0),0)","v":0},"units"]
["Number of acid day tank mixers","dmixers_acid",{"$f":"IF(day_tanks_acid<>0,day_tanks_acid*dmix_per_tank_acid,0)","v":0},"units"]
["Mixer size for acid day tanks","dmix_size_acid",{"$f":"IF(day_tanks_acid<>0,day_tank_vol_acid/1000*cmix_hp_per/dmix_per_tank_acid,0)","v":0},"hp"]
[]
["H3O+ to be destroyed","h3o",{"$f":"(10^-pHf_selected)-(10^-pHo)","v":3.1306548835666929E-6}]
["NaOH required to adjust pH","NaOH_pH",{"$f":"h3o*28000","v":8.7658336739867407E-2},"mg/L"]
["NaOH required to raise alkalinity","NaOH_alk",{"$f":"alk_ppm*30/65","v":46.153846153846153},"mg/L"]
["NaOH required to raise alkalinity and pH","NaOH_tot",{"$f":"NaOH_pH+NaOH_alk","v":46.241504490586024},"mg/L"]
["Average NaOH per day","design_NaOH_day",{"$f":"IF(acid_type=1,0,1000000*3.7854*NaOH_tot*2.2*average_flow/1000000)","v":0},"lbs"]
["Initial NaOH","NaOH_init",{"$f":"cstore_days*design_NaOH_day","v":0},"lbs"]
["NaOH storage volume","NaOH_store",{"$f":"cstore_days*design_NaOH_day/VLOOKUP(naoh_strength,NaOH_table_cl,2)","v":0},"gal"]
["Number of NaOH tanks","NaOH_tanks",{"$f":"ROUNDUP(NaOH_store/max_ctank_size,0)","v":0},"units"]
["NaOH tank volume","NaOH_tank_vol",{"$f":"IF(acid_type=1,0,NaOH_store/NaOH_tanks)","v":0},"gal"]
["Annual NaOH use","NaOH_yr",{"$f":"design_NaOH_day*365*(chem_freq/365)","v":0},"lbs"]
["Design NaOH flow","NaOH_flow",{"$f":"(design_NaOH_day/VLOOKUP(naoh_strength,NaOH_table_cl,2))*design_flow/average_flow/(24*60)","v":0},"gpm"]
["Number of metering pumps","NaOH_pumps",{"$f":"IF(acid_type=1,0,ROUNDUP(NaOH_flow*60*pump_safety_factor/max_cm_pump_size,0)+NRD_cm_pump)","v":0},"units"]
["Pump rating","NaOH_pump_rate",{"$f":"IF(NaOH_pumps=0,0,(NaOH_flow*60*pump_safety_factor)/(NaOH_pumps-NRD_cm_pump))","v":0},"gph"]
["Caustic day tank storage volume required (based on design flow)","day_tank_vol_needed_NaOH",{"$f":"NaOH_flow*60*24","v":0},"gallons"]
["Number of caustic day tanks","day_tanks_NaOH",{"$f":"IF(day_tank_vol_needed_NaOH<day_tank_needed,0,ROUNDUP(day_tank_vol_needed_NaOH/max_ctank_size,0))","v":0},"units"]
["Volume of caustic day tanks","day_tank_vol_NaOH",{"$f":"IF(day_tanks_NaOH=0,0,day_tank_vol_needed_NaOH/day_tanks_NaOH)","v":0},"gallons"]
[]
["Mixers per caustic storage tank","cmix_per_tank_NaOH",{"$f":"IF(NaOH_tanks<>0,ROUNDUP(NaOH_tank_vol/1000*cmix_hp_per/cmix_hp_max,0),0)","v":0},"units"]
["Number of caustic storage tank mixers","cmixers_NaOH",{"$f":"IF(NaOH_tanks<>0,NaOH_tanks*cmix_per_tank_NaOH,0)","v":0},"units"]
["Mixer size for caustic storage tanks","cmix_size_NaOH",{"$f":"IF(NaOH_tanks<>0,NaOH_tank_vol/1000*cmix_hp_per/cmix_per_tank_NaOH,0)","v":0},"hp"]
["Mixers per caustic day tank","dmix_per_tank_NaOH",{"$f":"IF(day_tanks_NaOH<>0,ROUNDUP(day_tank_vol_NaOH/1000*cmix_hp_per/cmix_hp_max,0),0)","v":0},"units"]
["Number of caustic day tank mixers","dmixers_NaOH",{"$f":"IF(day_tanks_NaOH<>0,day_tanks_NaOH*dmix_per_tank_NaOH,0)","v":0},"units"]
["Mixer size for caustic day tanks","dmix_size_NaOH",{"$f":"IF(day_tanks_NaOH<>0,day_tank_vol_NaOH/1000*cmix_hp_per/dmix_per_tank_NaOH,0)","v":0},"hp"]
[]
["Chemical Use and Storage - Corrosion Control"]
["Average sodium hexametaphosphate per day","design_sh_day",{"$f":"average_flow*sh_dose*8.34","v":0.29190000000000005},"lbs"]
["Initial sodium hexametaphosphate","sh_init",{"$f":"cstore_days*design_sh_day","v":8.7570000000000014},"lbs"]
["Sodium hexametaphosphate storage volume","sh_store",{"$f":"cstore_days*design_sh_day/(sh_spgr*62.4*sh_strength/7.48)","v":4.2259150873281319},"gal"]
["Number of sodium hexametaphosphate tanks","sh_tanks",{"$f":"ROUNDUP(sh_store/max_ctank_size,0)","v":1},"units"]
["Sodium hexametaphosphate tank volume","sh_tank_vol",{"$f":"sh_store/sh_tanks","v":4.2259150873281319},"gal"]
["Annual sodium hexametaphosphate use","sh_yr",{"$f":"design_sh_day*365*(chem_freq/365)","v":106.54350000000002},"lbs"]
["Design sodium hexametaphosphate flow","sh_flow",{"$f":"(sh_store/cstore_days)*(design_flow/average_flow)/(24*60)","v":4.1923760786985437E-4},"gpm"]
["Number of metering pumps","sh_pumps",{"$f":"ROUNDUP(sh_flow*60*pump_safety_factor/max_cm_pump_size,0)+NRD_cm_pump","v":2},"units"]
["Pump rating","sh_pump_rate",{"$f":"IF(sh_pumps=0,0,(sh_flow*60*pump_safety_factor)/(sh_pumps-NRD_cm_pump))","v":6.2885641180478154E-3},"gph"]
[]
["Average tetrasodium polyphosphate per day","design_tp_day",{"$f":"average_flow*tp_dose*8.34","v":0.29190000000000005},"lbs"]
["Initial tetrasodium polyphosphate","tp_init",{"$f":"cstore_days*design_tp_day","v":8.7570000000000014},"lbs"]
["Tetrasodium polyphosphate storage volume","tp_store",{"$f":"cstore_days*design_tp_day/(tp_spgr*62.4*tp_strength/7.48)","v":10.564787718320328},"gal"]
["Number of tetrasodium polyphosphate tanks","tp_tanks",{"$f":"ROUNDUP(tp_store/max_ctank_size,0)","v":1},"units"]
["Tetrasodium polyphosphate tank volume","tp_tank_vol",{"$f":"tp_store/tp_tanks","v":10.564787718320328},"gal"]
["Annual tetrasodium polyphosphate use","tp_yr",{"$f":"design_tp_day*365*(chem_freq/365)","v":106.54350000000002},"lbs"]
["Design tetrasodium polyphosphate flow","tp_flow",{"$f":"(tp_store/cstore_days)*(design_flow/average_flow)/(24*60)","v":1.0480940196746359E-3},"gpm"]
["Number of metering pumps","tp_pumps",{"$f":"ROUNDUP(tp_flow*60*pump_safety_factor/max_cm_pump_size,0)+NRD_cm_pump","v":2},"units"]
["Pump rating","tp_pump_rate",{"$f":"IF(tp_pumps=0,0,(tp_flow*60*pump_safety_factor)/(tp_pumps-NRD_cm_pump))","v":1.5721410295119538E-2},"gph"]
[]
["Initial corrosion control chemical","cc_init",{"$f":"CHOOSE(chem_type,0,sh_init,tp_init)","v":8.7570000000000014},"lbs"]
["Number of corrosion chemical tanks","cc_tanks",{"$f":"CHOOSE(chem_type,0,sh_tanks,tp_tanks)","v":1},"units"]
["Corrosion chemical tank volume","cc_tank_vol",{"$f":"CHOOSE(chem_type,0,sh_tank_vol,tp_tank_vol)","v":4.2259150873281319},"gal"]
["Annual corrosion chemical use","cc_yr",{"$f":"CHOOSE(chem_type,0,sh_yr,tp_yr)","v":106.54350000000002},"lbs"]
["Design corrosion chemical flow","cc_flow",{"$f":"CHOOSE(chem_type,0,sh_flow,tp_flow)","v":4.1923760786985437E-4},"gpm"]
["Number of metering pumps","cc_pumps",{"$f":"CHOOSE(chem_type,0,sh_pumps,tp_pumps)","v":2},"units"]
["Pump rating","cc_pump_rate",{"$f":"CHOOSE(chem_type,0,sh_pump_rate,tp_pump_rate)","v":6.2885641180478154E-3},"gph"]
[]
["Corrosion control day tank storage volume required (based on design flow)","day_tank_vol_needed_sh",{"$f":"cc_flow*60*24","v":0.60370215533259031},"gallons"]
["Number of corrosion control day tanks","day_tanks_sh",{"$f":"IF(day_tank_vol_needed_sh<day_tank_needed,0,ROUNDUP(day_tank_vol_needed_sh/max_ctank_size,0))","v":0},"units"]
["Volume of corrosion control day tanks","day_tank_vol_sh",{"$f":"IF(day_tanks_sh=0,0,day_tank_vol_needed_sh/day_tanks_sh)","v":0},"gallons"]
[]
["Mixers per corrosion control storage tank","cmix_per_tank_sh",{"$f":"IF(cc_tanks<>0,ROUNDUP(cc_tank_vol/1000*cmix_hp_per/cmix_hp_max,0),0)","v":1},"units"]
["Number of corrosion control storage tank mixers","cmixers_sh",{"$f":"IF(cc_tanks<>0,cc_tanks*cmix_per_tank_sh,0)","v":1},"units"]
["Mixer size for corrosion control storage tanks","cmix_size_sh",{"$f":"IF(cc_tanks<>0,cc_tank_vol/1000*cmix_hp_per/cmix_per_tank_sh,0)","v":1.056478771832033E-3},"hp"]
["Mixers per corrosion control day tank","dmix_per_tank_sh",{"$f":"IF(day_tanks_sh<>0,ROUNDUP(day_tank_vol_sh/1000*cmix_hp_per/cmix_hp_max,0),0)","v":0},"units"]
["Number of corrosion control day tank mixers","dmixers_sh",{"$f":"IF(day_tanks_sh<>0,day_tanks_sh*dmix_per_tank_sh,0)","v":0},"units"]
["Mixer size for corrosion control day tanks","dmix_size_sh",{"$f":"IF(day_tanks_sh<>0,day_tank_vol_sh/1000*cmix_hp_per/dmix_per_tank_sh,0)","v":0},"hp"]

{"sheet":"Offgas","index":13,"n_rows":76,"n_cols":5,"rows_kept":76,"cut":false,"hidden":false,"merged":[]}
["Offgas Calculations"]
[]
["Calculation","Range Name","Value","Units","Guidance"]
["From Inputs"]
["Off-gas Pollution Control Technology","Offgas_Tech",{"$f":"IF(OR(Offgas_Tech_I=\"none\",Offgas_Tech_I=\"\"),0,IF(Offgas_Tech_I=\"GAC\",1,IF(Offgas_Tech_I=\"thermal oxidation\",2,3)))","v":0},"<--- 0 for none, 1 for GAC, 2 for Thermal Oxidation, 3 for Catalytic Oxidation"]
["Heat recovery type","og_opt1",{"$f":"IF(OR(Offgas_Tech=2,Offgas_Tech=3),IF(og_opt1_I=\"none\",0,IF(og_opt1_I=\"recuperative\",1,2)),\"\")","v":""},"<--- 0 for none, 1 for recuperative, 2 for regenerative"]
["Spent GAC regeneration","og_opt2",{"$f":"IF(Offgas_Tech=1,IF(og_opt2_I=\"throwaway\",0,1),\"\")","v":""},"<--- 0 for throwaway (no regeneration), 1 for off-site regeneration"]
[]
["Off-gas Control System"]
["Contaminant heating value","BTU_contam",{"$f":"IF(Offgas_Tech=1,VLOOKUP(contam,contaminant_lookup,3),0)","v":0},"BTU/gal","From critical design assumptions for contaminant"]
["Contaminant release rate","VOC_Release ",{"$f":"(Influent_conc*P_REM/10^6)*(QW*60*60*24)*2.205","v":1.1787072696000003E-3},"lbs/day","Based on design flow"]
["Off-gas concentration",null,{"$f":"(Influent_conc*P_REM/1000)*(AIR_FLOW/QW)","v":0.41850000000000004},"mg/m3"]
["Off-gas concentration","C_0",{"$f":"C12/1000","v":4.1850000000000004E-4},"mg/L"]
["Off-gas concentration",null,{"$f":"(C12*T)/(12.187*MW)","v":7.396440604372112E-2},"ppmv"]
["Off-gas concentration","C_gal",{"$f":"C14/10^6*1000*3.785","v":2.7995527687548443E-4},"gal/m3"]
["Off-gas flow (design)",null,{"$f":"Design_air_flow","v":270.89627202000008},"cfm","Based on design flow"]
["Off-gas flow (design)","Design_air_flow_liters_min",{"$f":"AIR_FLOW*1000*60","v":7671.9420000000018},"L/min","For comparison"]
["Off-gas flow (average)","Average_air_flow",{"$f":"C16*average_flow/design_flow","v":63.20913013800002},"cfm","Based on average flow"]
["Off-gas flow (average)","Average_air_flow_liters_min",{"$f":"AIR_FLOW*1000*60*average_flow/design_flow","v":1790.1198000000006},"L/min"]
["Off-gas flow (average)","DAILY_AIR",{"$f":"DAILY_AIR","v":2.9835330000000007E-2},"m3/s","Calculated on O&M, displayed here for reference"]
[]
["GAC System"]
["GAC Bed Residence Time","GAC_EBCT",{"$f":"IF(Offgas_Tech=1,VLOOKUP(contam,contaminant_lookup,4),0)","v":0},"sec","From critical design assumptions for contaminant"]
["Total bed size needed","GAC_tot_bed_size",{"$f":"IF(Offgas_Tech=1,Design_air_flow/60*GAC_EBCT,0)","v":0},"cf"]
["Maximum GAC unit bed size","GAC_max_bed",{"$f":"MAX(VLOOKUP(10^6,og_gac_cost_cl,1)-0.1)","v":1333.3000000000002},"cf","The largest size for which costs are available."]
["Number of units","op_GAC_beds",{"$f":"IF(Offgas_Tech=1,ROUNDUP(GAC_tot_bed_size/GAC_max_bed,0),0)","v":0},"units"]
["Total units including redundancy","tot_GAC_beds",{"$f":"op_GAC_beds+NRD_GAC","v":0},"units"]
["Bed size per unit","GAC_bed_size",{"$f":"IF(Offgas_Tech=1,GAC_tot_bed_size/op_GAC_beds,0)","v":0},"cf"]
["Total GAC Quantity","GAC",{"$f":"IF(Offgas_Tech=1,Design_air_flow/60*GAC_EBCT*GAC_density,0)","v":0},"lbs"]
["GAC in grams","M",{"$f":"GAC*453","v":0},"grams"]
["Desired off-gas removal efficiency","gas_prem",{"$f":"MAX(0.25,(VOC_Release-0.8*max_VOC_release)/VOC_Release)","v":0.25},null,"Assumes breakthrough defined as 80% of limit specified on input page, with a minimum removal of 25%"]
["Breakthrough concentration","Cb",{"$f":"IF(Offgas_Tech=1,(1-gas_prem)*C_0,0)","v":0},"mg/L"]
["Bed Life","bed_life",{"$f":"IF(AND(og_opt3=\"\",contam=1),M*(K*Cb^_1_n/(Average_air_flow_liters_min*(C_0-Cb)))/(30*24*60),og_opt3)","v":0},"months","Theoretical calculation is valid only for MTBE; input is required for other contaminants"]
["GAC use rate",null,{"$f":"IF(Offgas_Tech=1,(GAC/bed_life)/(Average_air_flow*60*24*30/1000),0)","v":0},"lb/1,000 cf of air","For comparison: For MTBE, CMRP (2000) assumed 0.05 lb/1000 cf at 5 ppmv, 0.006 lb/1000 cf at 0.5 ppmv."]
["Annual GAC use","GAC_yr",{"$f":"IF(Offgas_Tech=1,GAC*12/bed_life,0)","v":0},"lbs"]
["Annual Regenerated GAC","regen_yr",{"$f":"IF(og_opt2=1,(1-makeup_rate_off)*GAC_yr,0)","v":0},"lbs/yr"]
["Annual Regenerated GAC in cubic feet","regen_yr_cf",{"$f":"regen_yr/GAC_density","v":0},"cubic ft/yr"]
["Annual Virgin GAC","GAC_makeup",{"$f":"IF(og_opt2=1,makeup_rate_off*GAC_yr,GAC_yr)","v":0},"lbs/yr"]
["Annual Virgin GAC in cubic feet","GAC_makeup_cf",{"$f":"GAC_makeup/GAC_density","v":0},"cubic ft/yr"]
["Replacement/disposal frequency","disp_freq",{"$f":"IF(Offgas_Tech=1,12/bed_life,0)","v":0},"times per year"]
["Spent media quantity (total per event)","spent_media",{"$f":"IF(og_opt2=0,GAC/2000,0)","v":0},"tons"]
["Disposal",null,{"$f":"spent_media*disp_freq*nonhaz_disposal_cost_cl","v":0},"$/year"]
["Transportation",null,{"$f":"spent_media*disp_freq*non_haz_miles*nonhaz_transportation_cost_cl","v":0},"$/year"]
["Total annual spent media diposal fee","disposal_fee",{"$f":"C43+C42","v":0},"$/year"]
[]
["Thermal Oxidizer System"]
["Maximum TO capacity","TO_max_size",{"$f":"IF(og_opt1=0,TO_max_size_no,IF(og_opt1=1,TO_max_size_rec,TO_max_size_reg))","v":736000},"scfm"]
["Total capacity needed","TO_tot_size",{"$f":"IF(Offgas_Tech=2,Design_air_flow,0)","v":0},"scfm"]
["Maximum TO capacity (no heat recovery)","TO_max_size_no",{"$f":"MAX(VLOOKUP(10^6,og_to_cost_cl,1)-1)","v":25000},"scfm","The largest size for which costs are available."]
["Maximum TO capacity (recuperative)","TO_max_size_rec",{"$f":"MAX(VLOOKUP(10^6,og_torec_cost_cl,1)-1)","v":7257},"scfm","The largest size for which costs are available."]
["Maximum TO capacity (regenerative)","TO_max_size_reg",{"$f":"MAX(VLOOKUP(10^6,og_toreg_cost_cl,1)-1)","v":736000},"scfm","The largest size for which costs are available."]
["Number of units","op_TOs",{"$f":"IF(Offgas_Tech=2,ROUNDUP(TO_tot_size/TO_max_size,0),0)","v":0},"units"]
["Total units including redundancy","tot_TOs",{"$f":"op_TOs+NRD_TO","v":0},"units"]
["Capacity per unit","TO_size",{"$f":"IF(Offgas_Tech=2,TO_tot_size/op_TOs,0)","v":0},"scfm"]
["TO operating temperature","TO_op_temp",{"$f":"IF(Offgas_Tech=2,VLOOKUP(contam,contaminant_lookup,5),0)","v":0},"deg C","From critical design assumptions for contaminant"]
["Fuel BTUs required (no heat recovery)",null,{"$f":"IF(Offgas_Tech=2,MAX(0,((1+TO_ex_air)*(DAILY_AIR*60*60*24*365))*PA*cpa*(TO_op_temp-(T-273))/1.0545-BTU_contam*C_gal*DAILY_AIR*60*60*24*365),0)","v":0},"BTU/yr","kJ = Q (m3/yr) * p (kg/m3) * cp (kJ/kg-deg C) * delta T (deg C).  1 BTU = 1.0545 kJ"]
["Actual fuel BTUs required",null,{"$f":"C56*(1-IF(og_opt1=1,TO_rec_eff,IF(og_opt1=2,TO_reg_eff,0)))","v":0},"BTU/yr"]
["Annual natural gas required","TO_ng_yr",{"$f":"C57/100000","v":0},"therms/yr"]
["Excess air blower power",null,{"$f":"IF(Offgas_Tech=2,TO_ex_air*DAILY_AIR*(AIR_P/BLOW_EFF),0)","v":0},"Watts"]
["Excess air blower energy per year","TO_power_yr",{"$f":"C59*24*365/1000000","v":0},"MWhr/yr"]
[]
["Catalytic Oxidizer System"]
["Maximum CO capacity","CO_max_size",{"$f":"IF(og_opt1=0,CO_max_size_no,IF(og_opt1=1,CO_max_size_rec,CO_max_size_reg))","v":736000},"scfm"]
["Total capacity needed","CO_tot_size",{"$f":"IF(Offgas_Tech=3,Design_air_flow,0)","v":0},"scfm"]
["Maximum TO capacity (no heat recovery)","CO_max_size_no",{"$f":"MAX(VLOOKUP(10^6,og_co_cost_cl,1)-1)","v":736000},"scfm","The largest size for which costs are available."]
["Maximum TO capacity (recuperative)","CO_max_size_rec",{"$f":"MAX(VLOOKUP(10^6,og_corec_cost_cl,1)-1)","v":736000},"scfm","The largest size for which costs are available."]
["Maximum TO capacity (regenerative)","CO_max_size_reg",{"$f":"MAX(VLOOKUP(10^6,og_coreg_cost_cl,1)-1)","v":736000},"scfm","The largest size for which costs are available."]
["Number of units","op_COs",{"$f":"IF(Offgas_Tech=3,ROUNDUP(CO_tot_size/CO_max_size,0),0)","v":0},"units"]
["Total units including redundancy","tot_COs",{"$f":"op_COs+NRD_CO","v":0},"units"]
["Capacity per unit","CO_size",{"$f":"IF(Offgas_Tech=3,CO_tot_size/op_COs,0)","v":0},"scfm"]
["CO operating temperature","CO_op_temp",{"$f":"IF(Offgas_Tech=3,VLOOKUP(contam,contaminant_lookup,6),0)","v":0},"deg C"]
["Fuel BTUs required (no heat recovery)",null,{"$f":"IF(Offgas_Tech=3,MAX(0,((1+CO_ex_air)*(DAILY_AIR*60*60*24*365))*PA*cpa*(CO_op_temp-(T-273))/1.0545-BTU_contam*C_gal*DAILY_AIR*60*60*24*365),0)","v":0},"BTU/yr","kJ = Q (m3/yr) * p (kg/m3) * cp (kJ/kg-deg C) * delta T (deg C).  1 BTU = 1.0545 kJ"]
["Actual fuel BTUs required",null,{"$f":"C72*(1-IF(og_opt1=1,CO_rec_eff,IF(og_opt1=2,CO_reg_eff,0)))","v":0},"BTU/yr"]
["Annual natural gas required","CO_ng_yr",{"$f":"C73/100000","v":0},"therms/yr"]
["Excess air blower power",null,{"$f":"IF(Offgas_Tech=3,CO_ex_air*DAILY_AIR*(AIR_P/BLOW_EFF),0)","v":0},"Watts"]
["Excess air blower energy per year","CO_power_yr",{"$f":"C75*24*365/1000000","v":0},"MWhr/yr"]

{"sheet":"Pumps Pipe Structure","index":14,"n_rows":70,"n_cols":5,"rows_kept":70,"cut":false,"hidden":false,"merged":[]}
["Pumps, Piping, and Structure Calculations"]
[]
["Calculation","Range Name","Value","Units","Guidance"]
["Booster Pumps"]
["Flow of Each Pump","Qp",{"$f":"IF(num_pumps_I=\"\",MIN(MAX(average_flow_rate+bp_flow_rate*average_flow_rate/Design_Flow_Rate,(Design_Flow_Rate+bp_flow_rate)/2)*(1+pump_safety_factor),max_pump_size),IF(num_pumps_I=0,0,(Design_Flow_Rate+bp_flow_rate)*(1+pump_safety_factor)/num_pumps_I))","v":13.020833333333332},"gpm","Includes safety factor"]
["Operating Pumps","num_of_pumps",{"$f":"IF(QP=0,0,ROUNDUP(Design_Flow_Rate/QP*(1+pump_safety_factor),0))","v":2},"units"]
["Total Pumps","tot_pumps",{"$f":"NUM_OF_PUMPS+NRD_pump","v":2},"units","Includes redundancy"]
["Maximum pump size","max_pump_size",{"$f":"VLOOKUP(10^6,pump_cost_cl,1)-1","v":10000},"gpm","The largest pump size for which costs are available.  Applies to booster pumps."]
["Maximum chemical metering pump size","max_cm_pump_size",{"$f":"MAX(VLOOKUP(10^6,pvc_mmpump_cost_cl,1)-0.1,VLOOKUP(10^6,ss_mmpump_cost_cl,1)-0.1)","v":760},"gph","The largest size for which costs are available."]
[]
["Blowers"]
["Design air flow","design_air_flow",{"$f":"AIR_FLOW*35.31*60","v":270.89627202000008},"cfm"]
["Flow Per Blower","Q_Blower",{"$f":"IF(parallel_I=\"\",MIN(MAX(Design_air_flow*average_flow/design_flow,Design_air_flow/2),max_blow_size),Design_air_flow/parallel_I)","v":135.44813601000004},"cfm"]
["Number of operating blowers","Parallel",{"$f":"ROUNDUP(Design_air_flow/Q_BLOWER,0)","v":2},"units"]
["Total blowers","tot_blowers",{"$f":"PARALLEL+NRD_blower","v":2},"units","Includes redundancy"]
["Maximum blower size","max_blow_size",{"$f":"MAX(VLOOKUP(10^6,cent_blow_cost_cl,1)-1,VLOOKUP(10^6,pd_blow_cost_cl,1)-1)","v":5000},"cfm","The largest size for which costs are available."]
[]
["Inlet and outlet pipe length","in_out_pipe_length",{"$f":"2*facil_length","v":40},"linear feet"]
["Inlet and outlet pipe flow","in_out_pipe_flow",{"$f":"Design_Flow_Rate","v":20.833333333333332},"gpm"]
["Inlet and outlet piping diameter","in_out_pipe_diam",{"$f":"VLOOKUP(in_out_pipe_flow,pipe_size_table_cl,2)","v":1.5},"inches"]
["Bypass piping length","bp_pipe_length",{"$f":"IF(bp_pct>0,2.5*facil_length,0)","v":0},"linear feet"]
["Bypass pipe diameter","bp_pipe_diam",{"$f":"IF(bp_pct>0,VLOOKUP(bp_flow_rate,pipe_size_table_cl,2),0)","v":0},"inches"]
["Process piping length","proc_pipe_length",{"$f":"2*facil_length+PACK_HT*3.28*TOT_COL","v":62.542906817411691},"linear feet","Includes additional length to account for tower height"]
["Process pipe flow","proc_pipe_flow",{"$f":"Design_Flow_Rate/NUM_COL","v":10.416666666666666},"gpm"]
["Process pipe diameter","proc_pipe_diam",{"$f":"VLOOKUP(proc_pipe_flow,pipe_size_table_cl,2)","v":1.5},"inches"]
["Air pipe diameter","air_pipe_diam",{"$f":"proc_pipe_diam","v":1.5},"inches","Assume equal to liquid pipe diameter (from fwbs)"]
["Air pipe length","air_pipe_length",{"$f":"air_L*TOT_COL+IF(Offgas_Tech=0,0,facil_length)","v":200},"lf"]
["Chemical pipe length","chem_pipe_length",{"$f":"facil_length","v":20},"lf"]
["Acid pipe diameter","HCl_pipe_diam",{"$f":"VLOOKUP(HCl_flow,pipe_size_table_cl,2)","v":0.5},"inches"]
["NaOH pipe diameter","NaOH_pipe_diam",{"$f":"VLOOKUP(NaOH_flow,pipe_size_table_cl,2)","v":0.5},"inches"]
["Corrosion chemical pipe diameter","cc_pipe_diam",{"$f":"VLOOKUP(cc_flow,pipe_size_table_cl,2)","v":0.5},"inches"]
[]
["Building Structure"]
["HCl tank diameter","at_diam",{"$f":"ROUNDUP((2*(HCl_tank_vol/7.48)/PI())^(1/3),0)","v":0},"feet"]
["HCl day tank diameter","adt_diam",{"$f":"ROUNDUP((2*(day_tank_vol_acid/7.48)/PI())^(1/3),0)","v":0},"feet"]
["NaOH tank diameter","ct_diam",{"$f":"ROUNDUP((2*(NaOH_tank_vol/7.48)/PI())^(1/3),0)","v":0},"feet"]
["NaOH day tank diameter","cdt_diam",{"$f":"ROUNDUP((2*(day_tank_vol_NaOH/7.48)/PI())^(1/3),0)","v":0},"feet"]
["Corrosion chemical tank diameter","cct_diam",{"$f":"ROUNDUP((2*(cc_tank_vol/7.48)/PI())^(1/3),0)","v":1},"feet"]
["Corrosion chemical day tank diameter","ccdt_diam",{"$f":"ROUNDUP((2*(day_tank_vol_sh/7.48)/PI())^(1/3),0)","v":0},"feet"]
["Access space per HCl tank","space_at",{"$f":"IF(at_diam>max_space_vessels,max_space_vessels,at_diam)","v":0},"feet"]
["Access space per HCl day tank","space_adt",{"$f":"IF(adt_diam>max_space_vessels,max_space_vessels,adt_diam)","v":0},"feet"]
["Access space per NaOH tank","space_ct",{"$f":"IF(ct_diam>max_space_vessels,max_space_vessels,ct_diam)","v":0},"feet"]
["Access space per NaOH day tank","space_cdt",{"$f":"IF(cdt_diam>max_space_vessels,max_space_vessels,cdt_diam)","v":0},"feet"]
["Access space per corrosion chemical tank","space_cct",{"$f":"IF(cct_diam>max_space_vessels,max_space_vessels,cct_diam)","v":1},"feet"]
["Access space per corrosion chemical day tank","space_ccdt",{"$f":"IF(ccdt_diam>max_space_vessels,max_space_vessels,ccdt_diam)","v":0},"feet"]
["HCl tank footprint",null,{"$f":"ROUNDUP((at_diam+2*space_at)^2+(HCl_tanks-1)*(at_diam+2*space_at)*(at_diam+space_at),0)","v":0},"square ft"]
["HCl day tank footprint",null,{"$f":"ROUNDUP((adt_diam+2*space_adt)^2+(day_tanks_acid-1)*(adt_diam+2*space_adt)*(adt_diam+space_adt),0)","v":0},"square feet"]
["NaOH tank footprint",null,{"$f":"ROUNDUP((ct_diam+2*space_ct)^2+(NaOH_tanks-1)*(ct_diam+2*space_ct)*(ct_diam+space_ct),0)","v":0},"square ft"]
["NaOH day tank footprint",null,{"$f":"ROUNDUP((cdt_diam+2*space_cdt)^2+(day_tanks_NaOH-1)*(cdt_diam+2*space_cdt)*(cdt_diam+space_cdt),0)","v":0},"square feet"]
["Corrosion chemical tank footprint",null,{"$f":"IF(chem_type=1,0,ROUNDUP((cct_diam+2*space_cct)^2+(cc_tanks-1)*(cct_diam+2*space_cct)*(cct_diam+space_cct),0))","v":9},"square ft"]
["Corrosion chemical day tank footprint",null,{"$f":"ROUNDUP((ccdt_diam+2*space_ccdt)^2+(day_tanks_sh-1)*(ccdt_diam+2*space_ccdt)*(ccdt_diam+space_ccdt),0)","v":0},"square feet"]
["Chemical storage footprint","cstore_fp",{"$f":"SUM(C46:C51)","v":9},"square ft"]
["Booster pump footprint","pump_fp",{"$f":"ROUNDUP((VLOOKUP(QP,pump_dim_table_cl,3)+2*space_pumps)*(VLOOKUP(QP,pump_dim_table_cl,4)+2*space_pumps)+(tot_pumps-1)*(VLOOKUP(QP,pump_dim_table_cl,3)+2*space_pumps)*(VLOOKUP(QP,pump_dim_table_cl,4)+space_pumps),0)","v":179},"square ft"]
["Blower footprint","blower_fp",{"$f":"ROUNDUP((VLOOKUP(Q_BLOWER,blow_dim_table_cl,7)+2*space_pumps)*(VLOOKUP(Q_BLOWER,blow_dim_table_cl,8)+2*space_pumps)+(tot_blowers-1)*(VLOOKUP(Q_BLOWER,blow_dim_table_cl,7)+2*space_pumps)*(VLOOKUP(Q_BLOWER,blow_dim_table_cl,8)+space_pumps),0)","v":184},"square ft"]
["Tower footprint","vessel_fp",{"$f":"ROUNDUP(AIRWELL_L*3.28*AIRWELL_W*3.28,0)","v":25},"square ft","Clearwell underneath towers, so no additional floorplan required"]
["Offgas treatment system footprint (GAC)",null,{"$f":"IF(Offgas_Tech=1,ROUNDUP(((GAC_bed_size/6)^(1/2)+2*space_pumps)*((GAC_bed_size/6)^(1/2)+2*space_pumps)+(tot_GAC_beds-1)*((GAC_bed_size/6)^(1/2)+2*space_pumps)*((GAC_bed_size/6)^(1/2)+space_pumps),0),0)","v":0},"square ft"]
["Offgas treatment system footprint (TO)",null,{"$f":"IF(Offgas_Tech=2,ROUNDUP((VLOOKUP(TO_size,to_dim_table_cl,5)+2*space_pumps)*(VLOOKUP(TO_size,to_dim_table_cl,6)+2*space_pumps)+(tot_TOs-1)*(VLOOKUP(TO_size,to_dim_table_cl,5)+2*space_pumps)*(VLOOKUP(TO_size,to_dim_table_cl,6)+space_pumps),0),0)","v":0},"square ft"]
["Offgas treatment system footprint (CO)",null,{"$f":"IF(Offgas_Tech=3,ROUNDUP((VLOOKUP(CO_size,co_dim_table_cl,5)+2*space_pumps)*(VLOOKUP(CO_size,co_dim_table_cl,6)+2*space_pumps)+(tot_COs-1)*(VLOOKUP(CO_size,co_dim_table_cl,5)+2*space_pumps)*(VLOOKUP(CO_size,co_dim_table_cl,6)+space_pumps),0),0)","v":0},"square ft"]
["Offgas treatment system footprint","offgas_fp",{"$f":"SUM(C56:C58)","v":0},"square ft"]
["Office space","office_fp",{"$f":"VLOOKUP(design_flow,labor_table_cl,3)*IF(ss_cat2=1,space_office_small,space_office)","v":0},"square ft"]
["Exact building footprint required","fp_required",{"$f":"cstore_fp+pump_fp+office_fp","v":188},"square ft"]
["Total building footprint","total_fp",{"$f":"ROUNDUP(fp_required,-1)","v":190},"square ft","Building covers chemical storage, pumps, and office space.  Does not cover blowers or towers."]
["Concrete Class A for pad","conc_pad",{"$f":"ROUNDUP((cstore_fp+pump_fp+blower_fp)*1/27,0)*IF(ss_cat2=1,pad_thick_small,pad_thick)","v":4.6666666666666661},"cubic yd","Pad underlies chemical storage, pumps, and blowers"]
["Facility length","facil_length",{"$f":"ROUNDUP((total_fp+vessel_fp+blower_fp+offgas_fp)^0.5,-1)","v":20},"feet"]
["Land for building",null,{"$f":"((total_fp)^0.5+(2*non_fire_buffer))*((total_fp)^0.5+(non_fire_buffer+fire_buffer))","v":2154.8834126463157},"square ft","Includes buffer area"]
["Land for towers",null,{"$f":"(AIRWELL_L*3.28+non_fire_buffer)*(AIRWELL_W*3.28+2*non_fire_buffer)","v":371.8064},"square ft","Includes setback on three sides (fourth side accomodated by building buffer), due to tower height, noise etc."]
["Land for blowers",null,{"$f":"blower_fp","v":184},"square ft"]
["Land for offgas system",null,{"$f":"offgas_fp","v":0},"square ft"]
["Land acquisition required","land_required",{"$f":"ROUNDUP(SUM(C65:C68),-2)/43560","v":6.4279155188246104E-2},"acres"]
["Land acquisition cost","land_cost",{"$f":"VLOOKUP(design_flow,land_cost_cl,3)","v":21571.311771739129},"/acre"]

{"sheet":"Instrumentation and Control","index":15,"n_rows":60,"n_cols":5,"rows_kept":60,"cut":false,"hidden":false,"merged":[]}
["Instrumentation and Control Calculations"]
[]
["Calculation","Range Name","Value","Units","Guidance"]
["From Inputs"]
["Component level","component_level",{"$f":"IF(component_level_I=\"high cost\",2,IF(component_level_I=\"mid cost\",1,\"\"))","v":""},"blank = low cost, 1 = mid cost, 2 = high cost"]
["Manual system controls","manual",{"$f":"IF(manual_I=\"manual\",1,IF(manual_I=\"semi-automated\",2,IF(manual_I=\"fully automated\",3,IF(component_level=\"\",1,IF(component_level=2,3,CHOOSE(ss_cat2,1,3,3))))))","v":3},"1 = fully manual system, 2 = semi-automated system, 3 = fully automated system.","Based on system size and component level (see cell comment), unless user overrides on input sheet"]
[]
["Valves and Instrumentation"]
["Size of valves for inlet and outlet lines","in_valve_size",{"$f":"in_out_pipe_diam","v":1.5},"inches"]
["Size of valves for process line","tank_valve_size",{"$f":"proc_pipe_diam","v":1.5},"inches"]
["Size of valves for air line","air_valve_size",{"$f":"air_pipe_diam","v":1.5},"inches"]
["Size of valves for acid pipe lines","HCl_valve_size",{"$f":"HCl_pipe_diam","v":0.5},"inches"]
["Size of valves for caustic pipe lines","NaOH_valve_size",{"$f":"NaOH_pipe_diam","v":0.5},"inches"]
["Size of valves for corrosion control chemical pipe","cc_valve_size",{"$f":"cc_pipe_diam","v":0.5},"inches"]
["Size of valves for bypass line","bypass_valve_size",{"$f":"bp_pipe_diam","v":0},"inches"]
[]
["Number of MOVs for process line","tot_proc_MOVs",{"$f":"TOT_COL*VLOOKUP(\"proc_MOV_vessel\",valve_table,manual+1,FALSE)+tot_pumps*VLOOKUP(\"proc_MOV_pump\",valve_table,manual+1,FALSE)","v":6},"valves"]
["Number of MOVs for air line","tot_air_MOVs",{"$f":"TOT_COL*VLOOKUP(\"air_MOV_vessel\",valve_table,manual+1,FALSE)+VLOOKUP(\"air_MOV_og\",valve_table,manual+1,FALSE)*CHOOSE(Offgas_Tech+1,0,tot_GAC_beds,tot_TOs,tot_COs)+IF(Offgas_Tech=0,0,VLOOKUP(\"add_MOV_og\",valve_table,manual+1,FALSE))","v":2},"valves"]
["Number of MOVs for acid line","tot_HCl_MOVs",{"$f":"HCl_pumps*VLOOKUP(\"HCL_MOV_pump\",valve_table,manual+1,FALSE)+VLOOKUP(\"chem_MOV_day\",valve_table,manual+1,FALSE)*day_tanks_acid","v":0},"valves"]
["Number of MOVs for caustic line","tot_NaOH_MOVs",{"$f":"NaOH_pumps*VLOOKUP(\"NAOH_MOV_pump\",valve_table,manual+1,FALSE)+VLOOKUP(\"chem_MOV_day\",valve_table,manual+1,FALSE)*day_tanks_NaOH","v":0},"valves"]
["Number of MOVs for corrosion chemical line","tot_chem_MOVs",{"$f":"IF(chem_type=1,0,cc_pumps)*VLOOKUP(\"chem_MOV_pump\",valve_table,manual+1,FALSE)+VLOOKUP(\"chem_MOV_day\",valve_table,manual+1,FALSE)*day_tanks_sh","v":4},"valves"]
["Number of MOVs for bypass line","tot_bp_MOVs",{"$f":"IF(bp_pct=0,0,VLOOKUP(\"tot_bp_movs\",valve_table,manual+1,FALSE))","v":0},"valves"]
["Total number of MOVs","tot_MOVs",{"$f":"SUM(C17:C22)","v":12},"valves"]
["Number of manual valves for process line","tot_proc_man",{"$f":"TOT_COL*VLOOKUP(\"proc_man_vessel\",valve_table,manual+1,FALSE)+tot_pumps*VLOOKUP(\"proc_man_pump\",valve_table,manual+1,FALSE)","v":0},"valves"]
["Number of manual valves for air line","tot_air_man",{"$f":"TOT_COL*VLOOKUP(\"air_man_vessel\",valve_table,manual+1,FALSE)+VLOOKUP(\"air_man_og\",valve_table,manual+1,FALSE)*CHOOSE(Offgas_Tech+1,0,tot_GAC_beds,tot_TOs,tot_COs)+IF(Offgas_Tech=0,0,VLOOKUP(\"add_man_og\",valve_table,manual+1,FALSE))","v":0},"valves"]
["Number of manual valves for acid line","tot_HCl_man",{"$f":"HCl_pumps*VLOOKUP(\"HCL_man_pump\",valve_table,manual+1,FALSE)+VLOOKUP(\"chem_man_day\",valve_table,manual+1,FALSE)*day_tanks_acid","v":0},"valves"]
["Number of manual valves for caustic line","tot_NaOH_man",{"$f":"NaOH_pumps*VLOOKUP(\"NAOH_man_pump\",valve_table,manual+1,FALSE)+VLOOKUP(\"chem_man_day\",valve_table,manual+1,FALSE)*day_tanks_NaOH","v":0},"valves"]
["Number of manual valves for corrosion chemical line","tot_chem_man",{"$f":"IF(chem_type=1,0,cc_pumps)*VLOOKUP(\"chem_man_pump\",valve_table,manual+1,FALSE)+VLOOKUP(\"chem_man_day\",valve_table,manual+1,FALSE)*day_tanks_sh","v":0},"valves"]
["Number of manual valves for bypass line","tot_bp_man",{"$f":"IF(bp_pct=0,0,VLOOKUP(\"tot_bp_mans\",valve_table,manual+1,FALSE))","v":0},"valves"]
[]
["Number of check valves for acid line","tot_HCl_chv",{"$f":"HCl_pumps*HCl_chv_pump","v":0},"valves"]
["Number of check valves for caustic line","tot_NaOH_chv",{"$f":"NaOH_pumps*NaOH_chv_pump","v":0},"valves"]
["Number of check valves for corrosion chemical line","tot_chem_chv",{"$f":"IF(chem_type=1,0,cc_pumps)*chem_chv_pump","v":4},"valves"]
[]
["Size of flow meters for influent line","in_meter_size",{"$f":"in_out_pipe_diam","v":1.5},"inches"]
["Size of flow meters for process line","proc_meter_size",{"$f":"proc_pipe_diam","v":1.5},"inches"]
["Number of flow meters for process line","tot_fm_proc",{"$f":"fm_proc*TOT_COL","v":2},"units"]
["Number of flow meters for air line","tot_fm_air",{"$f":"fm_air*TOT_COL","v":2},"units"]
[]
["Turbidity meters","tot_turb_meters",{"$f":"IF(ss_cat2=1,turb_meters_small,turb_meters)","v":0},"units","One for effluent line"]
["Total high/low alarms","tot_chem_alarm",{"$f":"alarm_chem*(HCl_tanks+NaOH_tanks+IF(chem_type=1,0,cc_tanks)+day_tanks_acid+day_tanks_NaOH+day_tanks_sh)","v":1},"units"]
["Total drive controllers","tot_switches",{"$f":"IF(manual=2,0,S_booster_pump*tot_pumps+S_blower*tot_blowers+S_cm_pump*(HCl_pumps+NaOH_pumps+IF(chem_type=1,0,cc_pumps))+S_TO*tot_TOs+S_CO*tot_COs+S_mix*(cmixers_acid+cmixers_NaOH+cmixers_sh+dmixers_acid+dmixers_NaOH+dmixers_sh))","v":7},"units"]
[]
["System Controls"]
["Flow meter lookup code - inlet/outlet","fm_lkp_io",{"$f":"IF(OUTPUT!L209=1,\"flow_op\",IF(OUTPUT!L210=1,\"flow_prop\",IF(OUTPUT!L211=1,\"flow_ven\",\"flow_mag\")))","v":"flow_prop"},null,"These codes are used to look up SCADA requirements, which depend on the type of flow meter selected."]
["Flow meter lookup code - process","fm_lkp_proc",{"$f":"IF(OUTPUT!L214=1,\"flow_op\",IF(OUTPUT!L215=1,\"flow_prop\",IF(OUTPUT!L216=1,\"flow_ven\",\"flow_mag\")))","v":"flow_prop"}]
["Total discrete inputs","discrete_inputs",{"$f":"VLOOKUP(fm_lkp_io,port_table,2,FALSE)*tot_fm_in+VLOOKUP(fm_lkp_proc,port_table,2,FALSE)*tot_fm_proc+VLOOKUP(\"flow_air\",port_table,2,FALSE)*tot_fm_air+VLOOKUP(\"alarm\",port_table,2,FALSE)*tot_chem_alarm+VLOOKUP(\"ph\",port_table,2,FALSE)*pH_controls+VLOOKUP(\"temp\",port_table,2,FALSE)*temp_meters+VLOOKUP(\"TDS\",port_table,2,FALSE)*num_TDS+VLOOKUP(\"turb\",port_table,2,FALSE)*tot_turb_meters+VLOOKUP(\"switch\",port_table,2,FALSE)*tot_switches+VLOOKUP(\"TO\",port_table,2,FALSE)*tot_TOs+VLOOKUP(\"CO\",port_table,2,FALSE)*tot_COs+VLOOKUP(\"valve\",port_table,2,FALSE)*tot_MOVs","v":22},"units"]
["Total discrete outputs","discrete_outputs",{"$f":"IF(manual=2,0,VLOOKUP(fm_lkp_io,port_table,3,FALSE)*tot_fm_in+VLOOKUP(fm_lkp_proc,port_table,3,FALSE)*tot_fm_proc+VLOOKUP(\"flow_air\",port_table,3,FALSE)*tot_fm_air+VLOOKUP(\"alarm\",port_table,3,FALSE)*tot_chem_alarm+VLOOKUP(\"ph\",port_table,3,FALSE)*pH_controls+VLOOKUP(\"temp\",port_table,3,FALSE)*temp_meters+VLOOKUP(\"TDS\",port_table,3,FALSE)*num_TDS+VLOOKUP(\"turb\",port_table,3,FALSE)*tot_turb_meters+VLOOKUP(\"switch\",port_table,3,FALSE)*tot_switches++VLOOKUP(\"TO\",port_table,3,FALSE)*tot_TOs+VLOOKUP(\"CO\",port_table,3,FALSE)*tot_COs+VLOOKUP(\"valve\",port_table,3,FALSE)*tot_MOVs)","v":8},"units"]
["Total analog inputs","analog_inputs",{"$f":"VLOOKUP(fm_lkp_io,port_table,4,FALSE)*tot_fm_in+VLOOKUP(fm_lkp_proc,port_table,4,FALSE)*tot_fm_proc+VLOOKUP(\"flow_air\",port_table,4,FALSE)*tot_fm_air+VLOOKUP(\"alarm\",port_table,4,FALSE)*tot_chem_alarm+VLOOKUP(\"ph\",port_table,4,FALSE)*pH_controls+VLOOKUP(\"temp\",port_table,4,FALSE)*temp_meters+VLOOKUP(\"TDS\",port_table,4,FALSE)*num_TDS+VLOOKUP(\"turb\",port_table,4,FALSE)*tot_turb_meters+VLOOKUP(\"switch\",port_table,4,FALSE)*tot_switches+VLOOKUP(\"TO\",port_table,4,FALSE)*tot_TOs+VLOOKUP(\"CO\",port_table,4,FALSE)*tot_COs+VLOOKUP(\"valve\",port_table,4,FALSE)*tot_MOVs","v":20},"units"]
["Total analog outputs","analog_outputs",{"$f":"IF(manual=2,0,VLOOKUP(fm_lkp_io,port_table,5,FALSE)*tot_fm_in+VLOOKUP(fm_lkp_proc,port_table,5,FALSE)*tot_fm_proc+VLOOKUP(\"flow_air\",port_table,5,FALSE)*tot_fm_air+VLOOKUP(\"alarm\",port_table,5,FALSE)*tot_chem_alarm+VLOOKUP(\"ph\",port_table,5,FALSE)*pH_controls+VLOOKUP(\"temp\",port_table,5,FALSE)*temp_meters+VLOOKUP(\"TDS\",port_table,5,FALSE)*num_TDS+VLOOKUP(\"turb\",port_table,5,FALSE)*tot_turb_meters+VLOOKUP(\"switch\",port_table,5,FALSE)*tot_switches+VLOOKUP(\"TO\",port_table,5,FALSE)*tot_TOs+VLOOKUP(\"CO\",port_table,5,FALSE)*tot_COs+VLOOKUP(\"valve\",port_table,5,FALSE)*tot_MOVs)","v":12},"units"]
["I/O Discrete Output Modules","plc_discrete_output",{"$f":"ROUNDUP(discrete_outputs/32,0)","v":1},"units"]
["I/O Discrete Input Modules","plc_discrete_input",{"$f":"ROUNDUP(discrete_inputs/32,0)","v":1},"units"]
["I/O Combination Analog Modules","plc_combination_analog",{"$f":"ROUNDUP((analog_inputs + analog_outputs)/12,0)","v":3},"units"]
["Total number of PLC slots used","plc_slots",{"$f":"plc_cpu + plc_ethernet + plc_discrete_input + plc_discrete_output +  plc_combination_analog","v":9},"units"]
["Expansions required","plc_expansions",{"$f":"IF(plc_slots<=9,0,ROUNDUP((plc_slots-9)/8,0))","v":0},"units"]
["PLC Rack/Power Supplies","plc_rack",{"$f":"1+plc_expansions","v":1},"units"]
["Base Expansion Modules","plc_base_expansion",{"$f":"plc_expansions","v":0},"units"]
["Base Expansion Controller Modules","plc_base_expansion_controller",{"$f":"plc_expansions","v":0},"units"]
["Number of computer workstations","workstations",{"$f":"ROUNDUP(Operator_LOE/2080/shifts_day/workstation_ratio,0)","v":1},"units"]
["Number of printers","printers",{"$f":"ROUNDUP(workstations/printer_ratio,0)","v":1},"units"]

{"sheet":"O&M","index":16,"n_rows":68,"n_cols":5,"rows_kept":68,"cut":false,"hidden":false,"merged":[]}
["Operation and Maintenance Calculations"]
[]
["Calculation","Range Name","Value","Units","Guidance"]
["Labor and Materials"]
["Maintenance materials"]
["Material cost for pumps","pump_materials",{"$f":"pump_maintenance*OUTPUT!J47","v":119.20752210585357},"/yr"]
["Material cost for blowers","blow_materials",{"$f":"pump_maintenance*SUMPRODUCT(OUTPUT!J62:J63,OUTPUT!L62:L63)","v":561.8587615465334},"/yr"]
["Material cost for PTA towers","pta_materials",{"$f":"PTA_maintenance*SUMPRODUCT(OUTPUT!J32:J45,OUTPUT!L32:L45)","v":2460.7300101643086},"/yr"]
["Materials for clearwell","tank_materials",{"$f":"pump_maintenance*OUTPUT!J65","v":35.593451325000011},"/yr"]
[]
["General Labor"]
["Number of process instruments","tot_inst",{"$f":"tot_fm_in+tot_fm_proc+tot_fm_air+temp_meters+pH_controls+tot_turb_meters+num_TDS","v":8},null,"Instruments requiring daily observation"]
["Total number of instruments for maintenance","tot_inst_maint",{"$f":"tot_fm_in+tot_fm_proc+tot_fm_air+temp_meters+pH_controls+tot_turb_meters+num_TDS","v":8},null,"All instruments for preventative maintenance"]
["Number of process pumps, blowers, offgas units","tot_pumps",{"$f":"NUM_OF_PUMPS+PARALLEL+CHOOSE(Offgas_Tech+1,0,op_GAC_beds,op_TOs,op_COs)+IF(chem_type=1,0,cc_pumps-NRD_cm_pump)+IF(HCl_pumps=0,0,HCl_pumps-NRD_cm_pump)+IF(NaOH_pumps=0,0,NaOH_pumps-NRD_cm_pump)","v":5},null,"Pumps requiring daily observation/adjustment; includes blowers & offgas units in this technology"]
["Total number of pumps for maintenance","tot_pumps_maint",{"$f":"NUM_OF_PUMPS+PARALLEL","v":4},null,"Large, frequently operated pumps require preventative maintenance; includes blowers in this technology"]
["Number of process valves","tot_valves",{"$f":"tot_proc_MOVs+tot_air_MOVs+tot_bp_MOVs+tot_proc_man+tot_air_man+tot_bp_man","v":8},null,"Main process valves require frequent operation and preventative maintenance"]
["Number of chemical supplies","tot_chem",{"$f":"cc_tanks+tp_tanks+sh_tanks+NaOH_tanks+HCl_tanks","v":3}]
["Media changeouts per year","media_changes",{"$f":"IF(Offgas_Tech=1,op_GAC_beds*12/bed_life,0)","v":0},null,"For offgas GAC"]
[]
["Record system operating parameters (includes routine sampling)",null,{"$f":"IF(manual=1,tot_inst*uloe_inst*365/60,uloe_inst_auto*365/60)","v":30.416666666666668},"hr/yr"]
["Preventative maintenance and calibration of instruments",null,{"$f":"tot_inst_maint*uloe_inst_maint*12/60","v":16},"hr/yr"]
["Verify/adjust pump, blower & offgas operating parameters",null,{"$f":"IF(OR(manual=1,manual=2),tot_pumps*uloe_pump*365/60,0)","v":0},"hr/yr"]
["Preventative maintenance of pumps",null,{"$f":"tot_pumps_maint*uloe_pump_maint","v":121},"hr/yr"]
["Verify/adjust valve positions",null,{"$f":"IF(OR(manual=1,manual=2),tot_valves*uloe_valve*52/60,0)","v":0},"hr/yr"]
["Preventative maintenance and inspection of valves",null,{"$f":"tot_valves*uloe_valve_maint/60","v":0.66666666666666663},"hr/yr"]
["Visual inspection of facility",null,{"$f":"(total_fp+blower_fp+vessel_fp+offgas_fp)/100*uloe_fp*365/60","v":24.272500000000001},"hr/yr"]
["Maintain/inspect chemical supply ",null,{"$f":"tot_chem*uloe_chem_maint*12/60","v":36},"hr/yr"]
["Managing media changeouts",null,{"$f":"media_changes*uloe_throwaway","v":0},"hr/yr","For offgas GAC"]
["General Operator Labor","General_Oper_Labor",{"$f":"SUM(C20:C28)","v":228.35583333333335},"hr/yr"]
[]
["Annual Operator LOE","Operator_LOE",{"$f":"General_Oper_Labor","v":228.35583333333335},"hr/yr"]
["Annual Manager LOE","Manager_LOE",{"$f":"Operator_LOE*manager_percent","v":22.835583333333336},"hr/yr","Based on general operator labor and percentages in critical design assumptions"]
["Annual Administrative LOE","Clerical_LOE",{"$f":"Operator_LOE*clerical_percent","v":22.835583333333336},"hr/yr","Based on general operator labor and percentages in critical design assumptions"]
[]
["Building Maintenance"]
["Cost for all buildings, excluding heating and cooling",null,{"$f":"building_matl_rate_cl*total_fp","v":992.76068767042557},"/yr","Labor and materials; includes routine in-house maintenance and major repairs"]
["Cost to maintain heating system, building 1",null,{"$f":"build1_need_heat*heating_matl_rate_cl*total_fp","v":0},"/yr"]
["Cost to maintain cooling system, building 1",null,{"$f":"build1_need_cool*cooling_matl_rate_cl*total_fp","v":0},"/yr"]
["Annual maintenance for all buildings","bldg_maint_cost",{"$f":"SUM(C36:C38)","v":992.76068767042557}]
[]
["Energy"]
["Booster Pumps",null,null,null,"Other pumps and mechanical equipment used infrequently.  Therefore, these energy costs may be assumed covered by overall process and building energy costs."]
["Pump operating head","Head_O",{"$f":"PACK_HT+AIRWELL_D+add_head","v":8.0343728685078801},"m - H20"]
["Pressure head","Press_H",{"$f":"HEAD_O*PW*G","v":78793.552680710287},"N/m2"]
["Operating power","PWR",{"$f":"IF(NUM_OF_PUMPS=0,0,QWA*(1+bp_pct)*(PRESS_H/PUMP_EFF))","v":33.703679513998232},"Watts"]
["Energy for all active booster pumps","pump_energy",{"$f":"PWR*24*365/1000000","v":0.2952442325426245},"MWhr/yr"]
[]
["Blowers"]
["Daily Air Flow","Daily_Air",{"$f":"(+QWA/QW)*AIR_FLOW","v":2.9835330000000007E-2},"m3/s"]
["Operating Power","blower_pwr",{"$f":"DAILY_AIR*(AIR_P/BLOW_EFF)","v":24.287362474209036},"Watts"]
["Energy for all active blowers","blow_energy",{"$f":"blower_pwr*24*365/1000000","v":0.21275729527407117},"MWhr/yr"]
[]
["Building Lighting"]
["Lighting power per sf, building 1","lighting_energy_1",{"$f":"IF(OR(total_fp<500,component_level=\"\"),lighting_power_low,CHOOSE(component_level,lighting_power_mid,lighting_power_high))*24*365/1000","v":8.76},"kWh/sf/yr"]
["Lighting","lighting",{"$f":"MIN(1,Operator_LOE/(24*365))*(total_fp*lighting_energy_1)/1000","v":4.3387608333333334E-2},"MWh/yr"]
[]
["HVAC"]
["Heating energy usage for:"]
["Electric resistance","heating",{"$f":"IF(build1_heat=A59,VLOOKUP(A59,build1_heat_options, 7,FALSE),0)","v":0},"MWh/yr"]
["Natural gas non-condensing furnace","heating_gas_non",0,"therms/yr"]
["Natural gas condensing furnace","heating_gas",0,"therms/yr"]
["Standard efficiency oil furnace","heating_diesel_non",0,"gal/yr"]
["Mid-efficiency oil furnace","heating_diesel",0,"gal/yr"]
["Heat pump","heating_hp",0,"MWh/yr"]
[]
["Cooling energy usage for:"]
["Air conditioner","cooling",{"$f":"IF(build1_cool=A67,VLOOKUP(A67,build1_cool_options, 7,FALSE),0)","v":0},"MWh/yr"]
["Heat pump","cooling_hp",{"$f":"IF(build1_cool=A68,VLOOKUP(A68,build1_cool_options, 7,FALSE),0)","v":0},"MWh/yr"]

{"sheet":"HVAC","index":17,"n_rows":76,"n_cols":12,"rows_kept":76,"cut":false,"hidden":false,"merged":[]}
["Building Heating, Ventilating, and Air Conditioning Calculations"]
[]
["Calculation","Range Name","Value","Units","Guidance"]
["General information"]
["System size","ss_cat2",{"$f":"IF(design_flow<1,1,IF(design_flow<10,2,3))","v":1},"1 indicates small system, 2 indicates medium, 3 indicates large","ss_cat2 is used to select ventilation requirements and building type"]
["Buiding 1 length and width","build1_side",{"$f":"total_fp^0.5","v":13.784048752090222},"ft"]
[]
["Ventilation"]
["Building 1 weighted average air changes","air_changes_build1",{"$f":"(Air_changes_pump*pump_fp+Air_changes_chem_storage*(cstore_fp)+Air_changes_office*office_fp)/total_fp","v":18.936842105263157},"air changes/hr"]
["Total ventilation","ventilation",{"$f":"CHOOSE(ss_cat2,fan_days_small,fan_days_medium,fan_days_large)*24*0.746*Fan_pressure_drop*total_fp*Building_height*air_changes/33000000","v":0.87843534545454527},"MWh/yr"]
[]
["Building 1 air exchange rate","build1_cfm",{"$f":"total_fp*Building_height*air_changes_build1/60","v":1199.3333333333333},"cfm"]
[]
["Heating and Cooling"]
["Include heating for building 1","build1_need_heat",{"$f":"VLOOKUP(IF(component_level_I=\"\",\"low cost\",component_level_I),IF(total_fp<500,heating_table_shed,heating_table),ss_cat2+2,FALSE)","v":0},"1 for yes, 0 for no","Based on system size, building floorplan, and component level input."]
["Include cooling for building 1","build1_need_cool",{"$f":"VLOOKUP(IF(component_level_I=\"\",\"low cost\",component_level_I),IF(total_fp<500,cooling_table_shed,cooling_table),ss_cat2+2,FALSE)","v":0},"1 for yes, 0 for no"]
[]
["Heating Requirements"]
["Building 1 side conductance heat loss",null,{"$f":"4*build1_side*Building_height*heat_DD*24/R_wall","v":10022233.404042855},"BTU/yr"]
["Buiding 1 ceiling conductance heat loss",null,{"$f":"total_fp*heat_DD*24/R_ceiling","v":590760},"BTU/yr"]
["Building 1 air exchange heat loss",null,{"$f":"build1_cfm*heat_viload","v":202302347.33333331},"BTU/yr"]
["Building 1 total annual heat loss","build1_heat_loss_yr",{"$f":"SUM(C19:C21)","v":212915340.73737615},"BTU/yr"]
["Building 1 heating requirement in thousand BTU/hr","build1_heat_mbh",{"$f":"build1_heat_loss_yr/365.25/24/1000","v":24.288768051263538},"MBH","thousands of BTU per hour"]
["Building 1 number of heating zones","build1_heat_zones",{"$f":"ROUNDUP(build1_heat_mbh/max_heat_cl,0)","v":1}]
[]
["Cooling Requirements"]
["Building 1 side conductance cooling loss",null,{"$f":"4*build1_side*Building_height*cool_DD*24/R_wall","v":3454749.154308496},"BTU/yr"]
["Buiding 1 ceiling conductance cooling loss",null,{"$f":"total_fp*cool_DD*24/R_ceiling","v":203640},"BTU/yr"]
["Building 1 air exchange cooling loss",null,{"$f":"build1_cfm*cool_viload","v":62090685.999999993},"BTU/yr"]
["Building 1 total annual cooling loss","build1_cooling_loss_yr",{"$f":"SUM(C27:C29)","v":65749075.15430849},"BTU/yr"]
["Building 1 cooling loss per hour","build1_cooling_loss_hr",{"$f":"build1_cooling_loss_yr/365.25/24","v":7500.4648818512987},"BTU/hr"]
[]
["Building 1 power lost: booster pumps","build1_eloss_pumps",{"$f":"pump_energy/PUMP_EFF*(1-PUMP_EFF)/365.25/24*1000","v":1.1226870200875523E-2},"kWh"]
["Building 1 waste heat: booster pumps","build1_waste_heat_pumps",{"$f":"build1_eloss_pumps*3415","v":38.33976173598991},"BTU/hr"]
[]
["Building 1 total cooling requirement","build1_cooling_req",{"$f":"build1_cooling_loss_hr+build1_waste_heat_pumps","v":7538.8046435872884},"BTU/hr"]
["Building 1 annual cooling requirement","build1_cooling_yr",{"$f":"build1_cooling_req*365.25*24","v":66085161.505686179},"BTU/yr"]
["Building 1 total cooling requirement in tons","build1_cooling_tons",{"$f":"build1_cooling_req/12000","v":0.62823372029894065},"tons","1 ton cooling = 12,000 BTU/hr"]
["Building 1 number of cooling zones","build1_cool_zones",{"$f":"ROUNDUP(build1_cooling_tons/max_cool_cl,0)","v":1}]
[]
["Heating Options"]
[]
["Building 1 number of HVAC zones","build1_zones",{"$f":"MAX(build1_heat_zones, build1_cool_zones)","v":1}]
[]
["Heat pump OK for building 1?","hp_ok_1",{"$f":"AND(build1_heat_mbh<=hp_max_heat_cl,build1_cooling_tons<=hp_max_cool_cl)","v":true},null,"For heat pumps, we check both heating and cooling capacities."]
[]
["Building 1","build1_heat_options"]
["Option","Size needed per zone (MBH)","Size selected (MBH)","Direct Cost Per Zone","Useful Life (yrs)","Annualized Capital Cost, All Zones","Energy/Yr",null,"Energy Unit Cost",null,"Annual Energy Cost","Total Annual Cost"]
["Electric resistance",{"$f":"build1_heat_mbh/build1_zones","v":24.288768051263538},{"$f":"IF(curve=1,B49,VLOOKUP(B49,hvac_elec_cost_cl,2))","v":24.288768051263538},{"$f":"IF(curve=1,hvac_elec_eq_1,VLOOKUP(B49,hvac_elec_cost_cl,3))","v":21787.227072587459},{"$f":"VLOOKUP(B49,hvac_elec_cost_cl,IF(ss_cat=\"large\",4,5))","v":20},{"$f":"IF(D49=\"contact vendor\",\"n/a\",-PMT(Discount_rate,E49,D49)*build1_zones)","v":2056.5601072141981},{"$f":"build1_heat_loss_yr/3412000/resist_eff","v":63.675425490279252},"MWh/yr",{"$f":"energy_cost_cl","v":0.10277862595419847},"/kwh",{"$f":"I49*G49*1000","v":6544.4727389398458},{"$f":"IF(OR(F49=\"n/a\",K49=\"n/a\"),\"n/a\",F49+K49)","v":8601.0328461540448}]
["Heat pump","capital costs are in the cooling table",null,null,null,"n/a",{"$f":"IF(hp_ok_1,build1_heat_loss_yr/3412000/COP,\"n/a\")","v":19.50059905639802},"MWh/yr",{"$f":"energy_cost_cl","v":0.10277862595419847},"/kwh",{"$f":"IF(G50=\"n/a\",\"n/a\",I50*G50*1000)","v":2004.2447763003274},"n/a"]
["Natural gas non-condensing furnace",{"$f":"build1_heat_mbh/build1_zones","v":24.288768051263538},{"$f":"IF(curve=1,B51,VLOOKUP(B51,hvac_gas_non_cost_cl,2))","v":24.288768051263538},{"$f":"IF(curve=1,hvac_gas_non_eq_1,VLOOKUP(B51,hvac_gas_non_cost_cl,3))","v":16477.516439928862},{"$f":"VLOOKUP(B51,hvac_gas_non_cost_cl,IF(ss_cat=\"large\",4,5))","v":20},{"$f":"IF(D51=\"contact vendor\",\"n/a\",-PMT(Discount_rate,E51,D51)*build1_zones)","v":1555.3609857474801},{"$f":"build1_heat_loss_yr/100000/gas_non_eff","v":2661.4417592172017},"therms/yr",{"$f":"gas_cost_cl","v":1.0215033782528224},"/therm",{"$f":"I51*G51","v":2718.6717480635066},4274.0327338109864]
["Natural gas condensing furnace",{"$f":"build1_heat_mbh/build1_zones","v":24.288768051263538},{"$f":"IF(curve=1,B52,VLOOKUP(B52,hvac_gas_cost_cl,2))","v":24.288768051263538},{"$f":"IF(curve=1,hvac_gas_eq_1,VLOOKUP(B52,hvac_gas_cost_cl,3))","v":16477.516439928862},{"$f":"VLOOKUP(B52,hvac_gas_cost_cl,IF(ss_cat=\"large\",4,5))","v":20},{"$f":"IF(D52=\"contact vendor\",\"n/a\",-PMT(Discount_rate,E52,D52)*build1_zones)","v":1555.3609857474801},{"$f":"build1_heat_loss_yr/100000/gas_eff","v":2241.2141130250125},"therms/yr",{"$f":"gas_cost_cl","v":1.0215033782528224},"/therm",{"$f":"I52*G52","v":2289.4077878429534},3844.7687735904337]
["Standard efficiency oil furnace",{"$f":"build1_heat_mbh/build1_zones","v":24.288768051263538},{"$f":"IF(curve=1,B53,VLOOKUP(B53,hvac_oil_std_cost_cl,2))","v":24.288768051263538},{"$f":"IF(curve=1,hvac_oil_std_eq_1,VLOOKUP(B53,hvac_oil_std_cost_cl,3))","v":23541.820581323656},{"$f":"VLOOKUP(B53,hvac_oil_std_cost_cl,IF(ss_cat=\"large\",4,5))","v":20},{"$f":"IF(D53=\"contact vendor\",\"n/a\",-PMT(Discount_rate,E53,D53)*build1_zones)","v":2222.1813219939327},{"$f":"build1_heat_loss_yr/diesel_heat_content/diesel_non_eff","v":1963.8013349693429},"gal/yr",{"$f":"diesel_cost_cl","v":3.9758333333333336},"/gal",{"$f":"I53*G53","v":7807.7468076156129},10029.928129609545]
["Mid-efficiency oil furnace",{"$f":"build1_heat_mbh/build1_zones","v":24.288768051263538},{"$f":"IF(curve=1,B54,VLOOKUP(B54,hvac_oil_mid_cost_cl,2))","v":24.288768051263538},{"$f":"IF(curve=1,hvac_oil_mid_eq_1,VLOOKUP(B54,hvac_oil_mid_cost_cl,3))","v":23541.820581323656},{"$f":"VLOOKUP(B54,hvac_oil_mid_cost_cl,IF(ss_cat=\"large\",4,5))","v":20},{"$f":"IF(D54=\"contact vendor\",\"n/a\",-PMT(Discount_rate,E54,D54)*build1_zones)","v":2222.1813219939327},{"$f":"build1_heat_loss_yr/diesel_heat_content/diesel_eff","v":1802.0765191483383},"gal/yr",{"$f":"diesel_cost_cl","v":3.9758333333333336},"/gal",{"$f":"I54*G54","v":7164.7558940472691},9386.9372160412022]
[]
["Cooling Options"]
["Building 1","build1_cool_options"]
["Option","Size needed per zone (tons)","Size selected (tons)","Direct Cost Per Zone","Useful Life (yrs)","Annualized Capital Cost, All Zones","Energy/Yr",null,"Energy Unit Cost",null,"Annual Energy Cost","Total Annual Cost"]
["Air conditioner",{"$f":"build1_cooling_tons/build1_zones","v":0.62823372029894065},{"$f":"IF(curve=1,B59,VLOOKUP(B59,hvac_ac_cost_cl,2))","v":0.62823372029894065},{"$f":"IF(curve=1,hvac_ac_eq_1,VLOOKUP(B59,hvac_ac_cost_cl,3))","v":1304.3248202210766},{"$f":"VLOOKUP(B59,hvac_ac_cost_cl,IF(ss_cat=\"large\",4,5))","v":20},{"$f":"IF(D59=\"contact vendor\",\"n/a\",-PMT(Discount_rate,E59,D59)*build1_zones)","v":123.11903590021342},{"$f":"build1_cooling_yr/EER/10^6","v":6.0077419550623796},"MWh/yr",{"$f":"energy_cost_cl","v":0.10277862595419847},"/kwh",{"$f":"I59*G59*1000","v":617.46746322870138},{"$f":"IF(F59=\"n/a\",\"n/a\",F59+K59)","v":740.58649912891474}]
["Heat pump",{"$f":"build1_cooling_tons/build1_zones","v":0.62823372029894065},{"$f":"IF(hp_ok_1,IF(curve=1,B60,VLOOKUP(B60,hvac_hp_cost_cl,2)),\"n/a\")","v":0.62823372029894065},{"$f":"IF(C60=\"n/a\",\"n/a\",IF(curve=1,hvac_hp_eq_1,VLOOKUP(B60,hvac_hp_cost_cl,3)))","v":3181.7942390777198},{"$f":"IF(C60=\"n/a\",\"n/a\",VLOOKUP(B60,hvac_hp_cost_cl,IF(ss_cat=\"large\",4,5)))","v":20},{"$f":"IF(OR(D60=\"contact vendor\",D60=\"n/a\"),\"n/a\",-PMT(Discount_rate,E60,D60)*build1_zones)","v":300.33886733958195},{"$f":"IF(C60=\"n/a\",\"n/a\",build1_cooling_yr/hp_EER/10^6)","v":6.5430852975926914},"MWh/yr",{"$f":"energy_cost_cl","v":0.10277862595419847},"/kwh",{"$f":"IF(C60=\"n/a\",\"n/a\",I60*G60*1000)","v":672.48931638769466},{"$f":"IF(F60=\"n/a\",\"n/a\",F60+K60)","v":972.82818372727661}]
[]
[]
["Heating and Cooling Selection",null,null,null,"We will select the option with the lowest annual cost for each building."]
[]
["Building 1 Selection"]
["Heating option","Annual cost","Cooling option","Annual cost","Total annual cost"]
["Electric resistance",{"$f":"IF(build1_need_heat,VLOOKUP(A67,build1_heat_options,12,FALSE),0)","v":0},"Air conditioner",{"$f":"IF(build1_need_cool,VLOOKUP(C67,build1_cool_options,12,FALSE),0)","v":0},{"$f":"IF(OR(B67=\"n/a\",D67=\"n/a\"),\"n/a\",ROUND(B67+D67,0))","v":0}]
["Natural gas non-condensing furnace",{"$f":"IF(build1_need_heat,VLOOKUP(A68,build1_heat_options,12,FALSE),0)","v":0},"Air conditioner",{"$f":"IF(build1_need_cool,VLOOKUP(C68,build1_cool_options,12,FALSE),0)","v":0},0]
["Natural gas condensing furnace",{"$f":"IF(build1_need_heat,VLOOKUP(A69,build1_heat_options,12,FALSE),0)","v":0},"Air conditioner",{"$f":"IF(build1_need_cool,VLOOKUP(C69,build1_cool_options,12,FALSE),0)","v":0},0]
["Standard efficiency oil furnace",{"$f":"IF(build1_need_heat,VLOOKUP(A70,build1_heat_options,12,FALSE),0)","v":0},"Air conditioner",{"$f":"IF(build1_need_cool,VLOOKUP(C70,build1_cool_options,12,FALSE),0)","v":0},0]
["Mid-efficiency oil furnace",{"$f":"IF(build1_need_heat,VLOOKUP(A71,build1_heat_options,12,FALSE),0)","v":0},"Air conditioner",{"$f":"IF(build1_need_cool,VLOOKUP(C71,build1_cool_options,12,FALSE),0)","v":0},0]
["Heat pump",{"$f":"IF(AND(build1_need_heat, build1_need_cool),K50,\"n/a\")","v":"n/a"},"Heat pump",{"$f":"IF(AND(build1_need_heat,build1_need_cool),VLOOKUP(C72,build1_cool_options,12,FALSE),0)","v":0},"n/a"]
[]
["Row selected","build1_row",{"$f":"MATCH(MIN(E67:E72),E67:E72,0)","v":1}]
["Building 1 heating selection","build1_heat",{"$f":"IF(build1_need_heat,INDEX(A67:A72,build1_row),\"n/a\")","v":"n/a"}]
["Building 1 cooling selection","build1_cool",{"$f":"IF(build1_need_cool,INDEX(C67:C72,build1_row),\"n/a\")","v":"n/a"}]

{"sheet":"Indirect","index":18,"n_rows":82,"n_cols":5,"rows_kept":82,"cut":false,"hidden":false,"merged":[]}
["Indirect and Add-on Cost Calculations"]
[]
["Calculation","Range Name","Value","Units","Guidance"]
["Standby Power"]
["Booster pumps",null,{"$f":"pump_energy*design_flow/average_flow/365/24*1000","v":0.14444434077427815},"kW"]
["Blowers",null,{"$f":"blow_energy*design_flow/average_flow/365/24*1000","v":0.10408869631803871},"kW"]
["Offgas blowers",null,{"$f":"IF(Offgas_Tech=2,TO_power_yr,IF(Offgas_Tech=3,CO_power_yr,0))*design_flow/average_flow/365/24*1000","v":0},"kW"]
["Lighting",null,{"$f":"(total_fp*lighting_energy_1)/365/24","v":0.18999999999999997},"kW"]
["Building 1 ventilation",null,{"$f":"0.746*Fan_pressure_drop*total_fp*Building_height*air_changes/33000","v":0.40668303030303032},"kW"]
["Total base standby power requirement","std_base",{"$f":"SUM(C5:C9)","v":0.84521606739534716},"kW"]
[]
["Electric heating for Building 1?","build1_elec_heat",{"$f":"IF(build1_need_heat=1,VLOOKUP(build1_heat,build1_heat_options,8,FALSE)=\"MWh/yr\",FALSE)","v":false}]
["Power to heat Building 1","build1_elec_heat_power",{"$f":"IF(build1_elec_heat,VLOOKUP(build1_heat,build1_heat_options,7,FALSE),0)*365.25*24/1000","v":0},"kW"]
["Standby power for heating","std_heat",{"$f":"build1_elec_heat_power","v":0},"kW"]
[]
["Electric cooling for Building 1?","build1_elec_cool",{"$f":"IF(build1_need_cool,(VLOOKUP(build1_cool,build1_cool_options,8,FALSE)=\"MWh/yr\"),FALSE)","v":false}]
["Power to cool Building 1","build1_elec_cool_power",{"$f":"IF(build1_elec_cool,VLOOKUP(build1_cool,build1_cool_options,7,FALSE),0)*365.25*24/1000","v":0},"kW"]
["Standby power for cooling","std_cool",{"$f":"build1_elec_cool_power","v":0},"kW"]
[]
["Total standby power requirements","std_power",{"$f":"ROUNDUP(2*MAX(min_standby,(IF(AND(need_heat=1,need_cool=1),MAX(std_heat,std_cool),need_heat*std_heat+need_cool*std_cool)+std_base)*(1+std_safety_factor)),0)/2","v":1.5},"kW"]
["Total standby power cost","std_power_cost",{"$f":"VLOOKUP(std_power,std_gen_cost_cl,3)*std_power","v":1396.9796367638967}]
[]
["Geotechnical & Sitework"]
["Total technology footprint","tech_fp",{"$f":"total_fp+vessel_fp+blower_fp+offgas_fp","v":399},"square feet"]
["Maximum basin excavation depth","max_excav_depth",{"$f":"IF(AW_DET=0,0,AIRWELL_D*3.28+overexcavate)","v":7.6012895999999994},"feet"]
["Borehole depth","bore_depth",{"$f":"IF(max_excav_depth=0,bore_depth_nobasin,IF(max_excav_depth>deep_bore_need,bore_depth_max,bore_depth_min))","v":25},"feet"]
["Number of boreholes","num_holes",{"$f":"IF(tech_fp<bore_need,0,IF(ROUNDUP(tech_fp/hole_per_sf,0)<min_holes,min_holes,ROUNDUP(tech_fp/hole_per_sf,0)))","v":0}]
["Number of test pits","num_pits",{"$f":"IF(tech_fp>bore_need,0,ROUNDUP(tech_fp/hole_per_sf,0))","v":1}]
[]
["Costs"]
["Borings, initial field stake out & determination of elevations",null,{"$f":"IF(num_pits>0,1,ROUNDUP(num_holes/hole_per_job,0))*VLOOKUP(0,stake_out_cost_cl,3)","v":1275}]
["Borings, drawings showing boring details",null,{"$f":"ROUNDUP(num_holes/hole_per_job,0)*VLOOKUP(0,bore_draw_cost_cl,3)","v":0}]
["Borings, report and recommendations from P.E.",null,{"$f":"ROUNDUP(num_holes/hole_per_job,0)*VLOOKUP(0,bore_report_cost_cl,3)","v":0}]
["Borings, mobilization and demobilization, minimum",null,{"$f":"VLOOKUP(0,bore_mob_cost_cl,3)","v":670}]
["Borings, drill rig and crew with truck mounted auger",null,{"$f":"ROUNDUP(bore_depth*num_holes/hole_per_day,0)*VLOOKUP(0,bore_rig_cost_cl,3)","v":0}]
["Borings, cased borings in earth, w/samples, 2.5\" dia",null,{"$f":"num_holes*bore_depth*VLOOKUP(0,bore_cost_cl,3)","v":0}]
["Test pits",null,{"$f":"pit_width*pit_length*pit_depth/27*num_pits*VLOOKUP(0,backfill_cost_cl,3)","v":54.091851851851843}]
["Total geotechnical cost","geotech_cost",{"$f":"SUM(C31:C37)","v":1999.0918518518517}]
[]
["Total sitework cost","sitework_cost",{"$f":"tech_fp*sitework_sf_cl","v":4628.3999999999996}]
[]
["Yard Piping"]
["Actual yard piping diameter","yard_pipe_diam",{"$f":"SUMPRODUCT(OUTPUT!G131:G135,OUTPUT!L131:L135)","v":1.5},"in. diam","Based on output sheet selection for inlet and outlet pipe"]
["Trench depth to top of pipe","trench_depth",{"$f":"MAX(frost,min_trench_depth)","v":38},"inches"]
["Thrust force","thrust_force",{"$f":"VLOOKUP(yard_pipe_diam,thrust_block_table_cl,2)*2.2","v":764.79838682438469},"lbs"]
["Bearing Area (L x H)","bearing_area",{"$f":"1.5*thrust_force/(soil_dens*(trench_depth/12+yard_pipe_diam/12)*Coeff_Kp*Reduction)","v":2.5645578679308643},"square ft"]
["L",null,{"$f":"bearing_area/C48","v":2.2647551160913024},"ft"]
["H",null,{"$f":"(bearing_area/2)^0.5","v":1.1323775580456512},"ft"]
["F",null,{"$f":"MAX(0.5,yard_pipe_diam/12)","v":0.5},"ft","Pipe diameter with a minimum of 6 inches"]
["T",null,{"$f":"C47/2","v":1.1323775580456512},"ft"]
["Thrust block volume","block_vol",{"$f":"(C50+(yard_pipe_diam/12)/2)*(C47+C49)/2*C48/27","v":6.9275164969845107E-2},"cy"]
["Trench Cross-section Area","trench_area",{"$f":"(yard_pipe_diam/12+2)*(bedding_depth/12+yard_pipe_diam/12+trench_depth/12)+(bedding_depth/12+yard_pipe_diam/12+trench_depth/12)^2*TAN(trench_angle)","v":22.434027777777775},"square ft"]
["Trench Volume Source Water",null,{"$f":"trench_area*yard_in/27","v":0},"cy"]
["Trench Volume Inlet & Outlet",null,{"$f":"((2*non_fire_buffer)+2*(total_fp^0.5)/4)*trench_area/27","v":22.34431192047678},"cy"]
["Trench Volume to Distribution Network",null,{"$f":"trench_area*yard_out/27","v":0},"cy"]
["Trench Volume total","trench_vol",{"$f":"SUM(C53:C55)+block_vol","v":22.413587085446625},"cy"]
["Equivalent pipe length","yard_pipe_length",{"$f":"yard_in+yard_out+2*(2*non_fire_buffer+2*(trench_depth+yard_pipe_diam)/12)+(total_fp^0.5/2)","v":60.058691042711772},"lf"]
["Bedding cross sectional surface area",null,{"$f":"(yard_pipe_diam/12+2)*(bedding_depth/12+yard_pipe_diam/12*bedding_pct)+(bedding_depth/12+yard_pipe_diam/12*bedding_pct)^2*TAN(trench_angle)-((yard_pipe_diam/12/2)^2*ACOS((yard_pipe_diam/12/2-bedding_pct*yard_pipe_diam/12)/(yard_pipe_diam/12/2))-(yard_pipe_diam/12/2-yard_pipe_diam/12*bedding_pct)*((2*yard_pipe_diam/12/2*yard_pipe_diam/12*bedding_pct-(yard_pipe_diam/12*bedding_pct)^2)^0.5))","v":1.4087336529324048},"square ft"]
["Bedding volume","bedding_vol",{"$f":"C58*yard_pipe_length/2/27","v":1.5667907263507048},"cy"]
[]
["Costs"]
["Bedding cost",null,{"$f":"IF(ISERROR(bedding_vol),0,VLOOKUP(0,bedding_cost_cl,3)*bedding_vol)","v":78.026178172265091}]
["Excavation cost",null,{"$f":"trench_vol*VLOOKUP(0,excavate_cost_cl,3)","v":630.43817074589992}]
["Backfill cost",null,{"$f":"trench_vol*VLOOKUP(0,backfill_cost_cl,3)","v":292.27317559422397}]
["Thrust block cost",null,{"$f":"block_vol*VLOOKUP(0,conc_basin_cost_cl,3)","v":37.702480311705315}]
["Pipe cost",null,{"$f":"yard_pipe_length*SUMPRODUCT(OUTPUT!I131:I135,OUTPUT!L131:L135)","v":136.96305846185234}]
["Total yard piping cost","yard_cost",{"$f":"SUM(C62:C66)","v":1175.4030632859467}]
[]
["Permits"]
["Building #1 value",null,{"$f":"SUMPRODUCT(OUTPUT!J277:J289,OUTPUT!L277:L289)","v":7976.3992643261427},null,"Determined using Use? Column of output sheet"]
["Building permit cost",null,{"$f":"BPCost_UBC97(C70)","v":{"$error":"#NAME?"}},null,"Included only if direct discharge to surface water is the management option chosen on the input sheet"]
["Storm water permit cost",null,{"$f":"VLOOKUP(land_required,SW_permit_cost_cl,2)","v":0},null,"Applies to systems requiring 1 acre of land or greater"]
["Risk management plan",null,{"$f":"IF(AND(acid_type=2,hcl_strength>HCl_strength_RMP,HCl_init>HCl_quant_RMP),RMP_cost_cl,0)","v":0},null,"Triggered if high strength HCl stored in large quantities"]
["NEPA compliance",null,{"$f":"IF(include_NEPA=2,0,IF(OR(component_level=2,include_NEPA=1),VLOOKUP(land_required,NEPA_cost_cl,2),0))","v":0},null,"Included only for high cost estimates, unless assumption \"include_NEPA\" is changed on CDA sheet"]
["Total permit cost","permit_cost",{"$f":"SUM(C71:C74)","v":{"$error":"#NAME?"}}]
[]
["Construction Management and General Contractor Job Overhead"]
["Builder's risk insurance percentage",null,{"$f":"br_ins_pct*direct_cost","v":646.19822802277054}]
["Performance bond cost",null,{"$f":"include_bond*(VLOOKUP(direct_cost,performance_bond_table_cl,3)+VLOOKUP(direct_cost,performance_bond_table_cl,4)*(direct_cost-VLOOKUP(direct_cost,performance_bond_table_cl,5)))","v":3850.874535394576},null,"Bracket determined from direct capital cost"]
["Construction management percentage",null,{"$f":"VLOOKUP(direct_cost,construction_mgt_table_cl,3)","v":0.09},null,"Looked up from direct capital cost"]
["Construction management fee",null,{"$f":"include_cm*C80*direct_cost","v":17105.247212367456}]
["Total construction management/job overhead cost","cm_cost",{"$f":"SUM(C78:C79,C81)","v":21602.319975784801}]

{"sheet":"Henry's Reference","index":19,"n_rows":52,"n_cols":4,"rows_kept":52,"cut":false,"hidden":false,"merged":[]}
["Reference Data and Sources for Henry's Law Coefficient"]
["Units used in this model"]
["Sources of Henry's coefficient data for various contaminants"]
["Calculator for theoretical prediction of Henry's coefficient"]
["Converting Henry's coefficient from other units"]
["Adjusting Henry's coefficient for temperature"]
[]
["For use in this model, Henry's Coefficient must be entered in the following units:"]
["Atmospheres * cubic meters [of water] / cubic meters [of air]"]
["Note: at standard pressure (1 atmosphere), these units are equal to the dimensionless units often used for Henry's constant in the literature"]
[]
["The following sources compile Henry's Coefficient data for large numbers of contaminants:"]
[]
["Sander, R. 1999. Compilation of Henry's Law Constants for Inorganic and Organic Species of Potential Importance in Environmental Chemistry (Version 3). Germany: Max-Planck Institute of Chemistry."]
["Units used in Sander (1999) are molar concentration (in moles / cubic decimeter) / atmosphere (M / atm). See below for conversion information."]
["Sander (1999) also provides temperature dependence constants corresponding to a natural log relationship: HT2 = HT1 * e ^ (-C * (1/T2 – 1/T1)). See below for information on adjusting for temperature."]
["Data from Sander (1999) are republished at http://webbook.nist.gov"]
[]
["Staudinger, J and P.V. Roberts. 2001. “A critical compilation of Henry’s law constant temperature dependence relations for organic compounds in dilute aqueous solutions.” Chemosphere 44: 561-576."]
["Units used in Staudinger and Roberts (2001) are dimensionless (concentration in air / conentration in water). At 1 atmosphere, these are equal to the units required for use in this model."]
["Staudinger and Roberts (2001) also provide temperature dependence constants corresponding to a log-base 10 relationship: HT2 = HT1 * 10 ^ (-C * (1/T2 – 1/T1)). See below for information on adjusting for temperature."]
[]
["Software to Estimate Physical Properties (StEPP). 2005. Version 1.0.20. Michigan Technological University. Houghton, Michigan."]
["Units used in StEPP (2005) are dimensionless (concentration in air / conentration in water). At 1 atmosphere, these are equal to the units required for use in this model."]
[]
["Agency for Toxic Substances and Disease Registry (ATSDR) Toxicological Profiles"]
["Units used in the ATSDR Toxicological Profiles usually are atmospheres * cubic meters / moles (atm-m3 / mole). See below for conversion information."]
["ATSDR Toxicological Profiles are online at http://www.atsdr.cdc.gov/toxprofiles/index.asp"]
[]
["To estimate Henry's Coefficient in the units used in this model using contaminant characteristics, input values in gold below:"]
["Contaminant name","MTBE"]
["Vapor pressure",197,"mmHg","See note below"]
["Molecular weight",88.149199999999993,"g/mol"]
["Solubility",35500,"mg/L","See note below"]
["Temperature",293,"degrees K"]
["Henry's Coefficient --------->",{"$f":"B32*B33*16.03/(B34*B35)","v":2.6762220850069698E-2},"atm m3/m3"]
["* Note: vapor pressure and solubility can vary with temperature; use values appropriate to the selected temperature."]
["Source: Clark, R. and J. Adams. 1991. EPA's Drinking Water and Groundwater Remediation Cost Evaluation: Air Stripping.  Lewis Publishers."]
[]
["To convert from a value of Henry's Coefficient provided in other units, input values in gold below:"]
["Original Henry's Coefficent",0.92]
["Units for original Henry's Coefficient","M / atm"]
["Temperature corresponding to original Henry's Coefficient",298.14999999999998,"degrees K"]
["Converted Henry's Coefficient ----->",{"$f":"IF(B43=0,\"\",IF(B42=\"atm-m3 / mole\",B41/(0.00008205*B43),IF(B42=\"M / atm\",0.001/B41/(0.00008205*B43),\"\")))","v":4.4432297839076519E-2},"atm m3/m3"]
[]
["To adjust Henry's Coefficient for temperature, input values in gold below:"]
["If Henry's Coefficient is:",4.19E-2,"atm m3/m3"]
["at the temperature:",293,"degrees K"]
["and the temperature dependence constant (C) is:",1705,"degrees K"]
["and the temperature relationship is:","log base 10"]
["Then at the desired temperature of:",283,"degrees K"]
["Henry's Coefficient is:",{"$f":"IF(B50=\"natural log\",B47*EXP(-B49*(1/B51-1/B48)),B47*10^(-B49*(1/B51-1/B48)))","v":2.6097065081603983E-2},"atm m3/m3"]

{"sheet":"Standard Inputs","index":20,"n_rows":139,"n_cols":49,"rows_kept":139,"cut":false,"hidden":false,"merged":[[5,0,5,1],[6,47,6,48],[5,30,5,34],[5,35,5,45],[5,25,5,29],[5,2,5,5],[5,6,5,10],[5,11,5,15],[5,19,5,24]]}
["Standard Designs"]
["Default inputs represent typical options used to generate national average compliance costs."]
[null,null,null,null,null,null,null,null,null,null,null,null,null,null,null,null,null,null,null,null,null,null,null,null,null,null,null,{"$f":"IF(OR(COUNTIF($AA$9:$AA$16,2)>0,COUNTIF($AA$9:$AA$16,3)>0),\"Heat recovery type\",\"\")","v":""}]
[]
[]
["Design Indices",null,"System Size",null,null,null,"Contaminant Removal",null,null,null,null,"Contaminant Properties",null,null,null,null,null,"Operating Parameters",null,"Tower Design",null,null,null,null,null,"Off-gas",null,null,null,null,"Optional",null,null,null,null,"Retrofit (optional)"]
["Contaminant Select","Design #","Design Flow","Design Flow Units","Average Flow","Average flow units","Influent Concentration (ug/L or pCi/L)","Removal units","Percent Removal or Effluenct Concentration","Safety Factor (Kla)","Safety Factor (Henrys)","Henry's Coefficient (atm m^3/m^3)","Molecular Weight (kg/kmole)","Molar Volume (m^3/kmole)","Boiling Point (K)","Melting Point (K)","Operating Temperature (K)","Density of air (kg/m^3)","Viscosity of air (kg/m-sec)","Packing size (inches)","Surface area of packing (m^2/m^3)","Critical surface tension of packing","Friction factor","Alternate packing unit cost","Clearwell Detention Time (min)","VOC Release Limit (lbs/day)","Off-gas Pollution Control Technology","Heat Recovery Type","GAC Regeneration","GAC Bed Life","Number of Pumps","Number of Blowers","Number of Redundant Towers","System Automation","Component level","Retrofit","Additional available height per tower","Height units","Henry's coefficient for new contaminant","Molecular weight of new contaminant","Molar volume of new contaminant","Boiling point of new contaminant","Melting point of new contaminant","Influent concentration of new contaminant","Removal units","Percent Removal or Effluenct Concentration","Contaminant Name","Internal Use"]
[null,null,"QW_IN","df_units","QWA_IN","af_units","Influent_Conc","Units_Rem_I","REM_I","SF_KLA","SF_HENRY","HENRY","MW_IN","MV_IN","TB_IN","TM_IN","T","PA","UA","Packing_size","AP","SP","CF","alt_pack_cost","AW_DET","max_VOC_release","Offgas_tech_I","og_opt1_I","og_opt2_I","og_opt3","num_pumps_I","parallel_I","NRD_I","manual_I","component_level_I","retrofit_I","r_xtraheight_I","r_xtraheight_units","r_Henry","r_Mw_in","r_Mv_in","r_Tb_in","r_Tm_in","r_influent_conc_I","r_units_rem_I","r_rem_I"]
[1,1,0.03,"MGD",7.0000000000000001E-3,"MGD",200,"effluent concentration",20,1.4,1.4,1.17E-2,88.149199999999993,0.126,328.2,null,283,1.2470000000000001,1.7900000000000001E-5,2,157,3.3000000000000002E-2,15,null,5,1,"none","none",null,null,null,null,null,"fully automated",null,null,null,null,null,null,null,null,null,null,null,null,"MTBE",{"$f":"AND(C9:AT9=inp_used,A9=inp_used_usersel)","v":false},{"$f":"AND(C9:F9=inp_used_minimal,A9=inp_used_usersel)","v":false}]
[1,2,0.124,"MGD",3.5000000000000003E-2,"MGD",200,"effluent concentration",20,1.4,1.4,1.17E-2,88.149199999999993,0.126,328.2,null,283,1.2470000000000001,1.7900000000000001E-5,2,157,3.3000000000000002E-2,15,null,5,1,"none","none",null,null,null,null,null,"fully automated",null,null,null,null,null,null,null,null,null,null,null,null,null,{"$f":"AND(C10:AT10=inp_used,A10=inp_used_usersel)","v":false},{"$f":"AND(C10:F10=inp_used_minimal,A10=inp_used_usersel)","v":false}]
[1,3,0.30499999999999999,"MGD",9.4E-2,"MGD",200,"effluent concentration",20,1.4,1.4,1.17E-2,88.149199999999993,0.126,328.2,null,283,1.2470000000000001,1.7900000000000001E-5,2,157,3.3000000000000002E-2,15,null,5,1,"none","none",null,null,null,null,null,"fully automated",null,null,null,null,null,null,null,null,null,null,null,null,null,{"$f":"AND(C11:AT11=inp_used,A11=inp_used_usersel)","v":false},{"$f":"AND(C11:F11=inp_used_minimal,A11=inp_used_usersel)","v":false}]
[1,4,0.74,"MGD",0.251,"MGD",200,"effluent concentration",20,1.4,1.4,1.17E-2,88.149199999999993,0.126,328.2,null,283,1.2470000000000001,1.7900000000000001E-5,2,157,3.3000000000000002E-2,15,null,5,1,"GAC","none","off-site regeneration",null,null,null,null,"fully automated",null,null,null,null,null,null,null,null,null,null,null,null,null,{"$f":"AND(C12:AT12=inp_used,A12=inp_used_usersel)","v":false},{"$f":"AND(C12:F12=inp_used_minimal,A12=inp_used_usersel)","v":false}]
[1,5,2.1520000000000001,"MGD",0.81899999999999995,"MGD",200,"effluent concentration",20,1.4,1.4,1.17E-2,88.149199999999993,0.126,328.2,null,283,1.2470000000000001,1.7900000000000001E-5,2,157,3.3000000000000002E-2,15,null,5,1,"Catalytic Oxidation","regenerative",null,null,null,null,null,"fully automated",null,null,null,null,null,null,null,null,null,null,null,null,null,{"$f":"AND(C13:AT13=inp_used,A13=inp_used_usersel)","v":false},{"$f":"AND(C13:F13=inp_used_minimal,A13=inp_used_usersel)","v":false}]
[1,6,7.3650000000000002,"MGD",3.2,"MGD",200,"effluent concentration",20,1.4,1.4,1.17E-2,88.149199999999993,0.126,328.2,null,283,1.2470000000000001,1.7900000000000001E-5,2,157,3.3000000000000002E-2,15,null,5,1,"Catalytic Oxidation","regenerative",null,null,null,null,null,"fully automated",null,null,null,null,null,null,null,null,null,null,null,null,null,{"$f":"AND(C14:AT14=inp_used,A14=inp_used_usersel)","v":false},{"$f":"AND(C14:F14=inp_used_minimal,A14=inp_used_usersel)","v":false}]
[1,7,22.614000000000001,"MGD",11.087,"MGD",200,"effluent concentration",20,1.4,1.4,1.17E-2,88.149199999999993,0.126,328.2,null,283,1.2470000000000001,1.7900000000000001E-5,2,157,3.3000000000000002E-2,15,null,5,1,"Catalytic Oxidation","regenerative",null,null,null,null,null,"fully automated",null,null,null,null,null,null,null,null,null,null,null,null,null,{"$f":"AND(C15:AT15=inp_used,A15=inp_used_usersel)","v":false},{"$f":"AND(C15:F15=inp_used_minimal,A15=inp_used_usersel)","v":false}]
[1,8,75.072000000000003,"MGD",37.536000000000001,"MGD",200,"effluent concentration",20,1.4,1.4,1.17E-2,88.149199999999993,0.126,328.2,null,283,1.2470000000000001,1.7900000000000001E-5,2,157,3.3000000000000002E-2,15,null,5,1,"Catalytic Oxidation","regenerative",null,null,null,null,null,"fully automated",null,null,null,null,null,null,null,null,null,null,null,null,null,{"$f":"AND(C16:AT16=inp_used,A16=inp_used_usersel)","v":false},{"$f":"AND(C16:F16=inp_used_minimal,A16=inp_used_usersel)","v":false}]
[2,1,0.03,"MGD",7.0000000000000001E-3,"MGD",300,"effluent concentration",30,1.4,1.4,1.85,222,5.0500000000000003E-2,211,null,283,1.2470000000000001,1.7900000000000001E-5,2,157,3.3000000000000002E-2,15,null,5,null,null,null,null,null,null,null,null,null,null,null,null,null,null,null,null,null,null,null,null,null,"Radon",{"$f":"AND(C17:AT17=inp_used,A17=inp_used_usersel)","v":false},{"$f":"AND(C17:F17=inp_used_minimal,A17=inp_used_usersel)","v":false}]
[2,2,0.124,"MGD",3.5000000000000003E-2,"MGD",300,"effluent concentration",30,1.4,1.4,1.85,222,5.0500000000000003E-2,211,null,283,1.2470000000000001,1.7900000000000001E-5,2,157,3.3000000000000002E-2,15,null,5,null,null,null,null,null,null,null,null,null,null,null,null,null,null,null,null,null,null,null,null,null,null,{"$f":"AND(C18:AT18=inp_used,A18=inp_used_usersel)","v":false},{"$f":"AND(C18:F18=inp_used_minimal,A18=inp_used_usersel)","v":false}]
[2,3,0.30499999999999999,"MGD",9.4E-2,"MGD",300,"effluent concentration",30,1.4,1.4,1.85,222,5.0500000000000003E-2,211,null,283,1.2470000000000001,1.7900000000000001E-5,2,157,3.3000000000000002E-2,15,null,5,null,null,null,null,null,null,null,null,null,null,null,null,null,null,null,null,null,null,null,null,null,null,{"$f":"AND(C19:AT19=inp_used,A19=inp_used_usersel)","v":false},{"$f":"AND(C19:F19=inp_used_minimal,A19=inp_used_usersel)","v":false}]
[2,4,0.74,"MGD",0.251,"MGD",300,"effluent concentration",30,1.4,1.4,1.85,222,5.0500000000000003E-2,211,null,283,1.2470000000000001,1.7900000000000001E-5,2,157,3.3000000000000002E-2,15,null,5,null,null,null,null,null,null,null,null,null,null,null,null,null,null,null,null,null,null,null,null,null,null,{"$f":"AND(C20:AT20=inp_used,A20=inp_used_usersel)","v":false},{"$f":"AND(C20:F20=inp_used_minimal,A20=inp_used_usersel)","v":false}]
[2,5,2.1520000000000001,"MGD",0.81899999999999995,"MGD",300,"effluent concentration",30,1.4,1.4,1.85,222,5.0500000000000003E-2,211,null,283,1.2470000000000001,1.7900000000000001E-5,2,157,3.3000000000000002E-2,15,null,5,null,null,null,null,null,null,null,null,null,null,null,null,null,null,null,null,null,null,null,null,null,null,{"$f":"AND(C21:AT21=inp_used,A21=inp_used_usersel)","v":false},{"$f":"AND(C21:F21=inp_used_minimal,A21=inp_used_usersel)","v":false}]
[2,6,7.3650000000000002,"MGD",3.2,"MGD",300,"effluent concentration",30,1.4,1.4,1.85,222,5.0500000000000003E-2,211,null,283,1.2470000000000001,1.7900000000000001E-5,2,157,3.3000000000000002E-2,15,null,5,null,null,null,null,null,null,null,null,null,null,null,null,null,null,null,null,null,null,null,null,null,null,{"$f":"AND(C22:AT22=inp_used,A22=inp_used_usersel)","v":false},{"$f":"AND(C22:F22=inp_used_minimal,A22=inp_used_usersel)","v":false}]
[2,7,22.614000000000001,"MGD",11.087,"MGD",300,"effluent concentration",30,1.4,1.4,1.85,222,5.0500000000000003E-2,211,null,283,1.2470000000000001,1.7900000000000001E-5,2,157,3.3000000000000002E-2,15,null,5,null,null,null,null,null,null,null,null,null,null,null,null,null,null,null,null,null,null,null,null,null,null,{"$f":"AND(C23:AT23=inp_used,A23=inp_used_usersel)","v":false},{"$f":"AND(C23:F23=inp_used_minimal,A23=inp_used_usersel)","v":false}]
[2,8,75.072000000000003,"MGD",37.536000000000001,"MGD",300,"effluent concentration",30,1.4,1.4,1.85,222,5.0500000000000003E-2,211,null,283,1.2470000000000001,1.7900000000000001E-5,2,157,3.3000000000000002E-2,15,null,5,null,null,null,null,null,null,null,null,null,null,null,null,null,null,null,null,null,null,null,null,null,null,{"$f":"AND(C24:AT24=inp_used,A24=inp_used_usersel)","v":false},{"$f":"AND(C24:F24=inp_used_minimal,A24=inp_used_usersel)","v":false}]
[3,1,0.03,"MGD",7.0000000000000001E-3,"MGD",5,"effluent concentration",0.5,1.4,1.4,0.187,131.38999999999999,0.10199999999999999,359.7,null,283,1.2470000000000001,1.7900000000000001E-5,2,157,3.3000000000000002E-2,15,null,5,1,"none","none",null,null,null,null,null,"fully automated",null,null,null,null,null,null,null,null,null,null,null,null,"TCE",{"$f":"AND(C25:AT25=inp_used,A25=inp_used_usersel)","v":true},{"$f":"AND(C25:F25=inp_used_minimal,A25=inp_used_usersel)","v":true}]
[3,2,0.124,"MGD",3.5000000000000003E-2,"MGD",5,"effluent concentration",0.5,1.4,1.4,0.187,131.38999999999999,0.10199999999999999,359.7,null,283,1.2470000000000001,1.7900000000000001E-5,2,157,3.3000000000000002E-2,15,null,5,1,"none","none",null,null,null,null,null,"fully automated",null,null,null,null,null,null,null,null,null,null,null,null,null,{"$f":"AND(C26:AT26=inp_used,A26=inp_used_usersel)","v":false},{"$f":"AND(C26:F26=inp_used_minimal,A26=inp_used_usersel)","v":false}]
[3,3,0.30499999999999999,"MGD",9.4E-2,"MGD",5,"effluent concentration",0.5,1.4,1.4,0.187,131.38999999999999,0.10199999999999999,359.7,null,283,1.2470000000000001,1.7900000000000001E-5,2,157,3.3000000000000002E-2,15,null,5,1,"none","none",null,null,null,null,null,"fully automated",null,null,null,null,null,null,null,null,null,null,null,null,null,{"$f":"AND(C27:AT27=inp_used,A27=inp_used_usersel)","v":false},{"$f":"AND(C27:F27=inp_used_minimal,A27=inp_used_usersel)","v":false}]
[3,4,0.74,"MGD",0.251,"MGD",5,"effluent concentration",0.5,1.4,1.4,0.187,131.38999999999999,0.10199999999999999,359.7,null,283,1.2470000000000001,1.7900000000000001E-5,2,157,3.3000000000000002E-2,15,null,5,1,"none","none",null,null,null,null,null,"fully automated",null,null,null,null,null,null,null,null,null,null,null,null,null,{"$f":"AND(C28:AT28=inp_used,A28=inp_used_usersel)","v":false},{"$f":"AND(C28:F28=inp_used_minimal,A28=inp_used_usersel)","v":false}]
[3,5,2.1520000000000001,"MGD",0.81899999999999995,"MGD",5,"effluent concentration",0.5,1.4,1.4,0.187,131.38999999999999,0.10199999999999999,359.7,null,283,1.2470000000000001,1.7900000000000001E-5,2,157,3.3000000000000002E-2,15,null,5,1,"none","none",null,null,null,null,null,"fully automated",null,null,null,null,null,null,null,null,null,null,null,null,null,{"$f":"AND(C29:AT29=inp_used,A29=inp_used_usersel)","v":false},{"$f":"AND(C29:F29=inp_used_minimal,A29=inp_used_usersel)","v":false}]
[3,6,7.3650000000000002,"MGD",3.2,"MGD",5,"effluent concentration",0.5,1.4,1.4,0.187,131.38999999999999,0.10199999999999999,359.7,null,283,1.2470000000000001,1.7900000000000001E-5,2,157,3.3000000000000002E-2,15,null,5,1,"none","none",null,null,null,null,null,"fully automated",null,null,null,null,null,null,null,null,null,null,null,null,null,{"$f":"AND(C30:AT30=inp_used,A30=inp_used_usersel)","v":false},{"$f":"AND(C30:F30=inp_used_minimal,A30=inp_used_usersel)","v":false}]
[3,7,22.614000000000001,"MGD",11.087,"MGD",5,"effluent concentration",0.5,1.4,1.4,0.187,131.38999999999999,0.10199999999999999,359.7,null,283,1.2470000000000001,1.7900000000000001E-5,2,157,3.3000000000000002E-2,15,null,5,1,"none","none",null,null,null,null,null,"fully automated",null,null,null,null,null,null,null,null,null,null,null,null,null,{"$f":"AND(C31:AT31=inp_used,A31=inp_used_usersel)","v":false},{"$f":"AND(C31:F31=inp_used_minimal,A31=inp_used_usersel)","v":false}]
[3,8,75.072000000000003,"MGD",37.536000000000001,"MGD",5,"effluent concentration",0.5,1.4,1.4,0.187,131.38999999999999,0.10199999999999999,359.7,null,283,1.2470000000000001,1.7900000000000001E-5,2,157,3.3000000000000002E-2,15,null,5,1,"none","none",null,null,null,null,null,"fully automated",null,null,null,null,null,null,null,null,null,null,null,null,null,{"$f":"AND(C32:AT32=inp_used,A32=inp_used_usersel)","v":false},{"$f":"AND(C32:F32=inp_used_minimal,A32=inp_used_usersel)","v":false}]
[4,1,0.03,"MGD",7.0000000000000001E-3,"MGD",5,"effluent concentration",0.5,1.4,1.4,0.31,165.83,0.11899999999999999,394,null,283,1.2470000000000001,1.7900000000000001E-5,2,157,3.3000000000000002E-2,15,null,5,1,"none","none",null,null,null,null,null,"fully automated",null,null,null,null,null,null,null,null,null,null,null,null,"PCE",{"$f":"AND(C33:AT33=inp_used,A33=inp_used_usersel)","v":false},{"$f":"AND(C33:F33=inp_used_minimal,A33=inp_used_usersel)","v":false}]
[4,2,0.124,"MGD",3.5000000000000003E-2,"MGD",5,"effluent concentration",0.5,1.4,1.4,0.31,165.83,0.11899999999999999,394,null,283,1.2470000000000001,1.7900000000000001E-5,2,157,3.3000000000000002E-2,15,null,5,1,"none","none",null,null,null,null,null,"fully automated",null,null,null,null,null,null,null,null,null,null,null,null,null,{"$f":"AND(C34:AT34=inp_used,A34=inp_used_usersel)","v":false},{"$f":"AND(C34:F34=inp_used_minimal,A34=inp_used_usersel)","v":false}]
[4,3,0.30499999999999999,"MGD",9.4E-2,"MGD",5,"effluent concentration",0.5,1.4,1.4,0.31,165.83,0.11899999999999999,394,null,283,1.2470000000000001,1.7900000000000001E-5,2,157,3.3000000000000002E-2,15,null,5,1,"none","none",null,null,null,null,null,"fully automated",null,null,null,null,null,null,null,null,null,null,null,null,null,{"$f":"AND(C35:AT35=inp_used,A35=inp_used_usersel)","v":false},{"$f":"AND(C35:F35=inp_used_minimal,A35=inp_used_usersel)","v":false}]
[4,4,0.74,"MGD",0.251,"MGD",5,"effluent concentration",0.5,1.4,1.4,0.31,165.83,0.11899999999999999,394,null,283,1.2470000000000001,1.7900000000000001E-5,2,157,3.3000000000000002E-2,15,null,5,1,"none","none",null,null,null,null,null,"fully automated",null,null,null,null,null,null,null,null,null,null,null,null,null,{"$f":"AND(C36:AT36=inp_used,A36=inp_used_usersel)","v":false},{"$f":"AND(C36:F36=inp_used_minimal,A36=inp_used_usersel)","v":false}]
[4,5,2.1520000000000001,"MGD",0.81899999999999995,"MGD",5,"effluent concentration",0.5,1.4,1.4,0.31,165.83,0.11899999999999999,394,null,283,1.2470000000000001,1.7900000000000001E-5,2,157,3.3000000000000002E-2,15,null,5,1,"none","none",null,null,null,null,null,"fully automated",null,null,null,null,null,null,null,null,null,null,null,null,null,{"$f":"AND(C37:AT37=inp_used,A37=inp_used_usersel)","v":false},{"$f":"AND(C37:F37=inp_used_minimal,A37=inp_used_usersel)","v":false}]
[4,6,7.3650000000000002,"MGD",3.2,"MGD",5,"effluent concentration",0.5,1.4,1.4,0.31,165.83,0.11899999999999999,394,null,283,1.2470000000000001,1.7900000000000001E-5,2,157,3.3000000000000002E-2,15,null,5,1,"none","none",null,null,null,null,null,"fully automated",null,null,null,null,null,null,null,null,null,null,null,null,null,{"$f":"AND(C38:AT38=inp_used,A38=inp_used_usersel)","v":false},{"$f":"AND(C38:F38=inp_used_minimal,A38=inp_used_usersel)","v":false}]
[4,7,22.614000000000001,"MGD",11.087,"MGD",5,"effluent concentration",0.5,1.4,1.4,0.31,165.83,0.11899999999999999,394,null,283,1.2470000000000001,1.7900000000000001E-5,2,157,3.3000000000000002E-2,15,null,5,1,"none","none",null,null,null,null,null,"fully automated",null,null,null,null,null,null,null,null,null,null,null,null,null,{"$f":"AND(C39:AT39=inp_used,A39=inp_used_usersel)","v":false},{"$f":"AND(C39:F39=inp_used_minimal,A39=inp_used_usersel)","v":false}]
[4,8,75.072000000000003,"MGD",37.536000000000001,"MGD",5,"effluent concentration",0.5,1.4,1.4,0.31,165.83,0.11899999999999999,394,null,283,1.2470000000000001,1.7900000000000001E-5,2,157,3.3000000000000002E-2,15,null,5,1,"none","none",null,null,null,null,null,"fully automated",null,null,null,null,null,null,null,null,null,null,null,null,null,{"$f":"AND(C40:AT40=inp_used,A40=inp_used_usersel)","v":false},{"$f":"AND(C40:F40=inp_used_minimal,A40=inp_used_usersel)","v":false}]
[5,1,0.03,"MGD",7.0000000000000001E-3,"MGD",2,"effluent concentration",0.5,1.4,1.4,0.63,62.5,6.6500000000000004E-2,259.63,null,283,1.2470000000000001,1.7900000000000001E-5,2,157,3.3000000000000002E-2,15,null,5,1,"none","none",null,null,null,null,null,"fully automated",null,null,null,null,null,null,null,null,null,null,null,null,"Vinyl Chloride",{"$f":"AND(C41:AT41=inp_used,A41=inp_used_usersel)","v":false},{"$f":"AND(C41:F41=inp_used_minimal,A41=inp_used_usersel)","v":false}]
[5,2,0.124,"MGD",3.5000000000000003E-2,"MGD",2,"effluent concentration",0.5,1.4,1.4,0.63,62.5,6.6500000000000004E-2,259.63,null,283,1.2470000000000001,1.7900000000000001E-5,2,157,3.3000000000000002E-2,15,null,5,1,"none","none",null,null,null,null,null,"fully automated",null,null,null,null,null,null,null,null,null,null,null,null,null,{"$f":"AND(C42:AT42=inp_used,A42=inp_used_usersel)","v":false},{"$f":"AND(C42:F42=inp_used_minimal,A42=inp_used_usersel)","v":false}]
[5,3,0.30499999999999999,"MGD",9.4E-2,"MGD",2,"effluent concentration",0.5,1.4,1.4,0.63,62.5,6.6500000000000004E-2,259.63,null,283,1.2470000000000001,1.7900000000000001E-5,2,157,3.3000000000000002E-2,15,null,5,1,"none","none",null,null,null,null,null,"fully automated",null,null,null,null,null,null,null,null,null,null,null,null,null,{"$f":"AND(C43:AT43=inp_used,A43=inp_used_usersel)","v":false},{"$f":"AND(C43:F43=inp_used_minimal,A43=inp_used_usersel)","v":false}]
[5,4,0.74,"MGD",0.251,"MGD",2,"effluent concentration",0.5,1.4,1.4,0.63,62.5,6.6500000000000004E-2,259.63,null,283,1.2470000000000001,1.7900000000000001E-5,2,157,3.3000000000000002E-2,15,null,5,1,"none","none",null,null,null,null,null,"fully automated",null,null,null,null,null,null,null,null,null,null,null,null,null,{"$f":"AND(C44:AT44=inp_used,A44=inp_used_usersel)","v":false},{"$f":"AND(C44:F44=inp_used_minimal,A44=inp_used_usersel)","v":false}]
[5,5,2.1520000000000001,"MGD",0.81899999999999995,"MGD",2,"effluent concentration",0.5,1.4,1.4,0.63,62.5,6.6500000000000004E-2,259.63,null,283,1.2470000000000001,1.7900000000000001E-5,2,157,3.3000000000000002E-2,15,null,5,1,"none","none",null,null,null,null,null,"fully automated",null,null,null,null,null,null,null,null,null,null,null,null,null,{"$f":"AND(C45:AT45=inp_used,A45=inp_used_usersel)","v":false},{"$f":"AND(C45:F45=inp_used_minimal,A45=inp_used_usersel)","v":false}]
[5,6,7.3650000000000002,"MGD",3.2,"MGD",2,"effluent concentration",0.5,1.4,1.4,0.63,62.5,6.6500000000000004E-2,259.63,null,283,1.2470000000000001,1.7900000000000001E-5,2,157,3.3000000000000002E-2,15,null,5,1,"none","none",null,null,null,null,null,"fully automated",null,null,null,null,null,null,null,null,null,null,null,null,null,{"$f":"AND(C46:AT46=inp_used,A46=inp_used_usersel)","v":false},{"$f":"AND(C46:F46=inp_used_minimal,A46=inp_used_usersel)","v":false}]
[5,7,22.614000000000001,"MGD",11.087,"MGD",2,"effluent concentration",0.5,1.4,1.4,0.63,62.5,6.6500000000000004E-2,259.63,null,283,1.2470000000000001,1.7900000000000001E-5,2,157,3.3000000000000002E-2,15,null,5,1,"none","none",null,null,null,null,null,"fully automated",null,null,null,null,null,null,null,null,null,null,null,null,null,{"$f":"AND(C47:AT47=inp_used,A47=inp_used_usersel)","v":false},{"$f":"AND(C47:F47=inp_used_minimal,A47=inp_used_usersel)","v":false}]
[5,8,75.072000000000003,"MGD",37.536000000000001,"MGD",2,"effluent concentration",0.5,1.4,1.4,0.63,62.5,6.6500000000000004E-2,259.63,null,283,1.2470000000000001,1.7900000000000001E-5,2,157,3.3000000000000002E-2,15,null,5,1,"none","none",null,null,null,null,null,"fully automated",null,null,null,null,null,null,null,null,null,null,null,null,null,{"$f":"AND(C48:AT48=inp_used,A48=inp_used_usersel)","v":false},{"$f":"AND(C48:F48=inp_used_minimal,A48=inp_used_usersel)","v":false}]
[6,1,0.03,"MGD",7.0000000000000001E-3,"MGD",5,"effluent concentration",0.5,1.4,1.4,0.59399999999999997,153.82,0.105,349.6,null,283,1.2470000000000001,1.7900000000000001E-5,2,157,3.3000000000000002E-2,15,null,5,1,"none","none",null,null,null,null,null,"fully automated",null,null,null,null,null,null,null,null,null,null,null,null,"Carbon Tetrachloride",{"$f":"AND(C49:AT49=inp_used,A49=inp_used_usersel)","v":false},{"$f":"AND(C49:F49=inp_used_minimal,A49=inp_used_usersel)","v":false}]
[6,2,0.124,"MGD",3.5000000000000003E-2,"MGD",5,"effluent concentration",0.5,1.4,1.4,0.59399999999999997,153.82,0.105,349.6,null,283,1.2470000000000001,1.7900000000000001E-5,2,157,3.3000000000000002E-2,15,null,5,1,"none","none",null,null,null,null,null,"fully automated",null,null,null,null,null,null,null,null,null,null,null,null,null,{"$f":"AND(C50:AT50=inp_used,A50=inp_used_usersel)","v":false},{"$f":"AND(C50:F50=inp_used_minimal,A50=inp_used_usersel)","v":false}]
[6,3,0.30499999999999999,"MGD",9.4E-2,"MGD",5,"effluent concentration",0.5,1.4,1.4,0.59399999999999997,153.82,0.105,349.6,null,283,1.2470000000000001,1.7900000000000001E-5,2,157,3.3000000000000002E-2,15,null,5,1,"none","none",null,null,null,null,null,"fully automated",null,null,null,null,null,null,null,null,null,null,null,null,null,{"$f":"AND(C51:AT51=inp_used,A51=inp_used_usersel)","v":false},{"$f":"AND(C51:F51=inp_used_minimal,A51=inp_used_usersel)","v":false}]
[6,4,0.74,"MGD",0.251,"MGD",5,"effluent concentration",0.5,1.4,1.4,0.59399999999999997,153.82,0.105,349.6,null,283,1.2470000000000001,1.7900000000000001E-5,2,157,3.3000000000000002E-2,15,null,5,1,"none","none",null,null,null,null,null,"fully automated",null,null,null,null,null,null,null,null,null,null,null,null,null,{"$f":"AND(C52:AT52=inp_used,A52=inp_used_usersel)","v":false},{"$f":"AND(C52:F52=inp_used_minimal,A52=inp_used_usersel)","v":false}]
[6,5,2.1520000000000001,"MGD",0.81899999999999995,"MGD",5,"effluent concentration",0.5,1.4,1.4,0.59399999999999997,153.82,0.105,349.6,null,283,1.2470000000000001,1.7900000000000001E-5,2,157,3.3000000000000002E-2,15,null,5,1,"none","none",null,null,null,null,null,"fully automated",null,null,null,null,null,null,null,null,null,null,null,null,null,{"$f":"AND(C53:AT53=inp_used,A53=inp_used_usersel)","v":false},{"$f":"AND(C53:F53=inp_used_minimal,A53=inp_used_usersel)","v":false}]
[6,6,7.3650000000000002,"MGD",3.2,"MGD",5,"effluent concentration",0.5,1.4,1.4,0.59399999999999997,153.82,0.105,349.6,null,283,1.2470000000000001,1.7900000000000001E-5,2,157,3.3000000000000002E-2,15,null,5,1,"none","none",null,null,null,null,null,"fully automated",null,null,null,null,null,null,null,null,null,null,null,null,null,{"$f":"AND(C54:AT54=inp_used,A54=inp_used_usersel)","v":false},{"$f":"AND(C54:F54=inp_used_minimal,A54=inp_used_usersel)","v":false}]
[6,7,22.614000000000001,"MGD",11.087,"MGD",5,"effluent concentration",0.5,1.4,1.4,0.59399999999999997,153.82,0.105,349.6,null,283,1.2470000000000001,1.7900000000000001E-5,2,157,3.3000000000000002E-2,15,null,5,1,"none","none",null,null,null,null,null,"fully automated",null,null,null,null,null,null,null,null,null,null,null,null,null,{"$f":"AND(C55:AT55=inp_used,A55=inp_used_usersel)","v":false},{"$f":"AND(C55:F55=inp_used_minimal,A55=inp_used_usersel)","v":false}]
[6,8,75.072000000000003,"MGD",37.536000000000001,"MGD",5,"effluent concentration",0.5,1.4,1.4,0.59399999999999997,153.82,0.105,349.6,null,283,1.2470000000000001,1.7900000000000001E-5,2,157,3.3000000000000002E-2,15,null,5,1,"none","none",null,null,null,null,null,"fully automated",null,null,null,null,null,null,null,null,null,null,null,null,null,{"$f":"AND(C56:AT56=inp_used,A56=inp_used_usersel)","v":false},{"$f":"AND(C56:F56=inp_used_minimal,A56=inp_used_usersel)","v":false}]
[7,1,0.03,"MGD",7.0000000000000001E-3,"MGD",5,"effluent concentration",0.5,1.4,1.4,0.11899999999999999,78.11,9.8000000000000004E-2,353.1,null,283,1.2470000000000001,1.7900000000000001E-5,2,157,3.3000000000000002E-2,15,null,5,1,"none","none",null,null,null,null,null,"fully automated",null,null,null,null,null,null,null,null,null,null,null,null,"Benzene",{"$f":"AND(C57:AT57=inp_used,A57=inp_used_usersel)","v":false},{"$f":"AND(C57:F57=inp_used_minimal,A57=inp_used_usersel)","v":false}]
[7,2,0.124,"MGD",3.5000000000000003E-2,"MGD",5,"effluent concentration",0.5,1.4,1.4,0.11899999999999999,78.11,9.8000000000000004E-2,353.1,null,283,1.2470000000000001,1.7900000000000001E-5,2,157,3.3000000000000002E-2,15,null,5,1,"none","none",null,null,null,null,null,"fully automated",null,null,null,null,null,null,null,null,null,null,null,null,null,{"$f":"AND(C58:AT58=inp_used,A58=inp_used_usersel)","v":false},{"$f":"AND(C58:F58=inp_used_minimal,A58=inp_used_usersel)","v":false}]
[7,3,0.30499999999999999,"MGD",9.4E-2,"MGD",5,"effluent concentration",0.5,1.4,1.4,0.11899999999999999,78.11,9.8000000000000004E-2,353.1,null,283,1.2470000000000001,1.7900000000000001E-5,2,157,3.3000000000000002E-2,15,null,5,1,"none","none",null,null,null,null,null,"fully automated",null,null,null,null,null,null,null,null,null,null,null,null,null,{"$f":"AND(C59:AT59=inp_used,A59=inp_used_usersel)","v":false},{"$f":"AND(C59:F59=inp_used_minimal,A59=inp_used_usersel)","v":false}]
[7,4,0.74,"MGD",0.251,"MGD",5,"effluent concentration",0.5,1.4,1.4,0.11899999999999999,78.11,9.8000000000000004E-2,353.1,null,283,1.2470000000000001,1.7900000000000001E-5,2,157,3.3000000000000002E-2,15,null,5,1,"none","none",null,null,null,null,null,"fully automated",null,null,null,null,null,null,null,null,null,null,null,null,null,{"$f":"AND(C60:AT60=inp_used,A60=inp_used_usersel)","v":false},{"$f":"AND(C60:F60=inp_used_minimal,A60=inp_used_usersel)","v":false}]
[7,5,2.1520000000000001,"MGD",0.81899999999999995,"MGD",5,"effluent concentration",0.5,1.4,1.4,0.11899999999999999,78.11,9.8000000000000004E-2,353.1,null,283,1.2470000000000001,1.7900000000000001E-5,2,157,3.3000000000000002E-2,15,null,5,1,"none","none",null,null,null,null,null,"fully automated",null,null,null,null,null,null,null,null,null,null,null,null,null,{"$f":"AND(C61:AT61=inp_used,A61=inp_used_usersel)","v":false},{"$f":"AND(C61:F61=inp_used_minimal,A61=inp_used_usersel)","v":false}]
[7,6,7.3650000000000002,"MGD",3.2,"MGD",5,"effluent concentration",0.5,1.4,1.4,0.11899999999999999,78.11,9.8000000000000004E-2,353.1,null,283,1.2470000000000001,1.7900000000000001E-5,2,157,3.3000000000000002E-2,15,null,5,1,"none","none",null,null,null,null,null,"fully automated",null,null,null,null,null,null,null,null,null,null,null,null,null,{"$f":"AND(C62:AT62=inp_used,A62=inp_used_usersel)","v":false},{"$f":"AND(C62:F62=inp_used_minimal,A62=inp_used_usersel)","v":false}]
[7,7,22.614000000000001,"MGD",11.087,"MGD",5,"effluent concentration",0.5,1.4,1.4,0.11899999999999999,78.11,9.8000000000000004E-2,353.1,null,283,1.2470000000000001,1.7900000000000001E-5,2,157,3.3000000000000002E-2,15,null,5,1,"none","none",null,null,null,null,null,"fully automated",null,null,null,null,null,null,null,null,null,null,null,null,null,{"$f":"AND(C63:AT63=inp_used,A63=inp_used_usersel)","v":false},{"$f":"AND(C63:F63=inp_used_minimal,A63=inp_used_usersel)","v":false}]
[7,8,75.072000000000003,"MGD",37.536000000000001,"MGD",5,"effluent concentration",0.5,1.4,1.4,0.11899999999999999,78.11,9.8000000000000004E-2,353.1,null,283,1.2470000000000001,1.7900000000000001E-5,2,157,3.3000000000000002E-2,15,null,5,1,"none","none",null,null,null,null,null,"fully automated",null,null,null,null,null,null,null,null,null,null,null,null,null,{"$f":"AND(C64:AT64=inp_used,A64=inp_used_usersel)","v":false},{"$f":"AND(C64:F64=inp_used_minimal,A64=inp_used_usersel)","v":false}]
[8,1,0.03,"MGD",7.0000000000000001E-3,"MGD",5,"effluent concentration",0.5,1.4,1.4,5.8799999999999998E-2,112.99,0.112,369.37,null,283,1.2470000000000001,1.7900000000000001E-5,2,157,3.3000000000000002E-2,15,null,5,1,"none","none",null,null,null,null,null,"fully automated",null,null,null,null,null,null,null,null,null,null,null,null,"1,2-DCP",{"$f":"AND(C65:AT65=inp_used,A65=inp_used_usersel)","v":false},{"$f":"AND(C65:F65=inp_used_minimal,A65=inp_used_usersel)","v":false}]
[8,2,0.124,"MGD",3.5000000000000003E-2,"MGD",5,"effluent concentration",0.5,1.4,1.4,5.8799999999999998E-2,112.99,0.112,369.37,null,283,1.2470000000000001,1.7900000000000001E-5,2,157,3.3000000000000002E-2,15,null,5,1,"none","none",null,null,null,null,null,"fully automated",null,null,null,null,null,null,null,null,null,null,null,null,null,{"$f":"AND(C66:AT66=inp_used,A66=inp_used_usersel)","v":false},{"$f":"AND(C66:F66=inp_used_minimal,A66=inp_used_usersel)","v":false}]
[8,3,0.30499999999999999,"MGD",9.4E-2,"MGD",5,"effluent concentration",0.5,1.4,1.4,5.8799999999999998E-2,112.99,0.112,369.37,null,283,1.2470000000000001,1.7900000000000001E-5,2,157,3.3000000000000002E-2,15,null,5,1,"none","none",null,null,null,null,null,"fully automated",null,null,null,null,null,null,null,null,null,null,null,null,null,{"$f":"AND(C67:AT67=inp_used,A67=inp_used_usersel)","v":false},{"$f":"AND(C67:F67=inp_used_minimal,A67=inp_used_usersel)","v":false}]
[8,4,0.74,"MGD",0.251,"MGD",5,"effluent concentration",0.5,1.4,1.4,5.8799999999999998E-2,112.99,0.112,369.37,null,283,1.2470000000000001,1.7900000000000001E-5,2,157,3.3000000000000002E-2,15,null,5,1,"none","none",null,null,null,null,null,"fully automated",null,null,null,null,null,null,null,null,null,null,null,null,null,{"$f":"AND(C68:AT68=inp_used,A68=inp_used_usersel)","v":false},{"$f":"AND(C68:F68=inp_used_minimal,A68=inp_used_usersel)","v":false}]
[8,5,2.1520000000000001,"MGD",0.81899999999999995,"MGD",5,"effluent concentration",0.5,1.4,1.4,5.8799999999999998E-2,112.99,0.112,369.37,null,283,1.2470000000000001,1.7900000000000001E-5,2,157,3.3000000000000002E-2,15,null,5,1,"none","none",null,null,null,null,null,"fully automated",null,null,null,null,null,null,null,null,null,null,null,null,null,{"$f":"AND(C69:AT69=inp_used,A69=inp_used_usersel)","v":false},{"$f":"AND(C69:F69=inp_used_minimal,A69=inp_used_usersel)","v":false}]
[8,6,7.3650000000000002,"MGD",3.2,"MGD",5,"effluent concentration",0.5,1.4,1.4,5.8799999999999998E-2,112.99,0.112,369.37,null,283,1.2470000000000001,1.7900000000000001E-5,2,157,3.3000000000000002E-2,15,null,5,1,"none","none",null,null,null,null,null,"fully automated",null,null,null,null,null,null,null,null,null,null,null,null,null,{"$f":"AND(C70:AT70=inp_used,A70=inp_used_usersel)","v":false},{"$f":"AND(C70:F70=inp_used_minimal,A70=inp_used_usersel)","v":false}]
[8,7,22.614000000000001,"MGD",11.087,"MGD",5,"effluent concentration",0.5,1.4,1.4,5.8799999999999998E-2,112.99,0.112,369.37,null,283,1.2470000000000001,1.7900000000000001E-5,2,157,3.3000000000000002E-2,15,null,5,1,"none","none",null,null,null,null,null,"fully automated",null,null,null,null,null,null,null,null,null,null,null,null,null,{"$f":"AND(C71:AT71=inp_used,A71=inp_used_usersel)","v":false},{"$f":"AND(C71:F71=inp_used_minimal,A71=inp_used_usersel)","v":false}]
[8,8,75.072000000000003,"MGD",37.536000000000001,"MGD",5,"effluent concentration",0.5,1.4,1.4,5.8799999999999998E-2,112.99,0.112,369.37,null,283,1.2470000000000001,1.7900000000000001E-5,2,157,3.3000000000000002E-2,15,null,5,1,"none","none",null,null,null,null,null,"fully automated",null,null,null,null,null,null,null,null,null,null,null,null,null,{"$f":"AND(C72:AT72=inp_used,A72=inp_used_usersel)","v":false},{"$f":"AND(C72:F72=inp_used_minimal,A72=inp_used_usersel)","v":false}]
[9,1,0.03,"MGD",7.0000000000000001E-3,"MGD",5,"effluent concentration",0.5,1.4,1.4,5.7299999999999997E-2,84.93,7.0000000000000007E-2,312.8,null,283,1.2470000000000001,1.7900000000000001E-5,2,157,3.3000000000000002E-2,15,null,5,1,"none","none",null,null,null,null,null,"fully automated",null,null,null,null,null,null,null,null,null,null,null,null,"Methylene chloride",{"$f":"AND(C73:AT73=inp_used,A73=inp_used_usersel)","v":false},{"$f":"AND(C73:F73=inp_used_minimal,A73=inp_used_usersel)","v":false}]
[9,2,0.124,"MGD",3.5000000000000003E-2,"MGD",5,"effluent concentration",0.5,1.4,1.4,5.7299999999999997E-2,84.93,7.0000000000000007E-2,312.8,null,283,1.2470000000000001,1.7900000000000001E-5,2,157,3.3000000000000002E-2,15,null,5,1,"none","none",null,null,null,null,null,"fully automated",null,null,null,null,null,null,null,null,null,null,null,null,null,{"$f":"AND(C74:AT74=inp_used,A74=inp_used_usersel)","v":false},{"$f":"AND(C74:F74=inp_used_minimal,A74=inp_used_usersel)","v":false}]
[9,3,0.30499999999999999,"MGD",9.4E-2,"MGD",5,"effluent concentration",0.5,1.4,1.4,5.7299999999999997E-2,84.93,7.0000000000000007E-2,312.8,null,283,1.2470000000000001,1.7900000000000001E-5,2,157,3.3000000000000002E-2,15,null,5,1,"none","none",null,null,null,null,null,"fully automated",null,null,null,null,null,null,null,null,null,null,null,null,null,{"$f":"AND(C75:AT75=inp_used,A75=inp_used_usersel)","v":false},{"$f":"AND(C75:F75=inp_used_minimal,A75=inp_used_usersel)","v":false}]
[9,4,0.74,"MGD",0.251,"MGD",5,"effluent concentration",0.5,1.4,1.4,5.7299999999999997E-2,84.93,7.0000000000000007E-2,312.8,null,283,1.2470000000000001,1.7900000000000001E-5,2,157,3.3000000000000002E-2,15,null,5,1,"none","none",null,null,null,null,null,"fully automated",null,null,null,null,null,null,null,null,null,null,null,null,null,{"$f":"AND(C76:AT76=inp_used,A76=inp_used_usersel)","v":false},{"$f":"AND(C76:F76=inp_used_minimal,A76=inp_used_usersel)","v":false}]
[9,5,2.1520000000000001,"MGD",0.81899999999999995,"MGD",5,"effluent concentration",0.5,1.4,1.4,5.7299999999999997E-2,84.93,7.0000000000000007E-2,312.8,null,283,1.2470000000000001,1.7900000000000001E-5,2,157,3.3000000000000002E-2,15,null,5,1,"none","none",null,null,null,null,null,"fully automated",null,null,null,null,null,null,null,null,null,null,null,null,null,{"$f":"AND(C77:AT77=inp_used,A77=inp_used_usersel)","v":false},{"$f":"AND(C77:F77=inp_used_minimal,A77=inp_used_usersel)","v":false}]
[9,6,7.3650000000000002,"MGD",3.2,"MGD",5,"effluent concentration",0.5,1.4,1.4,5.7299999999999997E-2,84.93,7.0000000000000007E-2,312.8,null,283,1.2470000000000001,1.7900000000000001E-5,2,157,3.3000000000000002E-2,15,null,5,1,"none","none",null,null,null,null,null,"fully automated",null,null,null,null,null,null,null,null,null,null,null,null,null,{"$f":"AND(C78:AT78=inp_used,A78=inp_used_usersel)","v":false},{"$f":"AND(C78:F78=inp_used_minimal,A78=inp_used_usersel)","v":false}]
[9,7,22.614000000000001,"MGD",11.087,"MGD",5,"effluent concentration",0.5,1.4,1.4,5.7299999999999997E-2,84.93,7.0000000000000007E-2,312.8,null,283,1.2470000000000001,1.7900000000000001E-5,2,157,3.3000000000000002E-2,15,null,5,1,"none","none",null,null,null,null,null,"fully automated",null,null,null,null,null,null,null,null,null,null,null,null,null,{"$f":"AND(C79:AT79=inp_used,A79=inp_used_usersel)","v":false},{"$f":"AND(C79:F79=inp_used_minimal,A79=inp_used_usersel)","v":false}]
[9,8,75.072000000000003,"MGD",37.536000000000001,"MGD",5,"effluent concentration",0.5,1.4,1.4,5.7299999999999997E-2,84.93,7.0000000000000007E-2,312.8,null,283,1.2470000000000001,1.7900000000000001E-5,2,157,3.3000000000000002E-2,15,null,5,1,"none","none",null,null,null,null,null,"fully automated",null,null,null,null,null,null,null,null,null,null,null,null,null,{"$f":"AND(C80:AT80=inp_used,A80=inp_used_usersel)","v":false},{"$f":"AND(C80:F80=inp_used_minimal,A80=inp_used_usersel)","v":false}]
[10,1,0.03,"MGD",7.0000000000000001E-3,"MGD",5,"effluent concentration",0.5,1.4,1.4,2.6100000000000002E-2,98.96,9.0999999999999998E-2,356.4,null,283,1.2470000000000001,1.7900000000000001E-5,2,157,3.3000000000000002E-2,15,null,5,1,"none","none",null,null,null,null,null,"fully automated",null,null,null,null,null,null,null,null,null,null,null,null,"1,2-DCA",{"$f":"AND(C81:AT81=inp_used,A81=inp_used_usersel)","v":false},{"$f":"AND(C81:F81=inp_used_minimal,A81=inp_used_usersel)","v":false}]
[10,2,0.124,"MGD",3.5000000000000003E-2,"MGD",5,"effluent concentration",0.5,1.4,1.4,2.6100000000000002E-2,98.96,9.0999999999999998E-2,356.4,null,283,1.2470000000000001,1.7900000000000001E-5,2,157,3.3000000000000002E-2,15,null,5,1,"none","none",null,null,null,null,null,"fully automated",null,null,null,null,null,null,null,null,null,null,null,null,null,{"$f":"AND(C82:AT82=inp_used,A82=inp_used_usersel)","v":false},{"$f":"AND(C82:F82=inp_used_minimal,A82=inp_used_usersel)","v":false}]
[10,3,0.30499999999999999,"MGD",9.4E-2,"MGD",5,"effluent concentration",0.5,1.4,1.4,2.6100000000000002E-2,98.96,9.0999999999999998E-2,356.4,null,283,1.2470000000000001,1.7900000000000001E-5,2,157,3.3000000000000002E-2,15,null,5,1,"none","none",null,null,null,null,null,"fully automated",null,null,null,null,null,null,null,null,null,null,null,null,null,{"$f":"AND(C83:AT83=inp_used,A83=inp_used_usersel)","v":false},{"$f":"AND(C83:F83=inp_used_minimal,A83=inp_used_usersel)","v":false}]
[10,4,0.74,"MGD",0.251,"MGD",5,"effluent concentration",0.5,1.4,1.4,2.6100000000000002E-2,98.96,9.0999999999999998E-2,356.4,null,283,1.2470000000000001,1.7900000000000001E-5,2,157,3.3000000000000002E-2,15,null,5,1,"none","none",null,null,null,null,null,"fully automated",null,null,null,null,null,null,null,null,null,null,null,null,null,{"$f":"AND(C84:AT84=inp_used,A84=inp_used_usersel)","v":false},{"$f":"AND(C84:F84=inp_used_minimal,A84=inp_used_usersel)","v":false}]
[10,5,2.1520000000000001,"MGD",0.81899999999999995,"MGD",5,"effluent concentration",0.5,1.4,1.4,2.6100000000000002E-2,98.96,9.0999999999999998E-2,356.4,null,283,1.2470000000000001,1.7900000000000001E-5,2,157,3.3000000000000002E-2,15,null,5,1,"none","none",null,null,null,null,null,"fully automated",null,null,null,null,null,null,null,null,null,null,null,null,null,{"$f":"AND(C85:AT85=inp_used,A85=inp_used_usersel)","v":false},{"$f":"AND(C85:F85=inp_used_minimal,A85=inp_used_usersel)","v":false}]
[10,6,7.3650000000000002,"MGD",3.2,"MGD",5,"effluent concentration",0.5,1.4,1.4,2.6100000000000002E-2,98.96,9.0999999999999998E-2,356.4,null,283,1.2470000000000001,1.7900000000000001E-5,2,157,3.3000000000000002E-2,15,null,5,1,"none","none",null,null,null,null,null,"fully automated",null,null,null,null,null,null,null,null,null,null,null,null,null,{"$f":"AND(C86:AT86=inp_used,A86=inp_used_usersel)","v":false},{"$f":"AND(C86:F86=inp_used_minimal,A86=inp_used_usersel)","v":false}]
[10,7,22.614000000000001,"MGD",11.087,"MGD",5,"effluent concentration",0.5,1.4,1.4,2.6100000000000002E-2,98.96,9.0999999999999998E-2,356.4,null,283,1.2470000000000001,1.7900000000000001E-5,2,157,3.3000000000000002E-2,15,null,5,1,"none","none",null,null,null,null,null,"fully automated",null,null,null,null,null,null,null,null,null,null,null,null,null,{"$f":"AND(C87:AT87=inp_used,A87=inp_used_usersel)","v":false},{"$f":"AND(C87:F87=inp_used_minimal,A87=inp_used_usersel)","v":false}]
[10,8,75.072000000000003,"MGD",37.536000000000001,"MGD",5,"effluent concentration",0.5,1.4,1.4,2.6100000000000002E-2,98.96,9.0999999999999998E-2,356.4,null,283,1.2470000000000001,1.7900000000000001E-5,2,157,3.3000000000000002E-2,15,null,5,1,"none","none",null,null,null,null,null,"fully automated",null,null,null,null,null,null,null,null,null,null,null,null,null,{"$f":"AND(C88:AT88=inp_used,A88=inp_used_usersel)","v":false},{"$f":"AND(C88:F88=inp_used_minimal,A88=inp_used_usersel)","v":false}]
[11,1,0.03,"MGD",7.0000000000000001E-3,"MGD",5,"effluent concentration",0.5,1.4,1.4,1.34,54.09,8.4000000000000005E-2,268.58999999999997,null,283,1.2470000000000001,1.7900000000000001E-5,2,157,3.3000000000000002E-2,15,null,5,1,"none","none",null,null,null,null,null,"fully automated",null,null,null,null,null,null,null,null,null,null,null,null,"1,3-Butadiene",{"$f":"AND(C89:AT89=inp_used,A89=inp_used_usersel)","v":false},{"$f":"AND(C89:F89=inp_used_minimal,A89=inp_used_usersel)","v":false}]
[11,2,0.124,"MGD",3.5000000000000003E-2,"MGD",5,"effluent concentration",0.5,1.4,1.4,1.34,54.09,8.4000000000000005E-2,268.58999999999997,null,283,1.2470000000000001,1.7900000000000001E-5,2,157,3.3000000000000002E-2,15,null,5,1,"none","none",null,null,null,null,null,"fully automated",null,null,null,null,null,null,null,null,null,null,null,null,null,{"$f":"AND(C90:AT90=inp_used,A90=inp_used_usersel)","v":false},{"$f":"AND(C90:F90=inp_used_minimal,A90=inp_used_usersel)","v":false}]
[11,3,0.30499999999999999,"MGD",9.4E-2,"MGD",5,"effluent concentration",0.5,1.4,1.4,1.34,54.09,8.4000000000000005E-2,268.58999999999997,null,283,1.2470000000000001,1.7900000000000001E-5,2,157,3.3000000000000002E-2,15,null,5,1,"none","none",null,null,null,null,null,"fully automated",null,null,null,null,null,null,null,null,null,null,null,null,null,{"$f":"AND(C91:AT91=inp_used,A91=inp_used_usersel)","v":false},{"$f":"AND(C91:F91=inp_used_minimal,A91=inp_used_usersel)","v":false}]
[11,4,0.74,"MGD",0.251,"MGD",5,"effluent concentration",0.5,1.4,1.4,1.34,54.09,8.4000000000000005E-2,268.58999999999997,null,283,1.2470000000000001,1.7900000000000001E-5,2,157,3.3000000000000002E-2,15,null,5,1,"none","none",null,null,null,null,null,"fully automated",null,null,null,null,null,null,null,null,null,null,null,null,null,{"$f":"AND(C92:AT92=inp_used,A92=inp_used_usersel)","v":false},{"$f":"AND(C92:F92=inp_used_minimal,A92=inp_used_usersel)","v":false}]
[11,5,2.1520000000000001,"MGD",0.81899999999999995,"MGD",5,"effluent concentration",0.5,1.4,1.4,1.34,54.09,8.4000000000000005E-2,268.58999999999997,null,283,1.2470000000000001,1.7900000000000001E-5,2,157,3.3000000000000002E-2,15,null,5,1,"none","none",null,null,null,null,null,"fully automated",null,null,null,null,null,null,null,null,null,null,null,null,null,{"$f":"AND(C93:AT93=inp_used,A93=inp_used_usersel)","v":false},{"$f":"AND(C93:F93=inp_used_minimal,A93=inp_used_usersel)","v":false}]
[11,6,7.3650000000000002,"MGD",3.2,"MGD",5,"effluent concentration",0.5,1.4,1.4,1.34,54.09,8.4000000000000005E-2,268.58999999999997,null,283,1.2470000000000001,1.7900000000000001E-5,2,157,3.3000000000000002E-2,15,null,5,1,"none","none",null,null,null,null,null,"fully automated",null,null,null,null,null,null,null,null,null,null,null,null,null,{"$f":"AND(C94:AT94=inp_used,A94=inp_used_usersel)","v":false},{"$f":"AND(C94:F94=inp_used_minimal,A94=inp_used_usersel)","v":false}]
[11,7,22.614000000000001,"MGD",11.087,"MGD",5,"effluent concentration",0.5,1.4,1.4,1.34,54.09,8.4000000000000005E-2,268.58999999999997,null,283,1.2470000000000001,1.7900000000000001E-5,2,157,3.3000000000000002E-2,15,null,5,1,"none","none",null,null,null,null,null,"fully automated",null,null,null,null,null,null,null,null,null,null,null,null,null,{"$f":"AND(C95:AT95=inp_used,A95=inp_used_usersel)","v":false},{"$f":"AND(C95:F95=inp_used_minimal,A95=inp_used_usersel)","v":false}]
[11,8,75.072000000000003,"MGD",37.536000000000001,"MGD",5,"effluent concentration",0.5,1.4,1.4,1.34,54.09,8.4000000000000005E-2,268.58999999999997,null,283,1.2470000000000001,1.7900000000000001E-5,2,157,3.3000000000000002E-2,15,null,5,1,"none","none",null,null,null,null,null,"fully automated",null,null,null,null,null,null,null,null,null,null,null,null,null,{"$f":"AND(C96:AT96=inp_used,A96=inp_used_usersel)","v":false},{"$f":"AND(C96:F96=inp_used_minimal,A96=inp_used_usersel)","v":false}]
[12,1,0.03,"MGD",7.0000000000000001E-3,"MGD",5,"effluent concentration",0.5,1.4,1.4,0.13500000000000001,98.96,9.0999999999999998E-2,330.3,null,283,1.2470000000000001,1.7900000000000001E-5,2,157,3.3000000000000002E-2,15,null,5,1,"none","none",null,null,null,null,null,"fully automated",null,null,null,null,null,null,null,null,null,null,null,null,"1,1-DCA",{"$f":"AND(C97:AT97=inp_used,A97=inp_used_usersel)","v":false},{"$f":"AND(C97:F97=inp_used_minimal,A97=inp_used_usersel)","v":false}]
[12,2,0.124,"MGD",3.5000000000000003E-2,"MGD",5,"effluent concentration",0.5,1.4,1.4,0.13500000000000001,98.96,9.0999999999999998E-2,330.3,null,283,1.2470000000000001,1.7900000000000001E-5,2,157,3.3000000000000002E-2,15,null,5,1,"none","none",null,null,null,null,null,"fully automated",null,null,null,null,null,null,null,null,null,null,null,null,null,{"$f":"AND(C98:AT98=inp_used,A98=inp_used_usersel)","v":false},{"$f":"AND(C98:F98=inp_used_minimal,A98=inp_used_usersel)","v":false}]
[12,3,0.30499999999999999,"MGD",9.4E-2,"MGD",5,"effluent concentration",0.5,1.4,1.4,0.13500000000000001,98.96,9.0999999999999998E-2,330.3,null,283,1.2470000000000001,1.7900000000000001E-5,2,157,3.3000000000000002E-2,15,null,5,1,"none","none",null,null,null,null,null,"fully automated",null,null,null,null,null,null,null,null,null,null,null,null,null,{"$f":"AND(C99:AT99=inp_used,A99=inp_used_usersel)","v":false},{"$f":"AND(C99:F99=inp_used_minimal,A99=inp_used_usersel)","v":false}]
[12,4,0.74,"MGD",0.251,"MGD",5,"effluent concentration",0.5,1.4,1.4,0.13500000000000001,98.96,9.0999999999999998E-2,330.3,null,283,1.2470000000000001,1.7900000000000001E-5,2,157,3.3000000000000002E-2,15,null,5,1,"none","none",null,null,null,null,null,"fully automated",null,null,null,null,null,null,null,null,null,null,null,null,null,{"$f":"AND(C100:AT100=inp_used,A100=inp_used_usersel)","v":false},{"$f":"AND(C100:F100=inp_used_minimal,A100=inp_used_usersel)","v":false}]
[12,5,2.1520000000000001,"MGD",0.81899999999999995,"MGD",5,"effluent concentration",0.5,1.4,1.4,0.13500000000000001,98.96,9.0999999999999998E-2,330.3,null,283,1.2470000000000001,1.7900000000000001E-5,2,157,3.3000000000000002E-2,15,null,5,1,"none","none",null,null,null,null,null,"fully automated",null,null,null,null,null,null,null,null,null,null,null,null,null,{"$f":"AND(C101:AT101=inp_used,A101=inp_used_usersel)","v":false},{"$f":"AND(C101:F101=inp_used_minimal,A101=inp_used_usersel)","v":false}]
[12,6,7.3650000000000002,"MGD",3.2,"MGD",5,"effluent concentration",0.5,1.4,1.4,0.13500000000000001,98.96,9.0999999999999998E-2,330.3,null,283,1.2470000000000001,1.7900000000000001E-5,2,157,3.3000000000000002E-2,15,null,5,1,"none","none",null,null,null,null,null,"fully automated",null,null,null,null,null,null,null,null,null,null,null,null,null,{"$f":"AND(C102:AT102=inp_used,A102=inp_used_usersel)","v":false},{"$f":"AND(C102:F102=inp_used_minimal,A102=inp_used_usersel)","v":false}]
[12,7,22.614000000000001,"MGD",11.087,"MGD",5,"effluent concentration",0.5,1.4,1.4,0.13500000000000001,98.96,9.0999999999999998E-2,330.3,null,283,1.2470000000000001,1.7900000000000001E-5,2,157,3.3000000000000002E-2,15,null,5,1,"none","none",null,null,null,null,null,"fully automated",null,null,null,null,null,null,null,null,null,null,null,null,null,{"$f":"AND(C103:AT103=inp_used,A103=inp_used_usersel)","v":false},{"$f":"AND(C103:F103=inp_used_minimal,A103=inp_used_usersel)","v":false}]
[12,8,75.072000000000003,"MGD",37.536000000000001,"MGD",5,"effluent concentration",0.5,1.4,1.4,0.13500000000000001,98.96,9.0999999999999998E-2,330.3,null,283,1.2470000000000001,1.7900000000000001E-5,2,157,3.3000000000000002E-2,15,null,5,1,"none","none",null,null,null,null,null,"fully automated",null,null,null,null,null,null,null,null,null,null,null,null,null,{"$f":"AND(C104:AT104=inp_used,A104=inp_used_usersel)","v":false},{"$f":"AND(C104:F104=inp_used_minimal,A104=inp_used_usersel)","v":false}]
[13,1,0.03,"MGD",7.0000000000000001E-3,"MGD",5,"effluent concentration",0.5,1.4,1.4,4.2999999999999997E-2,167.85,0.126,404,null,283,1.2470000000000001,1.7900000000000001E-5,2,157,3.3000000000000002E-2,15,null,5,1,"none","none",null,null,null,null,null,"fully automated",null,null,null,null,null,null,null,null,null,null,null,null,"1,1,1,2-TCA",{"$f":"AND(C105:AT105=inp_used,A105=inp_used_usersel)","v":false},{"$f":"AND(C105:F105=inp_used_minimal,A105=inp_used_usersel)","v":false}]
[13,2,0.124,"MGD",3.5000000000000003E-2,"MGD",5,"effluent concentration",0.5,1.4,1.4,4.2999999999999997E-2,167.85,0.126,404,null,283,1.2470000000000001,1.7900000000000001E-5,2,157,3.3000000000000002E-2,15,null,5,1,"none","none",null,null,null,null,null,"fully automated",null,null,null,null,null,null,null,null,null,null,null,null,null,{"$f":"AND(C106:AT106=inp_used,A106=inp_used_usersel)","v":false},{"$f":"AND(C106:F106=inp_used_minimal,A106=inp_used_usersel)","v":false}]
[13,3,0.30499999999999999,"MGD",9.4E-2,"MGD",5,"effluent concentration",0.5,1.4,1.4,4.2999999999999997E-2,167.85,0.126,404,null,283,1.2470000000000001,1.7900000000000001E-5,2,157,3.3000000000000002E-2,15,null,5,1,"none","none",null,null,null,null,null,"fully automated",null,null,null,null,null,null,null,null,null,null,null,null,null,{"$f":"AND(C107:AT107=inp_used,A107=inp_used_usersel)","v":false},{"$f":"AND(C107:F107=inp_used_minimal,A107=inp_used_usersel)","v":false}]
[13,4,0.74,"MGD",0.251,"MGD",5,"effluent concentration",0.5,1.4,1.4,4.2999999999999997E-2,167.85,0.126,404,null,283,1.2470000000000001,1.7900000000000001E-5,2,157,3.3000000000000002E-2,15,null,5,1,"none","none",null,null,null,null,null,"fully automated",null,null,null,null,null,null,null,null,null,null,null,null,null,{"$f":"AND(C108:AT108=inp_used,A108=inp_used_usersel)","v":false},{"$f":"AND(C108:F108=inp_used_minimal,A108=inp_used_usersel)","v":false}]
[13,5,2.1520000000000001,"MGD",0.81899999999999995,"MGD",5,"effluent concentration",0.5,1.4,1.4,4.2999999999999997E-2,167.85,0.126,404,null,283,1.2470000000000001,1.7900000000000001E-5,2,157,3.3000000000000002E-2,15,null,5,1,"none","none",null,null,null,null,null,"fully automated",null,null,null,null,null,null,null,null,null,null,null,null,null,{"$f":"AND(C109:AT109=inp_used,A109=inp_used_usersel)","v":false},{"$f":"AND(C109:F109=inp_used_minimal,A109=inp_used_usersel)","v":false}]
[13,6,7.3650000000000002,"MGD",3.2,"MGD",5,"effluent concentration",0.5,1.4,1.4,4.2999999999999997E-2,167.85,0.126,404,null,283,1.2470000000000001,1.7900000000000001E-5,2,157,3.3000000000000002E-2,15,null,5,1,"none","none",null,null,null,null,null,"fully automated",null,null,null,null,null,null,null,null,null,null,null,null,null,{"$f":"AND(C110:AT110=inp_used,A110=inp_used_usersel)","v":false},{"$f":"AND(C110:F110=inp_used_minimal,A110=inp_used_usersel)","v":false}]
[13,7,22.614000000000001,"MGD",11.087,"MGD",5,"effluent concentration",0.5,1.4,1.4,4.2999999999999997E-2,167.85,0.126,404,null,283,1.2470000000000001,1.7900000000000001E-5,2,157,3.3000000000000002E-2,15,null,5,1,"none","none",null,null,null,null,null,"fully automated",null,null,null,null,null,null,null,null,null,null,null,null,null,{"$f":"AND(C111:AT111=inp_used,A111=inp_used_usersel)","v":false},{"$f":"AND(C111:F111=inp_used_minimal,A111=inp_used_usersel)","v":false}]
[13,8,75.072000000000003,"MGD",37.536000000000001,"MGD",5,"effluent concentration",0.5,1.4,1.4,4.2999999999999997E-2,167.85,0.126,404,null,283,1.2470000000000001,1.7900000000000001E-5,2,157,3.3000000000000002E-2,15,null,5,1,"none","none",null,null,null,null,null,"fully automated",null,null,null,null,null,null,null,null,null,null,null,null,null,{"$f":"AND(C112:AT112=inp_used,A112=inp_used_usersel)","v":false},{"$f":"AND(C112:F112=inp_used_minimal,A112=inp_used_usersel)","v":false}]
[14,1,0.03,"MGD",7.0000000000000001E-3,"MGD",5,"percent removal",0.875,1.4,1.4,9.8799999999999999E-3,167.85,0.126,418.2,null,283,1.2470000000000001,1.7900000000000001E-5,2,157,3.3000000000000002E-2,15,null,5,1,"none","none",null,null,null,null,null,"fully automated",null,null,null,null,null,null,null,null,null,null,null,null,"1,1,2,2-TCA",{"$f":"AND(C113:AT113=inp_used,A113=inp_used_usersel)","v":false},{"$f":"AND(C113:F113=inp_used_minimal,A113=inp_used_usersel)","v":false}]
[14,2,0.124,"MGD",3.5000000000000003E-2,"MGD",5,"percent removal",0.875,1.4,1.4,9.8799999999999999E-3,167.85,0.126,418.2,null,283,1.2470000000000001,1.7900000000000001E-5,2,157,3.3000000000000002E-2,15,null,5,1,"none","none",null,null,null,null,null,"fully automated",null,null,null,null,null,null,null,null,null,null,null,null,null,{"$f":"AND(C114:AT114=inp_used,A114=inp_used_usersel)","v":false},{"$f":"AND(C114:F114=inp_used_minimal,A114=inp_used_usersel)","v":false}]
[14,3,0.30499999999999999,"MGD",9.4E-2,"MGD",5,"percent removal",0.875,1.4,1.4,9.8799999999999999E-3,167.85,0.126,418.2,null,283,1.2470000000000001,1.7900000000000001E-5,2,157,3.3000000000000002E-2,15,null,5,1,"none","none",null,null,null,null,null,"fully automated",null,null,null,null,null,null,null,null,null,null,null,null,null,{"$f":"AND(C115:AT115=inp_used,A115=inp_used_usersel)","v":false},{"$f":"AND(C115:F115=inp_used_minimal,A115=inp_used_usersel)","v":false}]
[14,4,0.74,"MGD",0.251,"MGD",5,"percent removal",0.875,1.4,1.4,9.8799999999999999E-3,167.85,0.126,418.2,null,283,1.2470000000000001,1.7900000000000001E-5,2,157,3.3000000000000002E-2,15,null,5,1,"none","none",null,null,null,null,null,"fully automated",null,null,null,null,null,null,null,null,null,null,null,null,null,{"$f":"AND(C116:AT116=inp_used,A116=inp_used_usersel)","v":false},{"$f":"AND(C116:F116=inp_used_minimal,A116=inp_used_usersel)","v":false}]
[14,5,2.1520000000000001,"MGD",0.81899999999999995,"MGD",5,"percent removal",0.875,1.4,1.4,9.8799999999999999E-3,167.85,0.126,418.2,null,283,1.2470000000000001,1.7900000000000001E-5,2,157,3.3000000000000002E-2,15,null,5,1,"none","none",null,null,null,null,null,"fully automated",null,null,null,null,null,null,null,null,null,null,null,null,null,{"$f":"AND(C117:AT117=inp_used,A117=inp_used_usersel)","v":false},{"$f":"AND(C117:F117=inp_used_minimal,A117=inp_used_usersel)","v":false}]
[14,6,7.3650000000000002,"MGD",3.2,"MGD",5,"percent removal",0.875,1.4,1.4,9.8799999999999999E-3,167.85,0.126,418.2,null,283,1.2470000000000001,1.7900000000000001E-5,2,157,3.3000000000000002E-2,15,null,5,1,"none","none",null,null,null,null,null,"fully automated",null,null,null,null,null,null,null,null,null,null,null,null,null,{"$f":"AND(C118:AT118=inp_used,A118=inp_used_usersel)","v":false},{"$f":"AND(C118:F118=inp_used_minimal,A118=inp_used_usersel)","v":false}]
[14,7,22.614000000000001,"MGD",11.087,"MGD",5,"percent removal",0.875,1.4,1.4,9.8799999999999999E-3,167.85,0.126,418.2,null,283,1.2470000000000001,1.7900000000000001E-5,2,157,3.3000000000000002E-2,15,null,5,1,"none","none",null,null,null,null,null,"fully automated",null,null,null,null,null,null,null,null,null,null,null,null,null,{"$f":"AND(C119:AT119=inp_used,A119=inp_used_usersel)","v":false},{"$f":"AND(C119:F119=inp_used_minimal,A119=inp_used_usersel)","v":false}]
[14,8,75.072000000000003,"MGD",37.536000000000001,"MGD",5,"percent removal",0.875,1.4,1.4,9.8799999999999999E-3,167.85,0.126,418.2,null,283,1.2470000000000001,1.7900000000000001E-5,2,157,3.3000000000000002E-2,15,null,5,1,"none","none",null,null,null,null,null,"fully automated",null,null,null,null,null,null,null,null,null,null,null,null,null,{"$f":"AND(C120:AT120=inp_used,A120=inp_used_usersel)","v":false},{"$f":"AND(C120:F120=inp_used_minimal,A120=inp_used_usersel)","v":false}]
[15,1,0.03,"MGD",7.0000000000000001E-3,"MGD",5,"percent removal",0.75,1.4,1.4,6.1599999999999997E-3,147.43,0.13,429.8,null,283,1.2470000000000001,1.7900000000000001E-5,2,157,3.3000000000000002E-2,15,null,5,1,"none","none",null,null,null,null,null,"fully automated",null,null,null,null,null,null,null,null,null,null,null,null,"1,2,3-TCP",{"$f":"AND(C121:AT121=inp_used,A121=inp_used_usersel)","v":false},{"$f":"AND(C121:F121=inp_used_minimal,A121=inp_used_usersel)","v":false}]
[15,2,0.124,"MGD",3.5000000000000003E-2,"MGD",5,"percent removal",0.75,1.4,1.4,6.1599999999999997E-3,147.43,0.13,429.8,null,283,1.2470000000000001,1.7900000000000001E-5,2,157,3.3000000000000002E-2,15,null,5,1,"none","none",null,null,null,null,null,"fully automated",null,null,null,null,null,null,null,null,null,null,null,null,null,{"$f":"AND(C122:AT122=inp_used,A122=inp_used_usersel)","v":false},{"$f":"AND(C122:F122=inp_used_minimal,A122=inp_used_usersel)","v":false}]
[15,3,0.30499999999999999,"MGD",9.4E-2,"MGD",5,"percent removal",0.75,1.4,1.4,6.1599999999999997E-3,147.43,0.13,429.8,null,283,1.2470000000000001,1.7900000000000001E-5,2,157,3.3000000000000002E-2,15,null,5,1,"none","none",null,null,null,null,null,"fully automated",null,null,null,null,null,null,null,null,null,null,null,null,null,{"$f":"AND(C123:AT123=inp_used,A123=inp_used_usersel)","v":false},{"$f":"AND(C123:F123=inp_used_minimal,A123=inp_used_usersel)","v":false}]
[15,4,0.74,"MGD",0.251,"MGD",5,"percent removal",0.75,1.4,1.4,6.1599999999999997E-3,147.43,0.13,429.8,null,283,1.2470000000000001,1.7900000000000001E-5,2,157,3.3000000000000002E-2,15,null,5,1,"none","none",null,null,null,null,null,"fully automated",null,null,null,null,null,null,null,null,null,null,null,null,null,{"$f":"AND(C124:AT124=inp_used,A124=inp_used_usersel)","v":false},{"$f":"AND(C124:F124=inp_used_minimal,A124=inp_used_usersel)","v":false}]
[15,5,2.1520000000000001,"MGD",0.81899999999999995,"MGD",5,"percent removal",0.75,1.4,1.4,6.1599999999999997E-3,147.43,0.13,429.8,null,283,1.2470000000000001,1.7900000000000001E-5,2,157,3.3000000000000002E-2,15,null,5,1,"none","none",null,null,null,null,null,"fully automated",null,null,null,null,null,null,null,null,null,null,null,null,null,{"$f":"AND(C125:AT125=inp_used,A125=inp_used_usersel)","v":false},{"$f":"AND(C125:F125=inp_used_minimal,A125=inp_used_usersel)","v":false}]
[15,6,7.3650000000000002,"MGD",3.2,"MGD",5,"percent removal",0.75,1.4,1.4,6.1599999999999997E-3,147.43,0.13,429.8,null,283,1.2470000000000001,1.7900000000000001E-5,2,157,3.3000000000000002E-2,15,null,5,1,"none","none",null,null,null,null,null,"fully automated",null,null,null,null,null,null,null,null,null,null,null,null,null,{"$f":"AND(C126:AT126=inp_used,A126=inp_used_usersel)","v":false},{"$f":"AND(C126:F126=inp_used_minimal,A126=inp_used_usersel)","v":false}]
[15,7,22.614000000000001,"MGD",11.087,"MGD",5,"percent removal",0.75,1.4,1.4,6.1599999999999997E-3,147.43,0.13,429.8,null,283,1.2470000000000001,1.7900000000000001E-5,2,157,3.3000000000000002E-2,15,null,5,1,"none","none",null,null,null,null,null,"fully automated",null,null,null,null,null,null,null,null,null,null,null,null,null,{"$f":"AND(C127:AT127=inp_used,A127=inp_used_usersel)","v":false},{"$f":"AND(C127:F127=inp_used_minimal,A127=inp_used_usersel)","v":false}]
[15,8,75.072000000000003,"MGD",37.536000000000001,"MGD",5,"percent removal",0.75,1.4,1.4,6.1599999999999997E-3,147.43,0.13,429.8,null,283,1.2470000000000001,1.7900000000000001E-5,2,157,3.3000000000000002E-2,15,null,5,1,"none","none",null,null,null,null,null,"fully automated",null,null,null,null,null,null,null,null,null,null,null,null,null,{"$f":"AND(C128:AT128=inp_used,A128=inp_used_usersel)","v":false},{"$f":"AND(C128:F128=inp_used_minimal,A128=inp_used_usersel)","v":false}]
[16,1,0.03,"MGD",7.0000000000000001E-3,"MGD",null,null,null,null,null,null,null,null,null,null,null,null,null,null,null,null,null,null,null,null,null,null,null,null,null,null,null,null,null,null,null,null,null,null,null,null,null,null,null,null,null,{"$f":"AND(C129:AT129=inp_used,A129=inp_used_usersel)","v":false},{"$f":"AND(C129:F129=inp_used_minimal,A129=inp_used_usersel)","v":false}]
[16,2,0.124,"MGD",3.5000000000000003E-2,"MGD",null,null,null,null,null,null,null,null,null,null,null,null,null,null,null,null,null,null,null,null,null,null,null,null,null,null,null,null,null,null,null,null,null,null,null,null,null,null,null,null,null,{"$f":"AND(C130:AT130=inp_used,A130=inp_used_usersel)","v":false},{"$f":"AND(C130:F130=inp_used_minimal,A130=inp_used_usersel)","v":false}]
[16,3,0.30499999999999999,"MGD",9.4E-2,"MGD",null,null,null,null,null,null,null,null,null,null,null,null,null,null,null,null,null,null,null,null,null,null,null,null,null,null,null,null,null,null,null,null,null,null,null,null,null,null,null,null,null,{"$f":"AND(C131:AT131=inp_used,A131=inp_used_usersel)","v":false},{"$f":"AND(C131:F131=inp_used_minimal,A131=inp_used_usersel)","v":false}]
[16,4,0.74,"MGD",0.251,"MGD",null,null,null,null,null,null,null,null,null,null,null,null,null,null,null,null,null,null,null,null,null,null,null,null,null,null,null,null,null,null,null,null,null,null,null,null,null,null,null,null,null,{"$f":"AND(C132:AT132=inp_used,A132=inp_used_usersel)","v":false},{"$f":"AND(C132:F132=inp_used_minimal,A132=inp_used_usersel)","v":false}]
[16,5,2.1520000000000001,"MGD",0.81899999999999995,"MGD",null,null,null,null,null,null,null,null,null,null,null,null,null,null,null,null,null,null,null,null,null,null,null,null,null,null,null,null,null,null,null,null,null,null,null,null,null,null,null,null,null,{"$f":"AND(C133:AT133=inp_used,A133=inp_used_usersel)","v":false},{"$f":"AND(C133:F133=inp_used_minimal,A133=inp_used_usersel)","v":false}]
[16,6,7.3650000000000002,"MGD",3.2,"MGD",null,null,null,null,null,null,null,null,null,null,null,null,null,null,null,null,null,null,null,null,null,null,null,null,null,null,null,null,null,null,null,null,null,null,null,null,null,null,null,null,null,{"$f":"AND(C134:AT134=inp_used,A134=inp_used_usersel)","v":false},{"$f":"AND(C134:F134=inp_used_minimal,A134=inp_used_usersel)","v":false}]
[16,7,22.614000000000001,"MGD",11.087,"MGD",null,null,null,null,null,null,null,null,null,null,null,null,null,null,null,null,null,null,null,null,null,null,null,null,null,null,null,null,null,null,null,null,null,null,null,null,null,null,null,null,null,{"$f":"AND(C135:AT135=inp_used,A135=inp_used_usersel)","v":false},{"$f":"AND(C135:F135=inp_used_minimal,A135=inp_used_usersel)","v":false}]
[16,8,75.072000000000003,"MGD",37.536000000000001,"MGD",null,null,null,null,null,null,null,null,null,null,null,null,null,null,null,null,null,null,null,null,null,null,null,null,null,null,null,null,null,null,null,null,null,null,null,null,null,null,null,null,null,{"$f":"AND(C136:AT136=inp_used,A136=inp_used_usersel)","v":false},{"$f":"AND(C136:F136=inp_used_minimal,A136=inp_used_usersel)","v":false}]
[]
[{"$f":"IF(LEN(contam)=0,\"\",contam)","v":3},null,{"$f":"IF(LEN(QW_IN)=0,\"\",QW_IN)","v":0.03},{"$f":"IF(LEN(df_units)=0,\"\",df_units)","v":"MGD"},{"$f":"IF(LEN(QWA_IN)=0,\"\",QWA_IN)","v":7.0000000000000001E-3},{"$f":"IF(LEN(af_units)=0,\"\",af_units)","v":"MGD"},{"$f":"IF(LEN(Influent_conc)=0,\"\",Influent_conc)","v":5},{"$f":"IF(LEN(Units_rem_I)=0,\"\",Units_rem_I)","v":"effluent concentration"},{"$f":"IF(LEN(Rem_I)=0,\"\",Rem_I)","v":0.5},{"$f":"IF(LEN(SF_KLA)=0,\"\",SF_KLA)","v":1.4},{"$f":"IF(LEN(SF_HENRY)=0,\"\",SF_HENRY)","v":1.4},{"$f":"IF(LEN(HENRY)=0,\"\",HENRY)","v":0.187},{"$f":"IF(LEN(MW_IN)=0,\"\",MW_IN)","v":131.38999999999999},{"$f":"IF(LEN(MV_IN)=0,\"\",MV_IN)","v":0.10199999999999999},{"$f":"IF(LEN(TB_IN)=0,\"\",TB_IN)","v":359.7},{"$f":"IF(LEN(TM_IN)=0,\"\",TM_IN)","v":""},{"$f":"IF(LEN(T)=0,\"\",T)","v":283},{"$f":"IF(LEN(PA)=0,\"\",PA)","v":1.2470000000000001},{"$f":"IF(LEN(UA)=0,\"\",UA)","v":1.7900000000000001E-5},{"$f":"IF(LEN(Packing_size)=0,\"\",Packing_size)","v":2},{"$f":"IF(LEN(AP)=0,\"\",AP)","v":157},{"$f":"IF(LEN(SP)=0,\"\",SP)","v":3.3000000000000002E-2},{"$f":"IF(LEN(CF)=0,\"\",CF)","v":15},{"$f":"IF(LEN(alt_pack_cost)=0,\"\",alt_pack_cost)","v":""},{"$f":"IF(LEN(AW_DET)=0,\"\",AW_DET)","v":5},{"$f":"IF(LEN(max_VOC_release)=0,\"\",max_VOC_release)","v":1},{"$f":"IF(LEN(Offgas_Tech_I)=0,\"\",Offgas_Tech_I)","v":"none"},{"$f":"IF(LEN(og_opt1_I)=0,\"\",og_opt1_I)","v":"none"},{"$f":"IF(LEN(og_opt2_I)=0,\"\",og_opt2_I)","v":""},{"$f":"IF(LEN(og_opt3)=0,\"\",og_opt3)","v":""},{"$f":"IF(LEN(num_pumps_I)=0,\"\",num_pumps_I)","v":""},{"$f":"IF(LEN(parallel_I)=0,\"\",parallel_I)","v":""},{"$f":"IF(LEN(NRD_I)=0,\"\",NRD_I)","v":""},{"$f":"IF(LEN(manual_I)=0,\"\",manual_I)","v":"fully automated"},{"$f":"IF(LEN(component_level_I)=0,\"\",component_level_I)","v":""},{"$f":"IF(LEN(retrofit_I)=0,\"\",retrofit_I)","v":""},{"$f":"IF(LEN(r_xtraheight_I)=0,\"\",r_xtraheight_I)","v":""},{"$f":"IF(LEN(r_xtraheight_units)=0,\"\",r_xtraheight_units)","v":""},{"$f":"IF(LEN(r_Henry)=0,\"\",r_Henry)","v":""},{"$f":"IF(LEN(r_Mw_in)=0,\"\",r_Mw_in)","v":""},{"$f":"IF(LEN(r_Mv_in)=0,\"\",r_Mv_in)","v":""},{"$f":"IF(LEN(r_Tb_in)=0,\"\",r_Tb_in)","v":""},{"$f":"IF(LEN(r_Tm_in)=0,\"\",r_Tm_in)","v":""},{"$f":"IF(LEN(r_influent_conc_I)=0,\"\",r_influent_conc_I)","v":""},{"$f":"IF(LEN(r_units_rem_I)=0,\"\",r_units_rem_I)","v":""},{"$f":"IF(LEN(r_rem_I)=0,\"\",r_rem_I)","v":""},"<--current inputs"]
[null,null,0.03,"MGD",7.0000000000000001E-3,"MGD",5,"effluent concentration",0.5,1.4,1.4,0.187,131.38999999999999,0.10199999999999999,359.7,null,283,1.2470000000000001,1.7900000000000001E-5,2,157,3.3000000000000002E-2,15,null,5,1,"none","none",null,null,null,null,null,"fully automated",null,null,null,null,null,null,null,null,null,null,null,null,"<--inputs used at last \"Generate Results\"",{"$f":"AND(C139:AT139=inp_used)","v":true}]

{"sheet":"Design Macros","index":21,"n_rows":19,"n_cols":3,"rows_kept":19,"cut":false,"hidden":false,"merged":[]}
["Design Macros"]
["This sheet contains constraints, starting values, and calculations used internally by the design macro to size the PTA system.  "]
[]
["Design Constraints"]
["Min_d_rat",{"$f":"Min_d_rat_cda","v":1.5},"x column diameter"]
["Max_d_rat",{"$f":"Max_d_rat_cda","v":10},"x column diameter"]
["Max_pack",{"$f":"IF(contam=1,Max_pack_MTBE,Max_pack_std)","v":6.1},"meters"]
[]
["Flag1",0,"Set if L_Load recalculated to meet minimum diameter requirements"]
["RanOKMsg",1,"Set to 1 if \"OK\" message has already been displayed after Simulate routine"]
["Min_ratio",{"$f":"ROUNDUP(P_REM*OP_PRESS/DES_HENRY,0)","v":7},"The minimum allowable air/water ratio for this contaminant, used to trigger overdesigns (i.e. the ratio below which strip factor goes below removal percent)"]
["l_load_I",1.7000000000000001E-2,"Starting point for l_load in m3/m2 - sec (25 gpm/ft2)"]
["ratio_I",{"$f":"Min_ratio","v":7},"Starting point for ratio, original for radon was 15, now using min_ratio to speed processing time and find more efficient designs."]
[]
["Condition variables"]
["total_area<min_area",{"$f":"TOT_AREA/NUM_COL-MIN_AREA","v":8.6128153562543344E-2}]
["Pack_ht>max_pack then max_ht",{"$f":"IF(STRIP_FACTOR=1,-1,PACK_HT-MAX_PACK)","v":-2.6635812778335839}]
["pack_ht>max_d_rat*d then Max_ht",{"$f":"IF(STRIP_FACTOR=1,-1,PACK_HT-(MAX_D_RAT*D))","v":-0.16358127783358389}]
["pack_ht<min_d_rat*d",{"$f":"IF(STRIP_FACTOR=1,-1,PACK_HT-(MIN_D_RAT*D))","v":2.8964187221664157}]

{"sheet":"Cost Equations","index":22,"n_rows":224,"n_cols":17,"rows_kept":224,"cut":false,"hidden":false,"merged":[]}
["Cost Equations"]
["This sheet is used internally to calculate component costs using the cost equations method; see model documentation for more details on the development of cost equations"]
[]
["Component","Equation Name","Result","Variable",null,2,3,4,5,6,7,8,9,10,11,16,17]
["Pressure Vessels"]
["Shell"]
["Stainless Steel","ss_shell_eq",{"$f":"IF(D7=0,0,IF(OR(D7>P7,D7<Q7),\"contact vendor\",F7*D7^G7+H7*LN(D7)+I7+J7*EXP(K7*D7)+L7*D7^3+M7*D7^2+N7*D7+O7))","v":26378.308748081439},{"$f":"col_vol","v":121.32373803711515},"ss_shell_eq",{"$f":"VLOOKUP($E7,eq_table_cl,F$4,FALSE)","v":0},0,0,0,26169.293386130001,6.5571E-5,0,0,0,0,27025,0]
["Fiberglass","fg_shell_eq",{"$f":"IF(D8=0,0,IF(OR(D8>P8,D8<Q8),\"contact vendor\",F8*D8^G8+H8*LN(D8)+I8+J8*EXP(K8*D8)+L8*D8^3+M8*D8^2+N8*D8+O8))","v":23400.996900552374},{"$f":"col_vol","v":121.32373803711515},"fg_shell_eq",0,0,0,0,0,0,0,5.2023E-5,1.2209150280000001,23252.105175613,27025,0]
["Aluminum","al_shell_eq",21609.518617549216,{"$f":"col_vol","v":121.32373803711515},"al_shell_eq",0,0,0,0,0,0,-2.0000000000000001E-9,1.23702E-4,1.1827402389999999,21464.206896932999,27025,0]
["Support Plate"]
["Stainless Steel","ss_splate_eq",{"$f":"IF(D11=0,0,IF(OR(D11>P11,D11<Q11),\"contact vendor\",F11*D11^G11+H11*LN(D11)+I11+J11*EXP(K11*D11)+L11*D11^3+M11*D11^2+N11*D11+O11))","v":977.44498608365575},{"$f":"AREA","v":0.10437815356254335},"ss_splate_eq",{"$f":"VLOOKUP($E11,eq_table_cl,F$4,FALSE)","v":0},0,0,0,0,0,45.700626565999997,-534.36125093199996,2799.670875407,690.99029812399999,7.31,0]
["Plastic","pl_splate_eq",1819.4071729119194,{"$f":"AREA","v":0.10437815356254335},"pl_splate_eq",0,0,0,0,0,0,3.93052673,17.121631528000002,3020.098756073,1503.9838347309999,7.31,0]
["Liquid Distributor"]
["Stainless Steel","ss_ldist_eq",{"$f":"IF(D14=0,0,IF(OR(D14>P14,D14<Q14),\"contact vendor\",F14*D14^G14+H14*LN(D14)+I14+J14*EXP(K14*D14)+L14*D14^3+M14*D14^2+N14*D14+O14))","v":1823.669054908951},{"$f":"AREA","v":0.10437815356254335},"ss_ldist_eq",{"$f":"VLOOKUP($E14,eq_table_cl,F$4,FALSE)","v":0},0,0,0,0,0,124.253814613,-1485.365130034,6785.1992920069997,1131.4839368729999,7.31,0]
["Plastic","pl_ldist_eq",2615.1902610591601,{"$f":"AREA","v":0.10437815356254335},"pl_ldist_eq",6608.3641086629996,0.41022479699999997,0,0,0,0,0,0,0,0,7.31,0]
["Liquid Redistributor"]
["Stainless Steel","ss_redist_eq",{"$f":"IF(D17=0,0,IF(OR(D17>P17,D17<Q17),\"contact vendor\",F17*D17^G17+H17*LN(D17)+I17+J17*EXP(K17*D17)+L17*D17^3+M17*D17^2+N17*D17+O17))","v":1965.1562211213852},{"$f":"AREA","v":0.10437815356254335},"ss_redist_eq",{"$f":"VLOOKUP($E17,eq_table_cl,F$4,FALSE)","v":0},0,0,0,0,0,140.26721593299999,-1474.6345473480001,5782.2602772890004,1377.520907933,7.31,0]
["Plastic","pl_redist_eq",2633.6692293491569,{"$f":"AREA","v":0.10437815356254335},"pl_redist_eq",0,0,0,0,0,0,3587.9775931109998,-12103.954586251,15881.856984664,1103.7403009950001,1.81,0]
["Packing","no equation"]
["Pumps and Blowers"]
["Booster Pumps","pump_eq",{"$f":"IF(D21=0,0,IF(OR(D21>P21,D21<Q21),\"contact vendor\",F21*D21^G21+H21*LN(D21)+I21+J21*EXP(K21*D21)+L21*D21^3+M21*D21^2+N21*D21+O21))","v":5960.3761052926784},{"$f":"QP","v":13.020833333333332},"pump_eq",{"$f":"VLOOKUP($E21,eq_table_cl,F$4,FALSE)","v":0},0,0,0,0,0,0,-4.3557200000000001E-4,11.502794618999999,5810.6739814829998,10001,0]
["Hydrochloric Acid Metering Pumps"]
["PVC - Motor Driven","pvc_mmpump_eq_hcl",{"$f":"IF(D23=0,0,IF(OR(D23>P23,D23<Q23),\"contact vendor\",F23*D23^G23+H23*LN(D23)+I23+J23*EXP(K23*D23)+L23*D23^3+M23*D23^2+N23*D23+O23))","v":0},{"$f":"HCl_pump_rate","v":0},"pvc_mmpump_eq",{"$f":"VLOOKUP($E23,eq_table_cl,F$4,FALSE)","v":0},0,0,0,0,0,-1.8689999999999999E-5,2.0423927000000001E-2,11.878140002,3416.2655497440001,760.1,0]
["PVC - Electric","pvc_empump_eq_hcl",0,{"$f":"HCl_pump_rate","v":0},"pvc_empump_eq",1199.37082994,0.19803047700000001,0,0,0,0,0,0,0,0,25.01,0]
["Sodium Hydroxide Metering Pumps"]
["PVC - Motor Driven","pvc_mmpump_eq_naoh",{"$f":"IF(D26=0,0,IF(OR(D26>P26,D26<Q26),\"contact vendor\",F26*D26^G26+H26*LN(D26)+I26+J26*EXP(K26*D26)+L26*D26^3+M26*D26^2+N26*D26+O26))","v":0},{"$f":"NaOH_pump_rate","v":0},"pvc_mmpump_eq",{"$f":"VLOOKUP($E26,eq_table_cl,F$4,FALSE)","v":0},0,0,0,0,0,-1.8689999999999999E-5,2.0423927000000001E-2,11.878140002,3416.2655497440001,760.1,0]
["Stainless Steel - Motor Driven","ss_mmpump_eq_naoh",0,{"$f":"NaOH_pump_rate","v":0},"ss_mmpump_eq",0,0,0,0,0,0,2.40249E-4,-9.6169726999999997E-2,26.430899222000001,3817.6509033560001,600.01,0]
["PVC - Electric","pvc_empump_eq_naoh",0,{"$f":"NaOH_pump_rate","v":0},"pvc_empump_eq",1199.37082994,0.19803047700000001,0,0,0,0,0,0,0,0,25.01,0]
["Stainless Steel - Electric","ss_empump_eq_naoh",0,{"$f":"NaOH_pump_rate","v":0},"ss_empump_eq",0,0,0,0,0,0,0,-0.50159228600000005,103.73496039299999,1220.9469661359999,25.01,0]
["Corrosion Chemical Metering Pumps"]
["PVC - Motor Driven","pvc_mmpump_eq_cc",{"$f":"IF(D31=0,0,IF(OR(D31>P31,D31<Q31),\"contact vendor\",F31*D31^G31+H31*LN(D31)+I31+J31*EXP(K31*D31)+L31*D31^3+M31*D31^2+N31*D31+O31))","v":3416.3402469966863},{"$f":"cc_pump_rate","v":6.2885641180478154E-3},"pvc_mmpump_eq",{"$f":"VLOOKUP($E31,eq_table_cl,F$4,FALSE)","v":0},0,0,0,0,0,-1.8689999999999999E-5,2.0423927000000001E-2,11.878140002,3416.2655497440001,760.1,0]
["Stainless Steel - Motor Driven","ss_mmpump_eq_cc",3817.8171119573831,{"$f":"cc_pump_rate","v":6.2885641180478154E-3},"ss_mmpump_eq",0,0,0,0,0,0,2.40249E-4,-9.6169726999999997E-2,26.430899222000001,3817.6509033560001,600.01,0]
["PVC - Electric","pvc_empump_eq_cc",439.541194643594,{"$f":"cc_pump_rate","v":6.2885641180478154E-3},"pvc_empump_eq",1199.37082994,0.19803047700000001,0,0,0,0,0,0,0,0,25.01,0]
["Stainless Steel - Electric","ss_empump_eq_cc",1221.5992902497264,{"$f":"cc_pump_rate","v":6.2885641180478154E-3},"ss_empump_eq",0,0,0,0,0,0,0,-0.50159228600000005,103.73496039299999,1220.9469661359999,25.01,0]
["Blowers"]
["Centrifugal","cent_blow_eq",{"$f":"IF(D36=0,0,IF(OR(D36>P36,D36<Q36),\"contact vendor\",F36*D36^G36+H36*LN(D36)+I36+J36*EXP(K36*D36)+L36*D36^3+M36*D36^2+N36*D36+O36))","v":28092.938077326671},{"$f":"Q_BLOWER","v":135.44813601000004},"cent_blow_eq",{"$f":"VLOOKUP($E36,eq_table_cl,F$4,FALSE)","v":0},0,0,0,0,0,6.4899999999999995E-7,-4.7512379999999996E-3,18.492175183000001,25673.761831055999,3751,0]
["Positive Displacement","pd_blow_eq",11133.614061267508,{"$f":"Q_BLOWER","v":135.44813601000004},"pd_blow_eq",0,0,0,0,0,0,-5.3200000000000005E-7,2.2788219999999998E-3,19.306468887000001,8478.1031167929996,5001,0]
["Clearwell"]
["Concrete Clearwell","no equation"]
["Chemical Storage Tanks"]
["Acid Storage"]
["Plastic/HDPE","pl_cst_eq_hcl",{"$f":"IF(D42=0,0,IF(OR(D42>P42,D42<Q42),\"contact vendor\",F42*D42^G42+H42*LN(D42)+I42+J42*EXP(K42*D42)+L42*D42^3+M42*D42^2+N42*D42+O42))","v":0},{"$f":"HCl_tank_vol","v":0},"pl_cst_eq",{"$f":"VLOOKUP($E42,eq_table_cl,F$4,FALSE)","v":0},0,0,0,0,0,0,9.4213000000000001E-5,3.3366652989999999,740.65179689399997,6551,0]
["Fiberglass","fg_cst_eq_hcl",0,{"$f":"HCl_tank_vol","v":0},"fg_cst_eq",0,0,0,0,0,0,4.0000000000000002E-9,-1.5474099999999999E-4,3.8820459029999999,12523.192567737,30026,550]
["Acid Day Tanks"]
["Plastic/HDPE","pl_day_eq_hcl",{"$f":"IF(D45=0,0,IF(OR(D45>P45,D45<Q45),\"contact vendor\",F45*D45^G45+H45*LN(D45)+I45+J45*EXP(K45*D45)+L45*D45^3+M45*D45^2+N45*D45+O45))","v":0},{"$f":"day_tank_vol_acid","v":0},"pl_cst_eq",{"$f":"VLOOKUP($E45,eq_table_cl,F$4,FALSE)","v":0},0,0,0,0,0,0,9.4213000000000001E-5,3.3366652989999999,740.65179689399997,6551,0]
["Fiberglass","fg_day_eq_hcl",0,{"$f":"day_tank_vol_acid","v":0},"fg_cst_eq",0,0,0,0,0,0,4.0000000000000002E-9,-1.5474099999999999E-4,3.8820459029999999,12523.192567737,30026,550]
["Acid Storage Tank Mixers"]
["Portable","no equation"]
["Mounted","cmount_mix_eq_hcl",{"$f":"IF(D49=0,0,IF(OR(D49>P49,D49<Q49),\"contact vendor\",F49*D49^G49+H49*LN(D49)+I49+J49*EXP(K49*D49)+L49*D49^3+M49*D49^2+N49*D49+O49))","v":0},{"$f":"cmix_size_acid","v":0},"mount_mix_eq",{"$f":"VLOOKUP($E49,eq_table_cl,F$4,FALSE)","v":0},0,0,0,0,0,89.521005114000005,-757.60052354499999,2275.3895989500002,366.29202327199999,2,0]
["Impeller Mixers","cimp_mix_eq_hcl",0,{"$f":"cmix_size_acid","v":0},"imp_mix_eq",5562.6010364479998,0.48893690899999998,0,0,0,0,0,0,0,0,20.100000000000001,0]
["Acid Day Tank Mixers"]
["Portable","no equation"]
["Mounted","dmount_mix_eq_hcl",{"$f":"IF(D53=0,0,IF(OR(D53>P53,D53<Q53),\"contact vendor\",F53*D53^G53+H53*LN(D53)+I53+J53*EXP(K53*D53)+L53*D53^3+M53*D53^2+N53*D53+O53))","v":0},{"$f":"dmix_size_acid","v":0},"mount_mix_eq",{"$f":"VLOOKUP($E53,eq_table_cl,F$4,FALSE)","v":0},0,0,0,0,0,89.521005114000005,-757.60052354499999,2275.3895989500002,366.29202327199999,2,0]
["Impeller Mixers","dimp_mix_eq_hcl",0,{"$f":"dmix_size_acid","v":0},"imp_mix_eq",5562.6010364479998,0.48893690899999998,0,0,0,0,0,0,0,0,20.100000000000001,0]
["Caustic Storage"]
["Plastic/HDPE","pl_cst_eq_naoh",{"$f":"IF(D56=0,0,IF(OR(D56>P56,D56<Q56),\"contact vendor\",F56*D56^G56+H56*LN(D56)+I56+J56*EXP(K56*D56)+L56*D56^3+M56*D56^2+N56*D56+O56))","v":0},{"$f":"NaOH_tank_vol","v":0},"pl_cst_eq",{"$f":"VLOOKUP($E56,eq_table_cl,F$4,FALSE)","v":0},0,0,0,0,0,0,9.4213000000000001E-5,3.3366652989999999,740.65179689399997,6551,0]
["Fiberglass","fg_cst_eq_naoh",0,{"$f":"NaOH_tank_vol","v":0},"fg_cst_eq",0,0,0,0,0,0,4.0000000000000002E-9,-1.5474099999999999E-4,3.8820459029999999,12523.192567737,30026,550]
["Stainless Steel","ss_cst_eq_naoh",0,{"$f":"NaOH_tank_vol","v":0},"ss_cst_eq",0,0,0,0,0,0,0,-8.0848999999999998E-5,9.2894152089999995,23922.103178615998,27079,187]
["Heat Tracing","cst_heat_eq",0,{"$f":"NaOH_tank_vol","v":0},"cst_heat_eq",0,0,0,0,0,0,1.0000000000000001E-9,-2.3699000000000001E-5,0.25128345499999999,1358.2848534520001,30026,0]
["Insulation","cst_insul_eq",0,{"$f":"NaOH_tank_vol","v":0},"cst_insul_eq",15.454491086000001,0.65029599500000002,0,0,0,0,0,0,0,0,30026,0]
["Caustic Day Tanks"]
["Plastic/HDPE","pl_day_eq_naoh",{"$f":"IF(D62=0,0,IF(OR(D62>P62,D62<Q62),\"contact vendor\",F62*D62^G62+H62*LN(D62)+I62+J62*EXP(K62*D62)+L62*D62^3+M62*D62^2+N62*D62+O62))","v":0},{"$f":"day_tank_vol_NaOH","v":0},"pl_cst_eq",{"$f":"VLOOKUP($E62,eq_table_cl,F$4,FALSE)","v":0},0,0,0,0,0,0,9.4213000000000001E-5,3.3366652989999999,740.65179689399997,6551,0]
["Fiberglass","fg_day_eq_naoh",0,{"$f":"day_tank_vol_NaOH","v":0},"fg_cst_eq",0,0,0,0,0,0,4.0000000000000002E-9,-1.5474099999999999E-4,3.8820459029999999,12523.192567737,30026,550]
["Stainless Steel","ss_day_eq_naoh",0,{"$f":"day_tank_vol_NaOH","v":0},"ss_cst_eq",0,0,0,0,0,0,0,-8.0848999999999998E-5,9.2894152089999995,23922.103178615998,27079,187]
["Heat Tracing","day_heat_eq",0,{"$f":"day_tank_vol_NaOH","v":0},"cst_heat_eq",0,0,0,0,0,0,1.0000000000000001E-9,-2.3699000000000001E-5,0.25128345499999999,1358.2848534520001,30026,0]
["Insulation","day_insul_eq",0,{"$f":"day_tank_vol_NaOH","v":0},"cst_insul_eq",15.454491086000001,0.65029599500000002,0,0,0,0,0,0,0,0,30026,0]
["Caustic Storage Tank Mixers"]
["Portable","no equation"]
["Mounted","cmount_mix_eq_naoh",{"$f":"IF(D69=0,0,IF(OR(D69>P69,D69<Q69),\"contact vendor\",F69*D69^G69+H69*LN(D69)+I69+J69*EXP(K69*D69)+L69*D69^3+M69*D69^2+N69*D69+O69))","v":0},{"$f":"cmix_size_NaOH","v":0},"mount_mix_eq",{"$f":"VLOOKUP($E69,eq_table_cl,F$4,FALSE)","v":0},0,0,0,0,0,89.521005114000005,-757.60052354499999,2275.3895989500002,366.29202327199999,2,0]
["Impeller Mixers","cimp_mix_eq_naoh",0,{"$f":"cmix_size_NaOH","v":0},"imp_mix_eq",5562.6010364479998,0.48893690899999998,0,0,0,0,0,0,0,0,20.100000000000001,0]
["Caustic Day Tank Mixers"]
["Portable","no equation"]
["Mounted","dmount_mix_eq_naoh",{"$f":"IF(D73=0,0,IF(OR(D73>P73,D73<Q73),\"contact vendor\",F73*D73^G73+H73*LN(D73)+I73+J73*EXP(K73*D73)+L73*D73^3+M73*D73^2+N73*D73+O73))","v":0},{"$f":"dmix_size_NaOH","v":0},"mount_mix_eq",{"$f":"VLOOKUP($E73,eq_table_cl,F$4,FALSE)","v":0},0,0,0,0,0,89.521005114000005,-757.60052354499999,2275.3895989500002,366.29202327199999,2,0]
["Impeller Mixers","dimp_mix_eq_naoh",0,{"$f":"dmix_size_NaOH","v":0},"imp_mix_eq",5562.6010364479998,0.48893690899999998,0,0,0,0,0,0,0,0,20.100000000000001,0]
["Corrosion Chemical Storage"]
["Plastic/HDPE","pl_cst_eq",{"$f":"IF(D76=0,0,IF(OR(D76>P76,D76<Q76),\"contact vendor\",F76*D76^G76+H76*LN(D76)+I76+J76*EXP(K76*D76)+L76*D76^3+M76*D76^2+N76*D76+O76))","v":754.75394361192116},{"$f":"cc_tank_vol","v":4.2259150873281319},"pl_cst_eq",{"$f":"VLOOKUP($E76,eq_table_cl,F$4,FALSE)","v":0},0,0,0,0,0,0,9.4213000000000001E-5,3.3366652989999999,740.65179689399997,6551,0]
["Fiberglass","fg_cst_eq","contact vendor",{"$f":"cc_tank_vol","v":4.2259150873281319},"fg_cst_eq",0,0,0,0,0,0,4.0000000000000002E-9,-1.5474099999999999E-4,3.8820459029999999,12523.192567737,30026,550]
["Stainless Steel","ss_cst_eq","contact vendor",{"$f":"cc_tank_vol","v":4.2259150873281319},"ss_cst_eq",0,0,0,0,0,0,0,-8.0848999999999998E-5,9.2894152089999995,23922.103178615998,27079,187]
["Day Tanks"]
["Plastic/HDPE","pl_day_eq",{"$f":"IF(D80=0,0,IF(OR(D80>P80,D80<Q80),\"contact vendor\",F80*D80^G80+H80*LN(D80)+I80+J80*EXP(K80*D80)+L80*D80^3+M80*D80^2+N80*D80+O80))","v":0},{"$f":"day_tank_vol_sh","v":0},"pl_cst_eq",{"$f":"VLOOKUP($E80,eq_table_cl,F$4,FALSE)","v":0},0,0,0,0,0,0,9.4213000000000001E-5,3.3366652989999999,740.65179689399997,6551,0]
["Fiberglass","fg_day_eq",0,{"$f":"day_tank_vol_sh","v":0},"fg_cst_eq",0,0,0,0,0,0,4.0000000000000002E-9,-1.5474099999999999E-4,3.8820459029999999,12523.192567737,30026,550]
["Stainless Steel","ss_day_eq",0,{"$f":"day_tank_vol_sh","v":0},"ss_cst_eq",0,0,0,0,0,0,0,-8.0848999999999998E-5,9.2894152089999995,23922.103178615998,27079,187]
["Storage Tank Mixers"]
["Portable","no equation"]
["Mounted","cmount_mix_eq",{"$f":"IF(D85=0,0,IF(OR(D85>P85,D85<Q85),\"contact vendor\",F85*D85^G85+H85*LN(D85)+I85+J85*EXP(K85*D85)+L85*D85^3+M85*D85^2+N85*D85+O85))","v":368.69507859264894},{"$f":"cmix_size_sh","v":1.056478771832033E-3},"mount_mix_eq",{"$f":"VLOOKUP($E85,eq_table_cl,F$4,FALSE)","v":0},0,0,0,0,0,89.521005114000005,-757.60052354499999,2275.3895989500002,366.29202327199999,2,0]
["Impeller Mixers","cimp_mix_eq",195.04445091214686,{"$f":"cmix_size_sh","v":1.056478771832033E-3},"imp_mix_eq",5562.6010364479998,0.48893690899999998,0,0,0,0,0,0,0,0,20.100000000000001,0]
["Day Tank Mixers"]
["Portable","no equation"]
["Mounted","dmount_mix_eq",{"$f":"IF(D89=0,0,IF(OR(D89>P89,D89<Q89),\"contact vendor\",F89*D89^G89+H89*LN(D89)+I89+J89*EXP(K89*D89)+L89*D89^3+M89*D89^2+N89*D89+O89))","v":0},{"$f":"dmix_size_sh","v":0},"mount_mix_eq",{"$f":"VLOOKUP($E89,eq_table_cl,F$4,FALSE)","v":0},0,0,0,0,0,89.521005114000005,-757.60052354499999,2275.3895989500002,366.29202327199999,2,0]
["Impeller Mixers","dimp_mix_eq",0,{"$f":"dmix_size_sh","v":0},"imp_mix_eq",5562.6010364479998,0.48893690899999998,0,0,0,0,0,0,0,0,20.100000000000001,0]
["Piping"]
["Process Piping"]
["Ductile Iron","di_pipe_eq_in",{"$f":"IF(D93=0,0,IF(OR(D93>P93,D93<Q93),\"contact vendor\",F93*D93^G93+H93*LN(D93)+I93+J93*EXP(K93*D93)+L93*D93^3+M93*D93^2+N93*D93+O93))","v":"contact vendor"},{"$f":"proc_pipe_diam","v":1.5},"di_pipe_eq",{"$f":"VLOOKUP($E93,eq_table_cl,F$4,FALSE)","v":0},0,0,0,0,0,5.5523166999999998E-2,-1.7343722210000001,21.872521642999999,-33.123758789,48.1,4]
["CPVC","cpvc_pipe_eq_in",8.8384855386249992,{"$f":"proc_pipe_diam","v":1.5},"cpvc_pipe_eq",0,0,0,0,0,0,-1.4019403E-2,1.3468648089999999,3.5632997450000001,0.51040558599999997,12.1,0]
["PVC","pvc_pipe_eq_in",2.2804869051250001,{"$f":"proc_pipe_diam","v":1.5},"pvc_pipe_eq",0,0,0,0,0,0,6.5904500000000003E-4,6.5264830999999995E-2,1.125738049,0.44280968500000001,48.1,0]
["Stainless Steel","ss_pipe_eq_in",50.308192065499988,{"$f":"proc_pipe_diam","v":1.5},"ss_pipe_eq",0,0,0,0,0,0,1.25271E-3,-8.4998590000000002E-3,32.766712771999998,1.1730196939999999,48.1,0]
["Steel","st_pipe_eq_in",24.836319334125001,{"$f":"proc_pipe_diam","v":1.5},"st_pipe_eq",0,0,0,0,0,0,3.0934449999999998E-3,-0.42192453099999999,21.746769,-6.8449443480000003,60.1,1]
["Inlet and Outlet Piping"]
["Ductile Iron","di_pipe_eq_head",{"$f":"IF(D99=0,0,IF(OR(D99>P99,D99<Q99),\"contact vendor\",F99*D99^G99+H99*LN(D99)+I99+J99*EXP(K99*D99)+L99*D99^3+M99*D99^2+N99*D99+O99))","v":"contact vendor"},{"$f":"in_out_pipe_diam","v":1.5},"di_pipe_eq",{"$f":"VLOOKUP($E99,eq_table_cl,F$4,FALSE)","v":0},0,0,0,0,0,5.5523166999999998E-2,-1.7343722210000001,21.872521642999999,-33.123758789,48.1,4]
["CPVC","cpvc_pipe_eq_head",8.8384855386249992,{"$f":"in_out_pipe_diam","v":1.5},"cpvc_pipe_eq",0,0,0,0,0,0,-1.4019403E-2,1.3468648089999999,3.5632997450000001,0.51040558599999997,12.1,0]
["PVC","pvc_pipe_eq_head",2.2804869051250001,{"$f":"in_out_pipe_diam","v":1.5},"pvc_pipe_eq",0,0,0,0,0,0,6.5904500000000003E-4,6.5264830999999995E-2,1.125738049,0.44280968500000001,48.1,0]
["Stainless Steel","ss_pipe_eq_head",50.308192065499988,{"$f":"in_out_pipe_diam","v":1.5},"ss_pipe_eq",0,0,0,0,0,0,1.25271E-3,-8.4998590000000002E-3,32.766712771999998,1.1730196939999999,48.1,0]
["Steel","st_pipe_eq_head",24.836319334125001,{"$f":"in_out_pipe_diam","v":1.5},"st_pipe_eq",0,0,0,0,0,0,3.0934449999999998E-3,-0.42192453099999999,21.746769,-6.8449443480000003,60.1,1]
["Bypass Piping"]
["CPVC","cpvc_pipe_eq_bp",{"$f":"IF(D105=0,0,IF(OR(D105>P105,D105<Q105),\"contact vendor\",F105*D105^G105+H105*LN(D105)+I105+J105*EXP(K105*D105)+L105*D105^3+M105*D105^2+N105*D105+O105))","v":0},{"$f":"bp_pipe_diam","v":0},"cpvc_pipe_eq",{"$f":"VLOOKUP($E105,eq_table_cl,F$4,FALSE)","v":0},0,0,0,0,0,-1.4019403E-2,1.3468648089999999,3.5632997450000001,0.51040558599999997,12.1,0]
["PVC","pvc_pipe_eq_bp",0,{"$f":"bp_pipe_diam","v":0},"pvc_pipe_eq",0,0,0,0,0,0,6.5904500000000003E-4,6.5264830999999995E-2,1.125738049,0.44280968500000001,48.1,0]
["Stainless Steel","ss_pipe_eq_bp",0,{"$f":"bp_pipe_diam","v":0},"ss_pipe_eq",0,0,0,0,0,0,1.25271E-3,-8.4998590000000002E-3,32.766712771999998,1.1730196939999999,48.1,0]
["Steel","st_pipe_eq_bp",0,{"$f":"bp_pipe_diam","v":0},"st_pipe_eq",0,0,0,0,0,0,3.0934449999999998E-3,-0.42192453099999999,21.746769,-6.8449443480000003,60.1,1]
["Air Piping"]
["CPVC","cpvc_pipe_eq_air",{"$f":"IF(D110=0,0,IF(OR(D110>P110,D110<Q110),\"contact vendor\",F110*D110^G110+H110*LN(D110)+I110+J110*EXP(K110*D110)+L110*D110^3+M110*D110^2+N110*D110+O110))","v":8.8384855386249992},{"$f":"air_pipe_diam","v":1.5},"cpvc_pipe_eq",{"$f":"VLOOKUP($E110,eq_table_cl,F$4,FALSE)","v":0},0,0,0,0,0,-1.4019403E-2,1.3468648089999999,3.5632997450000001,0.51040558599999997,12.1,0]
["PVC","pvc_pipe_eq_air",2.2804869051250001,{"$f":"air_pipe_diam","v":1.5},"pvc_pipe_eq",0,0,0,0,0,0,6.5904500000000003E-4,6.5264830999999995E-2,1.125738049,0.44280968500000001,48.1,0]
["Stainless Steel","ss_pipe_eq_air",50.308192065499988,{"$f":"air_pipe_diam","v":1.5},"ss_pipe_eq",0,0,0,0,0,0,1.25271E-3,-8.4998590000000002E-3,32.766712771999998,1.1730196939999999,48.1,0]
["Steel","st_pipe_eq_air",24.836319334125001,{"$f":"air_pipe_diam","v":1.5},"st_pipe_eq",0,0,0,0,0,0,3.0934449999999998E-3,-0.42192453099999999,21.746769,-6.8449443480000003,60.1,1]
["Hydrochloric Acid Feed Piping"]
["CPVC","cpvc_pipe_eq_hcl",{"$f":"IF(D115=0,0,IF(OR(D115>P115,D115<Q115),\"contact vendor\",F115*D115^G115+H115*LN(D115)+I115+J115*EXP(K115*D115)+L115*D115^3+M115*D115^2+N115*D115+O115))","v":2.6270192353750002},{"$f":"HCl_pipe_diam","v":0.5},"cpvc_pipe_eq",{"$f":"VLOOKUP($E115,eq_table_cl,F$4,FALSE)","v":0},0,0,0,0,0,-1.4019403E-2,1.3468648089999999,3.5632997450000001,0.51040558599999997,12.1,0]
["PVC","pvc_pipe_eq_hcl",1.0220772978749999,{"$f":"HCl_pipe_diam","v":0.5},"pvc_pipe_eq",0,0,0,0,0,0,6.5904500000000003E-4,6.5264830999999995E-2,1.125738049,0.44280968500000001,48.1,0]
["Stainless Steel","ss_pipe_eq_hcl",17.554407703999999,{"$f":"HCl_pipe_diam","v":0.5},"ss_pipe_eq",0,0,0,0,0,0,1.25271E-3,-8.4998590000000002E-3,32.766712771999998,1.1730196939999999,48.1,0]
["Sodium Hydroxide Feed Piping"]
["CPVC","cpvc_pipe_eq_naoh",{"$f":"IF(D119=0,0,IF(OR(D119>P119,D119<Q119),\"contact vendor\",F119*D119^G119+H119*LN(D119)+I119+J119*EXP(K119*D119)+L119*D119^3+M119*D119^2+N119*D119+O119))","v":2.6270192353750002},{"$f":"NaOH_pipe_diam","v":0.5},"cpvc_pipe_eq",{"$f":"VLOOKUP($E119,eq_table_cl,F$4,FALSE)","v":0},0,0,0,0,0,-1.4019403E-2,1.3468648089999999,3.5632997450000001,0.51040558599999997,12.1,0]
["PVC","pvc_pipe_eq_naoh",1.0220772978749999,{"$f":"NaOH_pipe_diam","v":0.5},"pvc_pipe_eq",0,0,0,0,0,0,6.5904500000000003E-4,6.5264830999999995E-2,1.125738049,0.44280968500000001,48.1,0]
["Stainless Steel","ss_pipe_eq_naoh",17.554407703999999,{"$f":"NaOH_pipe_diam","v":0.5},"ss_pipe_eq",0,0,0,0,0,0,1.25271E-3,-8.4998590000000002E-3,32.766712771999998,1.1730196939999999,48.1,0]
["Corrosion Chemical Feed Piping"]
["CPVC","cpvc_pipe_eq_cc",{"$f":"IF(D123=0,0,IF(OR(D123>P123,D123<Q123),\"contact vendor\",F123*D123^G123+H123*LN(D123)+I123+J123*EXP(K123*D123)+L123*D123^3+M123*D123^2+N123*D123+O123))","v":2.6270192353750002},{"$f":"cc_pipe_diam","v":0.5},"cpvc_pipe_eq",{"$f":"VLOOKUP($E123,eq_table_cl,F$4,FALSE)","v":0},0,0,0,0,0,-1.4019403E-2,1.3468648089999999,3.5632997450000001,0.51040558599999997,12.1,0]
["PVC","pvc_pipe_eq_cc",1.0220772978749999,{"$f":"cc_pipe_diam","v":0.5},"pvc_pipe_eq",0,0,0,0,0,0,6.5904500000000003E-4,6.5264830999999995E-2,1.125738049,0.44280968500000001,48.1,0]
["Stainless Steel","ss_pipe_eq_cc",17.554407703999999,{"$f":"cc_pipe_diam","v":0.5},"ss_pipe_eq",0,0,0,0,0,0,1.25271E-3,-8.4998590000000002E-3,32.766712771999998,1.1730196939999999,48.1,0]
["Valves"]
["Motor/Air Operated (on/off)"]
["Polypropylene/PVC - Process","pp_mov_eq_in",{"$f":"IF(D128=0,0,IF(OR(D128>P128,D128<Q128),\"contact vendor\",F128*D128^G128+H128*LN(D128)+I128+J128*EXP(K128*D128)+L128*D128^3+M128*D128^2+N128*D128+O128))","v":745.56193466762488},{"$f":"tank_valve_size","v":1.5},{"$f":"IF(D128>12,\"pp_mov_eq_large\",\"pp_mov_eq_small\")","v":"pp_mov_eq_small"},{"$f":"VLOOKUP($E128,eq_table_cl,F$4,FALSE)","v":0},0,0,0,0,0,0.40692371100000002,-5.7897509180000002,265.99131690899998,358.22853134500002,12,0]
["Stainless Steel - Process","ss_mov_eq_in",832.02956450362501,{"$f":"tank_valve_size","v":1.5},"ss_mov_eq",0,0,0,0,0,0,0.41281628100000001,48.632015991000003,-28.440307282999999,763.87473450000005,48.1,1]
["Cast Iron - Process","ci_mov_eq_in","contact vendor",{"$f":"tank_valve_size","v":1.5},"ci_mov_eq",0,0,0,0,0,0,5.8338184000000001E-2,9.3523735259999992,342.65330958800001,523.16138256099998,48.1,2]
["Polypropylene/PVC - Air","pp_mov_eq_air",745.56193466762488,{"$f":"air_valve_size","v":1.5},{"$f":"IF(D131>12,\"pp_mov_eq_large\",\"pp_mov_eq_small\")","v":"pp_mov_eq_small"},0,0,0,0,0,0,0.40692371100000002,-5.7897509180000002,265.99131690899998,358.22853134500002,12,0]
["Stainless Steel - Air","ss_mov_eq_air",832.02956450362501,{"$f":"air_valve_size","v":1.5},"ss_mov_eq",0,0,0,0,0,0,0.41281628100000001,48.632015991000003,-28.440307282999999,763.87473450000005,48.1,1]
["Cast Iron - Air","ci_mov_eq_air","contact vendor",{"$f":"air_valve_size","v":1.5},"ci_mov_eq",0,0,0,0,0,0,5.8338184000000001E-2,9.3523735259999992,342.65330958800001,523.16138256099998,48.1,2]
["Polypropylene/PVC - Hydrochloric Acid","pp_mov_eq_hcl",489.82761753387501,{"$f":"HCl_valve_size","v":0.5},{"$f":"IF(D134>12,\"pp_mov_eq_large\",\"pp_mov_eq_small\")","v":"pp_mov_eq_small"},0,0,0,0,0,0,0.40692371100000002,-5.7897509180000002,265.99131690899998,358.22853134500002,12,0]
["Stainless Steel - Hydrochloric Acid","ss_mov_eq_hcl","contact vendor",{"$f":"HCl_valve_size","v":0.5},"ss_mov_eq",0,0,0,0,0,0,0.41281628100000001,48.632015991000003,-28.440307282999999,763.87473450000005,48.1,1]
["Polypropylene/PVC - Sodium Hydroxide","pp_mov_eq_naoh",489.82761753387501,{"$f":"NaOH_valve_size","v":0.5},{"$f":"IF(D136>12,\"pp_mov_eq_large\",\"pp_mov_eq_small\")","v":"pp_mov_eq_small"},0,0,0,0,0,0,0.40692371100000002,-5.7897509180000002,265.99131690899998,358.22853134500002,12,0]
["Stainless Steel - Sodium Hydroxide","ss_mov_eq_naoh","contact vendor",{"$f":"NaOH_valve_size","v":0.5},"ss_mov_eq",0,0,0,0,0,0,0.41281628100000001,48.632015991000003,-28.440307282999999,763.87473450000005,48.1,1]
["Polypropylene/PVC - Corrosion Chemical","pp_mov_eq_cc",489.82761753387501,{"$f":"cc_valve_size","v":0.5},{"$f":"IF(D138>12,\"pp_mov_eq_large\",\"pp_mov_eq_small\")","v":"pp_mov_eq_small"},0,0,0,0,0,0,0.40692371100000002,-5.7897509180000002,265.99131690899998,358.22853134500002,12,0]
["Stainless Steel - Corrosion Chemical","ss_mov_eq_cc","contact vendor",{"$f":"cc_valve_size","v":0.5},"ss_mov_eq",0,0,0,0,0,0,0.41281628100000001,48.632015991000003,-28.440307282999999,763.87473450000005,48.1,1]
["Polypropylene/PVC - Bypass","pp_mov_eq_bp",0,{"$f":"bypass_valve_size","v":0},{"$f":"IF(D140>12,\"pp_mov_eq_large\",\"pp_mov_eq_small\")","v":"pp_mov_eq_small"},0,0,0,0,0,0,0.40692371100000002,-5.7897509180000002,265.99131690899998,358.22853134500002,12,0]
["Stainless Steel - Bypass","ss_mov_eq_bp",0,{"$f":"bypass_valve_size","v":0},"ss_mov_eq",0,0,0,0,0,0,0.41281628100000001,48.632015991000003,-28.440307282999999,763.87473450000005,48.1,1]
["Cast Iron - Bypass","ci_mov_eq_bp",0,{"$f":"bypass_valve_size","v":0},"ci_mov_eq",0,0,0,0,0,0,5.8338184000000001E-2,9.3523735259999992,342.65330958800001,523.16138256099998,48.1,2]
["Manual"]
["Polypropylene/PVC - Inlet and Outlet","pp_man_eq",{"$f":"IF(D144=0,0,IF(OR(D144>P144,D144<Q144),\"contact vendor\",F144*D144^G144+H144*LN(D144)+I144+J144*EXP(K144*D144)+L144*D144^3+M144*D144^2+N144*D144+O144))","v":189.57344279487501},{"$f":"in_valve_size","v":1.5},{"$f":"IF(D144>12,\"pp_man_eq_large\",\"pp_man_eq_small\")","v":"pp_man_eq_small"},{"$f":"VLOOKUP($E144,eq_table_cl,F$4,FALSE)","v":0},0,0,0,0,0,1.9387218310000001,-19.945848446999999,150.24492101800001,2.541034094,12,0]
["Stainless Steel - Inlet and Outlet","ss_man_eq",686.27523337599996,{"$f":"in_valve_size","v":1.5},"ss_man_eq",0,0,0,0,0,0,0,27.469782389999999,290.65107808900001,188.491605865,48.1,0]
["Cast Iron - Inlet and Outlet","ci_bfv_eq","contact vendor",{"$f":"in_valve_size","v":1.5},{"$f":"IF(D146>12,\"ci_bfv_eq_large\",\"ci_bfv_eq_small\")","v":"ci_bfv_eq_small"},0,0,0,0,0,0,1.3628861860000001,-10.479854038999999,178.42522374399999,-113.374587944,12,2]
["Polypropylene/PVC - Process","pp_man_eq_in",189.57344279487501,{"$f":"tank_valve_size","v":1.5},{"$f":"IF(D147>12,\"pp_man_eq_large\",\"pp_man_eq_small\")","v":"pp_man_eq_small"},0,0,0,0,0,0,1.9387218310000001,-19.945848446999999,150.24492101800001,2.541034094,12,0]
["Stainless Steel - Process","ss_man_eq_in",686.27523337599996,{"$f":"tank_valve_size","v":1.5},"ss_man_eq",0,0,0,0,0,0,0,27.469782389999999,290.65107808900001,188.491605865,48.1,0]
["Cast Iron - Process","ci_man_eq_in","contact vendor",{"$f":"tank_valve_size","v":1.5},{"$f":"IF(D149>12,\"ci_bfv_eq_large\",\"ci_bfv_eq_small\")","v":"ci_bfv_eq_small"},0,0,0,0,0,0,1.3628861860000001,-10.479854038999999,178.42522374399999,-113.374587944,12,2]
["Polypropylene/PVC - Air","pp_man_eq_air",189.57344279487501,{"$f":"air_valve_size","v":1.5},{"$f":"IF(D150>12,\"pp_man_eq_large\",\"pp_man_eq_small\")","v":"pp_man_eq_small"},0,0,0,0,0,0,1.9387218310000001,-19.945848446999999,150.24492101800001,2.541034094,12,0]
["Stainless Steel - Air","ss_man_eq_air",686.27523337599996,{"$f":"air_valve_size","v":1.5},"ss_man_eq",0,0,0,0,0,0,0,27.469782389999999,290.65107808900001,188.491605865,48.1,0]
["Cast Iron - Air","ci_man_eq_air","contact vendor",{"$f":"air_valve_size","v":1.5},{"$f":"IF(D152>12,\"ci_bfv_eq_large\",\"ci_bfv_eq_small\")","v":"ci_bfv_eq_small"},0,0,0,0,0,0,1.3628861860000001,-10.479854038999999,178.42522374399999,-113.374587944,12,2]
["Polypropylene/PVC - Hydrochloric Acid","pp_man_eq_hcl",72.919372720125011,{"$f":"HCl_valve_size","v":0.5},{"$f":"IF(D153>12,\"pp_man_eq_large\",\"pp_man_eq_small\")","v":"pp_man_eq_small"},0,0,0,0,0,0,1.9387218310000001,-19.945848446999999,150.24492101800001,2.541034094,12,0]
["Stainless Steel - Hydrochloric Acid","ss_man_eq_hcl",340.684590507,{"$f":"HCl_valve_size","v":0.5},"ss_man_eq",{"$f":"VLOOKUP($E154,eq_table_cl,F$4,FALSE)","v":0},0,0,0,0,0,0,27.469782389999999,290.65107808900001,188.491605865,48.1,0]
["Polypropylene/PVC - Sodium Hydroxide","pp_man_eq_naoh",72.919372720125011,{"$f":"NaOH_valve_size","v":0.5},{"$f":"IF(D155>12,\"pp_man_eq_large\",\"pp_man_eq_small\")","v":"pp_man_eq_small"},0,0,0,0,0,0,1.9387218310000001,-19.945848446999999,150.24492101800001,2.541034094,12,0]
["Stainless Steel - Sodium Hydroxide","ss_man_eq_naoh",340.684590507,{"$f":"NaOH_valve_size","v":0.5},"ss_man_eq",0,0,0,0,0,0,0,27.469782389999999,290.65107808900001,188.491605865,48.1,0]
["Polypropylene/PVC - Corrosion Chemical","pp_man_eq_cc",72.919372720125011,{"$f":"cc_valve_size","v":0.5},{"$f":"IF(D157>12,\"pp_man_eq_large\",\"pp_man_eq_small\")","v":"pp_man_eq_small"},0,0,0,0,0,0,1.9387218310000001,-19.945848446999999,150.24492101800001,2.541034094,12,0]
["Stainless Steel - Corrosion Chemical","ss_man_eq_cc",340.684590507,{"$f":"cc_valve_size","v":0.5},"ss_man_eq",0,0,0,0,0,0,0,27.469782389999999,290.65107808900001,188.491605865,48.1,0]
["Polypropylene/PVC - Bypass","pp_man_eq_bp",0,{"$f":"bypass_valve_size","v":0},{"$f":"IF(D159>12,\"pp_man_eq_large\",\"pp_man_eq_small\")","v":"pp_man_eq_small"},0,0,0,0,0,0,1.9387218310000001,-19.945848446999999,150.24492101800001,2.541034094,12,0]
["Stainless Steel - Bypass","ss_man_eq_bp",0,{"$f":"bypass_valve_size","v":0},"ss_man_eq",0,0,0,0,0,0,0,27.469782389999999,290.65107808900001,188.491605865,48.1,0]
["Cast Iron - Bypass","ci_man_eq_bp",0,{"$f":"bypass_valve_size","v":0},{"$f":"IF(D161>12,\"ci_bfv_eq_large\",\"ci_bfv_eq_small\")","v":"ci_bfv_eq_small"},0,0,0,0,0,0,1.3628861860000001,-10.479854038999999,178.42522374399999,-113.374587944,12,2]
["Check Valves"]
["Polypropylene/PVC - Hydrochloric Acid","pp_chv_eq_hcl",{"$f":"IF(D163=0,0,IF(OR(D163>P163,D163<Q163),\"contact vendor\",F163*D163^G163+H163*LN(D163)+I163+J163*EXP(K163*D163)+L163*D163^3+M163*D163^2+N163*D163+O163))","v":67.545258479250009},{"$f":"HCl_valve_size","v":0.5},"pp_chv_eq",{"$f":"VLOOKUP($E163,eq_table_cl,F$4,FALSE)","v":0},0,0,0,0,0,0,33.531105975000003,26.083543361,46.120710305000003,12.1,0]
["Stainless Steel - Hydrochloric Acid","ss_chv_eq_hcl",499.04088892537504,{"$f":"HCl_valve_size","v":0.5},"ss_chv_eq",0,0,0,0,0,0,-0.31699134099999998,43.48726241,223.719834875,376.34877980300001,48.1,0]
["Polypropylene/PVC - Sodium Hydroxide","pp_chv_eq_naoh",67.545258479250009,{"$f":"NaOH_valve_size","v":0.5},"pp_chv_eq",0,0,0,0,0,0,0,33.531105975000003,26.083543361,46.120710305000003,12.1,0]
["Stainless Steel - Sodium Hydroxide","ss_chv_eq_naoh",499.04088892537504,{"$f":"NaOH_valve_size","v":0.5},"ss_chv_eq",0,0,0,0,0,0,-0.31699134099999998,43.48726241,223.719834875,376.34877980300001,48.1,0]
["Polypropylene/PVC - Corrosion Chemical","pp_chv_eq_cc",67.545258479250009,{"$f":"cc_valve_size","v":0.5},"pp_chv_eq",0,0,0,0,0,0,0,33.531105975000003,26.083543361,46.120710305000003,12.1,0]
["Stainless Steel - Corrosion Chemical","ss_chv_eq_cc",499.04088892537504,{"$f":"cc_valve_size","v":0.5},"ss_chv_eq",0,0,0,0,0,0,-0.31699134099999998,43.48726241,223.719834875,376.34877980300001,48.1,0]
["Polypropylene/PVC - Inlet and Outlet","pp_chv_eq_in",160.69101379025,{"$f":"in_valve_size","v":1.5},"pp_chv_eq",0,0,0,0,0,0,0,33.531105975000003,26.083543361,46.120710305000003,12.1,0]
["Stainless Steel - Inlet and Outlet","ss_chv_eq_in",808.70502676212504,{"$f":"in_valve_size","v":1.5},"ss_chv_eq",0,0,0,0,0,0,-0.31699134099999998,43.48726241,223.719834875,376.34877980300001,48.1,0]
["Cast Iron - Inlet and Outlet","ci_chv_eq_in","contact vendor",{"$f":"in_valve_size","v":1.5},"ci_chv_eq",0,0,0,0,0,0,0,33.199306028000002,-90.173665755000002,1193.6882856929999,24.1,2]
["Polypropylene/PVC - bypass","pp_chv_eq_bp",0,{"$f":"bypass_valve_size","v":0},"pp_chv_eq",0,0,0,0,0,0,0,33.531105975000003,26.083543361,46.120710305000003,12.1,0]
["Stainless Steel - bypass","ss_chv_eq_bp",0,{"$f":"bypass_valve_size","v":0},"ss_chv_eq",0,0,0,0,0,0,-0.31699134099999998,43.48726241,223.719834875,376.34877980300001,48.1,0]
["Cast Iron - bypass","ci_chv_eq_bp",0,{"$f":"bypass_valve_size","v":0},"ci_chv_eq",0,0,0,0,0,0,0,33.199306028000002,-90.173665755000002,1193.6882856929999,24.1,2]
["Instrumentation"]
["Water Flow Meters"]
["Orifice Plate","op_fm_eq_in",{"$f":"IF(D177=0,0,IF(OR(D177>P177,D177<Q177),\"contact vendor\",F177*D177^G177+H177*LN(D177)+I177+J177*EXP(K177*D177)+L177*D177^3+M177*D177^2+N177*D177+O177))","v":2883.36523860225},{"$f":"in_meter_size","v":1.5},"op_fm_eq",{"$f":"VLOOKUP($E177,eq_table_cl,F$4,FALSE)","v":0},0,0,0,0,0,9.1057871999999998E-2,-4.0270508090000003,342.48079312499999,2378.3975929170001,60.1,0]
["Propeller","prop_fm_eq_in",1902.93784887225,{"$f":"in_meter_size","v":1.5},"prop_fm_eq",0,0,0,0,0,0,0,5.2786609289999999,220.068807612,1560.9576503640001,24.1,0]
["Venturi","ven_fm_eq_in",4021.2751682277503,{"$f":"in_meter_size","v":1.5},"ven_fm_eq",0,0,0,0,0,0,3.6864558500000002,-125.739537402,2199.0905769030001,993.11147353399997,24.1,0]
["Magnetic","mag_fm_eq_in",2619.0838298265321,{"$f":"in_meter_size","v":1.5},"mag_fm_eq",1883.1998253920001,0.81351564399999998,0,0,0,0,0,0,0,0,24.1,0]
["Flow Meters - Process"]
["Orifice Plate","op_fm_eq_proc",{"$f":"IF(D182=0,0,IF(OR(D182>P182,D182<Q182),\"contact vendor\",F182*D182^G182+H182*LN(D182)+I182+J182*EXP(K182*D182)+L182*D182^3+M182*D182^2+N182*D182+O182))","v":2883.36523860225},{"$f":"proc_meter_size","v":1.5},"op_fm_eq",{"$f":"VLOOKUP($E182,eq_table_cl,F$4,FALSE)","v":0},0,0,0,0,0,9.1057871999999998E-2,-4.0270508090000003,342.48079312499999,2378.3975929170001,60.1,0]
["Propeller","prop_fm_eq_proc",1902.93784887225,{"$f":"proc_meter_size","v":1.5},"prop_fm_eq",0,0,0,0,0,0,0,5.2786609289999999,220.068807612,1560.9576503640001,24.1,0]
["Venturi","ven_fm_eq_proc",4021.2751682277503,{"$f":"proc_meter_size","v":1.5},"ven_fm_eq",0,0,0,0,0,0,3.6864558500000002,-125.739537402,2199.0905769030001,993.11147353399997,24.1,0]
["Magnetic","mag_fm_eq_proc",2619.0838298265321,{"$f":"proc_meter_size","v":1.5},"mag_fm_eq",1883.1998253920001,0.81351564399999998,0,0,0,0,0,0,0,0,24.1,0]
["Offgas Pollution Control Equipment"]
["Gas-phase GAC Adsorber","og_gac_eq",{"$f":"IF(D187=0,0,IF(OR(D187>P187,D187<Q187),\"contact vendor\",F187*D187^G187+H187*LN(D187)+I187+J187*EXP(K187*D187)+L187*D187^3+M187*D187^2+N187*D187+O187))","v":0},{"$f":"GAC_bed_size","v":0},"og_gac_eq",{"$f":"VLOOKUP($E187,eq_table_cl,F$4,FALSE)","v":0},0,0,0,0,0,0,-2.0941089999999999E-2,71.129375296000006,7797.0750963609999,1333.4,0]
["Thermal Oxidizer - No Heat Recovery","og_TO_eq",0,{"$f":"TO_size","v":0},"og_TO_eq",0,0,0,0,0,0,3.4E-8,-2.0409149999999999E-3,50.272329773000003,29460.676582273001,25001,0]
["Thermal Oxidizer - Recuperative","og_torec_eq",0,{"$f":"TO_size","v":0},"og_torec_eq",0,0,0,0,0,0,0,2.579245E-3,43.421768045,45080.000667597,7258,0]
["Thermal Oxidizer - Regenerative/Flameless","og_toreg_eq",0,{"$f":"TO_size","v":0},"og_toreg_eq",0,0,0,0,0,0,0,5.6947000000000002E-5,25.163323747,117209.297117258,736001,0]
["Catalytic Oxidizer - No Heat Recovery","og_co_eq",0,{"$f":"CO_size","v":0},"og_co_eq",0,0,0,0,0,0,0,3.0299999999999998E-6,64.998131767000004,24759.712942683,736001,0]
["Catalytic Oxidizer - Recuperative","og_corec_eq",0,{"$f":"CO_size","v":0},"og_corec_eq",0,0,0,0,0,0,0,5.818E-6,76.718877965000004,29216.170819219002,736001,0]
["Catalytic Oxidizer - Regenerative","og_coreg_eq",0,{"$f":"CO_size","v":0},"og_coreg_eq",0,0,0,0,0,0,0,7.2817000000000004E-5,44.374725693000002,71831.378582172998,736001,0]
["Initial GAC charge","gac_eq",0,{"$f":"IF(GAC>P194,P194,GAC)","v":0},"gac_eq",4.1707451390000001,-5.5195527000000001E-2,0,0,0,0,0,0,0,0,40000,0]
["Retrofit Equipment"]
["Replacement Blowers"]
["Centrifugal","r_cent_blow_eq",{"$f":"IF(D197=0,0,IF(OR(D197>P197,D197<Q197),\"contact vendor\",F197*D197^G197+H197*LN(D197)+I197+J197*EXP(K197*D197)+L197*D197^3+M197*D197^2+N197*D197+O197))","v":26735.068392768411},{"$f":"r_Q_Blower","v":58.257262800000007},"cent_blow_eq",{"$f":"VLOOKUP($E197,eq_table_cl,F$4,FALSE)","v":0},0,0,0,0,0,6.4899999999999995E-7,-4.7512379999999996E-3,18.492175183000001,25673.761831055999,3751,0]
["Positive Displacement","r_pd_blow_eq",9610.4740752746129,{"$f":"r_Q_Blower","v":58.257262800000007},"pd_blow_eq",0,0,0,0,0,0,-5.3200000000000005E-7,2.2788219999999998E-3,19.306468887000001,8478.1031167929996,5001,0]
["Additional Packing","no equation"]
["Incremental Aeration Tower Useage (Opportunity Cost)"]
["Stainless Steel","r_ss_shell_eq",{"$f":"IF(D201=0,0,IF(OR(D201>P201,D201<Q201),\"contact vendor\",F201*D201^G201+H201*LN(D201)+I201+J201*EXP(K201*D201)+L201*D201^3+M201*D201^2+N201*D201+O201))","v":26378.308748081439},{"$f":"r_col_vol","v":121.32373803711515},"ss_shell_eq",{"$f":"VLOOKUP($E201,eq_table_cl,F$4,FALSE)","v":0},0,0,0,26169.293386130001,6.5571E-5,0,0,0,0,27025,0]
["Incremental cost","r_ss_shell_inc",{"$f":"IF(r_ss_shell_eq=\"contact vendor\",\"contact vendor\",IF(curve=1,r_ss_shell_eq,VLOOKUP(r_col_vol,ss_shell_cost_cl,3))-OUTPUT!I33)","v":0}]
["Fiberglass","r_fg_shell_eq",{"$f":"IF(D203=0,0,IF(OR(D203>P203,D203<Q203),\"contact vendor\",F203*D203^G203+H203*LN(D203)+I203+J203*EXP(K203*D203)+L203*D203^3+M203*D203^2+N203*D203+O203))","v":23400.996900552374},{"$f":"r_col_vol","v":121.32373803711515},"fg_shell_eq",{"$f":"VLOOKUP($E203,eq_table_cl,F$4,FALSE)","v":0},0,0,0,0,0,0,5.2023E-5,1.2209150280000001,23252.105175613,27025,0]
["Incremental cost","r_fg_shell_inc",{"$f":"IF(r_fg_shell_eq=\"contact vendor\",\"contact vendor\",IF(curve=1,r_fg_shell_eq,VLOOKUP(r_col_vol,fg_shell_cost_cl,3))-OUTPUT!I34)","v":0}]
["Aluminum","r_al_shell_eq",{"$f":"IF(D205=0,0,IF(OR(D205>P205,D205<Q205),\"contact vendor\",F205*D205^G205+H205*LN(D205)+I205+J205*EXP(K205*D205)+L205*D205^3+M205*D205^2+N205*D205+O205))","v":21609.518617549216},{"$f":"r_col_vol","v":121.32373803711515},"al_shell_eq",{"$f":"VLOOKUP($E205,eq_table_cl,F$4,FALSE)","v":0},0,0,0,0,0,-2.0000000000000001E-9,1.23702E-4,1.1827402389999999,21464.206896932999,27025,0]
["Incremental cost","r_al_shell_inc",{"$f":"IF(r_al_shell_eq=\"contact vendor\",\"contact vendor\",IF(curve=1,r_al_shell_eq,VLOOKUP(r_col_vol,al_shell_cost_cl,3))-OUTPUT!I35)","v":0}]
[]
["O&M Chemicals"]
["Virgin GAC","replace_gac_eq",{"$f":"IF(D209=0,0,IF(OR(D209>P209,D209<Q209),\"contact vendor\",F209*D209^G209+H209*LN(D209)+I209+J209*EXP(K209*D209)+L209*D209^3+M209*D209^2+N209*D209+O209))","v":0},{"$f":"IF(GAC_makeup>P209,P209,GAC_makeup)","v":0},"gac_eq",{"$f":"VLOOKUP($E209,eq_table_cl,F$4,FALSE)","v":4.1707451390000001},-5.5195527000000001E-2,0,0,0,0,0,0,0,0,40000,0]
["Off-site GAC regeneration","off_regen_eq",0,{"$f":"IF(regen_yr>P210,P210,regen_yr)","v":0},"off_regen_eq",0,0,0,0,0,0,0,0,0,1.2472694452182116,9990000,0]
["Building Structures and HVAC"]
["Building 1"]
["Low Quality Structure","bldg_lo_eq_1",{"$f":"IF(D213=0,0,IF(OR(D213>P213,D213<Q213),\"contact vendor\",F213*D213^G213+H213*LN(D213)+I213+J213*EXP(K213*D213)+L213*D213^3+M213*D213^2+N213*D213+O213))","v":85.29446520816974},{"$f":"total_fp","v":190},"bldg_lo_eq",{"$f":"VLOOKUP($E213,eq_table_cl,F$4,FALSE)","v":141.837429708},-9.6925793999999996E-2,0,0,0,0,0,0,0,0,200000.1,0]
["Medium Quality Structure","bldg_mid_eq_1",103.96894001521815,{"$f":"total_fp","v":190},"bldg_mid_eq",174.08800506,-9.8240209999999994E-2,0,0,0,0,0,0,0,0,200000.1,0]
["High Quality Structure","bldg_hi_eq_1",152.63771767525961,{"$f":"total_fp","v":190},"bldg_hi_eq",305.59138946299998,-0.13230006499999999,0,0,0,0,0,0,0,0,200000.1,0]
["Heating System"]
["Electric resistance","hvac_elec_eq_1",{"$f":"IF(D217=0,0,IF(OR(D217>P217,D217<Q217),\"contact vendor\",F217*D217^G217+H217*LN(D217)+I217+J217*EXP(K217*D217)+L217*D217^3+M217*D217^2+N217*D217+O217))","v":21787.227072587459},{"$f":"build1_heat_mbh/build1_zones","v":24.288768051263538},"hvac_elec_eq",{"$f":"VLOOKUP($E217,eq_table_cl,F$4,FALSE)","v":0},0,0,0,0,0,-1.55E-6,6.8344249999999999E-3,178.968279069,17436.298333972001,6148.1,0]
["Natural gas non-condensing furnace","hvac_gas_non_eq_1",16477.516439928862,{"$f":"build1_heat_mbh/build1_zones","v":24.288768051263538},"hvac_gas_non_eq",0,0,0,0,0,0,5.2780000000000001E-6,-3.0180885000000001E-2,146.749402831,12930.883644011999,5032.1000000000004,0]
["Natural gas condensing furnace","hvac_gas_eq_1",16477.516439928862,{"$f":"build1_heat_mbh/build1_zones","v":24.288768051263538},"hvac_gas_eq",0,0,0,0,0,0,5.2780000000000001E-6,-3.0180885000000001E-2,146.749402831,12930.883644011999,5032.1000000000004,0]
["Standard efficiency oil furnace","hvac_oil_std_eq_1",23541.820581323656,{"$f":"build1_heat_mbh/build1_zones","v":24.288768051263538},"hvac_oil_std_eq",0,0,0,0,0,0,-2.8550000000000002E-6,1.1743557E-2,114.111369921,20763.308850682999,3350.1,0]
["Mid-efficiency oil furnace","hvac_oil_mid_eq_1",23541.820581323656,{"$f":"build1_heat_mbh/build1_zones","v":24.288768051263538},"hvac_oil_mid_eq",0,0,0,0,0,0,-2.8550000000000002E-6,1.1743557E-2,114.111369921,20763.308850682999,3350.1,0]
["Cooling System"]
["Air conditioning system","hvac_ac_eq_1",{"$f":"IF(D223=0,0,IF(OR(D223>P223,D223<Q223),\"contact vendor\",F223*D223^G223+H223*LN(D223)+I223+J223*EXP(K223*D223)+L223*D223^3+M223*D223^2+N223*D223+O223))","v":1304.3248202210766},{"$f":"build1_cooling_tons/build1_zones","v":0.62823372029894065},"hvac_ac_eq",{"$f":"VLOOKUP($E223,eq_table_cl,F$4,FALSE)","v":2245.661287935},1.168812894,0,0,0,0,0,0,0,0,113.33,0]
["Heat pump","hvac_hp_eq_1",3181.7942390777198,{"$f":"build1_cooling_tons/build1_zones","v":0.62823372029894065},{"$f":"IF(D224>12,\"hvac_hp_eq_large\",\"hvac_hp_eq_small\")","v":"hvac_hp_eq_small"},0,0,0,0,2894.8077582020001,0.15046400200000001,0,0,0,0,12,0]

{"sheet":"Cost Coefficients","index":23,"n_rows":69,"n_cols":17,"rows_kept":69,"cut":false,"hidden":false,"merged":[]}
["Coefficients for Component Cost Equations"]
["This sheet is used internally to calculate component costs using the cost equations method; see model documentation for more details on the development of cost equations"]
[]
[null,"Power: C1*x^C2",null,"Logarithmic: C3*Ln(x) + C4",null,"Exponential: C5*e^(C6*x)",null,"Polynomial: C7*x^3 + C8*x^2 + C9*x + C10",null,null,null,"NOTES"]
["Equation Lookup Name","C1","C2","C3","C4","C5","C6","C7","C8","C9","C10","Pct deviation of fit equation",null,"Last modified","Rsq of fit equation","max size used to gen curve","min size for which curve fits are valid"]
["al_shell_eq",0,0,0,0,0,0,-2.0000000000000001E-9,1.23702E-4,1.1827402389999999,21464.206896932999,1.1679261397373936E-2,null," 2/28/2014 2:53:18 PM",0.99986018993075898,27025,0]
["bldg_hi_eq",305.59138946299998,-0.13230006499999999,0,0,0,0,0,0,0,0,3.989110044513617E-2,null," 2/28/2014 3:27:03 PM",0.95292288207253384,200000.1,0]
["bldg_lo_eq",141.837429708,-9.6925793999999996E-2,0,0,0,0,0,0,0,0,2.5518207619233953E-2,null," 2/28/2014 3:25:26 PM",0.96714729333927962,200000.1,0]
["bldg_mid_eq",174.08800506,-9.8240209999999994E-2,0,0,0,0,0,0,0,0,2.7511361690370221E-2,null," 2/28/2014 3:26:20 PM",0.96388247777821612,200000.1,0]
["cent_blow_eq",0,0,0,0,0,0,6.4899999999999995E-7,-4.7512379999999996E-3,18.492175183000001,25673.761831055999,2.7985327636481552E-2,null," 2/28/2014 1:22:40 PM",0.99279068661244052,3751,0]
["ci_bfv_eq_large",0,0,0,0,0,0,0.58394784300000002,-48.619628491999997,1925.2456175469999,-15139.445321384999,7.4658498787380664E-2,null," 2/28/2014 12:56:11 PM",0.98928393838647588,48.1,14]
["ci_bfv_eq_small",0,0,0,0,0,0,1.3628861860000001,-10.479854038999999,178.42522374399999,-113.374587944,3.9038797504683628E-2,null," 2/28/2014 12:54:58 PM",0.9969451207486022,12,2]
["ci_chv_eq",0,0,0,0,0,0,0,33.199306028000002,-90.173665755000002,1193.6882856929999,6.0424904122570185E-2,null," 2/28/2014 1:01:51 PM",0.99376263357014838,24.1,2]
["ci_mov_eq",0,0,0,0,0,0,5.8338184000000001E-2,9.3523735259999992,342.65330958800001,523.16138256099998,8.080421145576272E-2,null," 2/28/2014 12:47:10 PM",0.99151619653796719,48.1,2]
["cpvc_pipe_eq",0,0,0,0,0,0,-1.4019403E-2,1.3468648089999999,3.5632997450000001,0.51040558599999997,3.4227186916393225E-2,null," 2/28/2014 12:30:51 PM",0.99944128500092855,12.1,0]
["cst_heat_eq",0,0,0,0,0,0,1.0000000000000001E-9,-2.3699000000000001E-5,0.25128345499999999,1358.2848534520001,5.9914501489895765E-2,null," 2/28/2014 12:21:03 PM",0.90663448402639168,30026,0]
["cst_insul_eq",15.454491086000001,0.65029599500000002,0,0,0,0,0,0,0,0,6.3091394868728265E-2,null," 2/28/2014 12:19:32 PM",0.98938571208481552,30026,0]
["di_pipe_eq",0,0,0,0,0,0,5.5523166999999998E-2,-1.7343722210000001,21.872521642999999,-33.123758789,0.15447489871354192,null," 2/28/2014 12:24:26 PM",0.9850809621189619,48.1,4]
["fg_cst_eq",0,0,0,0,0,0,4.0000000000000002E-9,-1.5474099999999999E-4,3.8820459029999999,12523.192567737,7.4971794736841374E-2,null," 2/28/2014 12:10:37 PM",0.98834571523581416,30026,550]
["fg_shell_eq",0,0,0,0,0,0,0,5.2023E-5,1.2209150280000001,23252.105175613,0.14355598878452394,null," 2/28/2014 2:50:08 PM",0.93719542546731094,27025,0]
["gac_eq",4.1707451390000001,-5.5195527000000001E-2,0,0,0,0,0,0,0,0,2.2361902340761318E-2,null," 2/28/2014 1:53:51 PM",0.93844838279596277,40000,0]
["hvac_ac_eq",2245.661287935,1.168812894,0,0,0,0,0,0,0,0,4.4402508043847551E-2,null," 2/28/2014 3:27:59 PM",0.9940592470216647,113.33,0]
["hvac_elec_eq",0,0,0,0,0,0,-1.55E-6,6.8344249999999999E-3,178.968279069,17436.298333972001,0.13333290440520482,null," 2/28/2014 3:29:31 PM",0.9949466774792548,6148.1,0]
["hvac_gas_eq",0,0,0,0,0,0,5.2780000000000001E-6,-3.0180885000000001E-2,146.749402831,12930.883644011999,3.6704420510535365E-2,null," 2/28/2014 3:30:26 PM",0.99967235385448316,5032.1000000000004,0]
["hvac_gas_non_eq",0,0,0,0,0,0,5.2780000000000001E-6,-3.0180885000000001E-2,146.749402831,12930.883644011999,3.6704420510535365E-2,null," 2/28/2014 3:30:02 PM",0.99967235385448316,5032.1000000000004,0]
["hvac_hp_eq_large",0,0,0,0,0,0,-0.26906599399999998,21.986061686999999,601.74617541600003,7194.822302349,5.1101003497618848E-2,null," 2/28/2014 3:34:22 PM",0.98919781731651701,50.01,12]
["hvac_hp_eq_small",0,0,0,0,2894.8077582020001,0.15046400200000001,0,0,0,0,8.9476801358508065E-2,null," 2/28/2014 3:32:33 PM",0.97324811259994892,12,0]
["hvac_oil_mid_eq",0,0,0,0,0,0,-2.8550000000000002E-6,1.1743557E-2,114.111369921,20763.308850682999,1.1085221247812933E-2,null," 2/28/2014 3:31:25 PM",0.99952152286092288,3350.1,0]
["hvac_oil_std_eq",0,0,0,0,0,0,-2.8550000000000002E-6,1.1743557E-2,114.111369921,20763.308850682999,1.1085221247812933E-2,null," 2/28/2014 3:30:50 PM",0.99952152286092288,3350.1,0]
["imp_mix_eq",5562.6010364479998,0.48893690899999998,0,0,0,0,0,0,0,0,9.3240718393375929E-2,null," 2/28/2014 1:27:47 PM",0.92441144470657233,20.100000000000001,0]
["mag_fm_eq",1883.1998253920001,0.81351564399999998,0,0,0,0,0,0,0,0,0.13671247655781144,null," 2/28/2014 1:43:08 PM",0.967996389152466,24.1,0]
["mount_mix_eq",0,0,0,0,0,0,89.521005114000005,-757.60052354499999,2275.3895989500002,366.29202327199999,7.604542811398507E-2,null," 2/28/2014 1:25:10 PM",0.97403800696233733,2,0]
["off_regen_eq",0,0,0,0,0,0,0,0,0,1.2472694452182116,0,null," 2/28/2014 1:55:33 PM",1,9990000,0]
["og_co_eq",0,0,0,0,0,0,0,3.0299999999999998E-6,64.998131767000004,24759.712942683,8.397837263182871E-2,null," 2/28/2014 3:02:53 PM",0.99798031464609249,736001,0]
["og_corec_eq",0,0,0,0,0,0,0,5.818E-6,76.718877965000004,29216.170819219002,0.10360066411553776,null," 2/28/2014 3:05:11 PM",0.99744378358569796,736001,0]
["og_coreg_eq",0,0,0,0,0,0,0,7.2817000000000004E-5,44.374725693000002,71831.378582172998,0.29102171648007019,null," 2/28/2014 3:05:38 PM",0.9680548325863273,736001,0]
["og_gac_eq",0,0,0,0,0,0,0,-2.0941089999999999E-2,71.129375296000006,7797.0750963609999,0.14139570980283286,null," 2/28/2014 3:01:36 PM",0.95524832955240158,1333.4,0]
["og_to_eq",0,0,0,0,0,0,3.4E-8,-2.0409149999999999E-3,50.272329773000003,29460.676582273001,0.11456226592670808,null," 2/28/2014 3:01:53 PM",0.94942337953788636,25001,0]
["og_torec_eq",0,0,0,0,0,0,0,2.579245E-3,43.421768045,45080.000667597,9.6942436098629292E-2,null," 2/28/2014 3:02:16 PM",0.98677137313316532,7258,0]
["og_toreg_eq",0,0,0,0,0,0,0,5.6947000000000002E-5,25.163323747,117209.297117258,0.37408100417176793,null," 2/28/2014 3:02:34 PM",0.9734796884896364,736001,0]
["op_fm_eq",0,0,0,0,0,0,9.1057871999999998E-2,-4.0270508090000003,342.48079312499999,2378.3975929170001,4.64643922434314E-2,null," 2/28/2014 1:41:35 PM",0.99935901908814218,60.1,0]
["pd_blow_eq",0,0,0,0,0,0,-5.3200000000000005E-7,2.2788219999999998E-3,19.306468887000001,8478.1031167929996,0.21955503837120305,null," 2/28/2014 1:23:01 PM",0.97968713653170125,5001,0]
["pl_cst_eq",0,0,0,0,0,0,0,9.4213000000000001E-5,3.3366652989999999,740.65179689399997,0.28214176657054246,null," 2/28/2014 12:07:41 PM",0.98270897705176385,6551,0]
["pl_ldist_eq",6608.3641086629996,0.41022479699999997,0,0,0,0,0,0,0,0,0.10507829030311809,null," 2/28/2014 2:58:07 PM",0.9246369215852982,7.31,0]
["pl_redist_eq",0,0,0,0,0,0,3587.9775931109998,-12103.954586251,15881.856984664,1103.7403009950001,3.5016174438703071E-2,null," 2/28/2014 3:00:37 PM",0.99889330408309751,1.81,0]
["pl_splate_eq",0,0,0,0,0,0,3.93052673,17.121631528000002,3020.098756073,1503.9838347309999,1.9059245334167245E-2,null," 2/28/2014 2:56:35 PM",0.99993499380372552,7.31,0]
["pp_chv_eq",0,0,0,0,0,0,0,33.531105975000003,26.083543361,46.120710305000003,0.23438942187797995,null," 2/28/2014 12:59:31 PM",0.92639180178010594,12.1,0]
["pp_man_eq_large",0,0,0,0,0,0,19.882153953,-1146.831962345,23192.989920378001,-147544.09060752401,1.576978968240891E-2,null," 2/28/2014 12:53:54 PM",0.99827946753435137,24.1,14]
["pp_man_eq_small",0,0,0,0,0,0,1.9387218310000001,-19.945848446999999,150.24492101800001,2.541034094,0.14096804214986808,null," 2/28/2014 12:52:42 PM",0.98684697009623445,12,0]
["pp_mov_eq_large",0,0,0,0,0,0,11.421377374,-682.86686753499998,14977.677661150999,-97709.091392994,2.4182811076595433E-2,null," 2/28/2014 12:42:55 PM",0.99447907181680995,24.1,14]
["pp_mov_eq_small",0,0,0,0,0,0,0.40692371100000002,-5.7897509180000002,265.99131690899998,358.22853134500002,0.1372694210053057,null," 2/28/2014 12:41:06 PM",0.93229982637360787,12,0]
["prop_fm_eq",0,0,0,0,0,0,0,5.2786609289999999,220.068807612,1560.9576503640001,6.2135830929144494E-2,null," 2/28/2014 1:42:41 PM",0.99475222815811359,24.1,0]
["pump_eq",0,0,0,0,0,0,0,-4.3557200000000001E-4,11.502794618999999,5810.6739814829998,0.10025236182371784,null," 2/28/2014 1:02:48 PM",0.93103410988941426,10001,0]
["pvc_empump_eq",1199.37082994,0.19803047700000001,0,0,0,0,0,0,0,0,0.13522737282406952,null," 2/28/2014 1:06:15 PM",0.8012394726597013,25.01,0]
["pvc_mmpump_eq",0,0,0,0,0,0,-1.8689999999999999E-5,2.0423927000000001E-2,11.878140002,3416.2655497440001,9.3844653336211795E-2,null," 2/28/2014 1:04:03 PM",0.9773609837324172,760.1,0]
["pvc_pipe_eq",0,0,0,0,0,0,6.5904500000000003E-4,6.5264830999999995E-2,1.125738049,0.44280968500000001,0.20628754213566655,null," 2/28/2014 12:32:03 PM",0.99439290597599517,48.1,0]
["ss_chv_eq",0,0,0,0,0,0,-0.31699134099999998,43.48726241,223.719834875,376.34877980300001,0.26180254533489922,null," 2/28/2014 12:57:00 PM",0.97465688558801655,48.1,0]
["ss_cst_eq",0,0,0,0,0,0,0,-8.0848999999999998E-5,9.2894152089999995,23922.103178615998,0.11832274573123815,null," 2/28/2014 12:12:39 PM",0.97088443445328276,27079,187]
["ss_empump_eq",0,0,0,0,0,0,0,-0.50159228600000005,103.73496039299999,1220.9469661359999,0.14041803711843359,null," 2/28/2014 1:07:20 PM",0.89071778937953527,25.01,0]
["ss_ldist_eq",0,0,0,0,0,0,124.253814613,-1485.365130034,6785.1992920069997,1131.4839368729999,8.4010838770431431E-2,null," 2/28/2014 2:57:05 PM",0.99587363711644517,7.31,0]
["ss_man_eq",0,0,0,0,0,0,0,27.469782389999999,290.65107808900001,188.491605865,0.29131990886725923,null," 2/28/2014 12:50:10 PM",0.86747126243337391,48.1,0]
["ss_mmpump_eq",0,0,0,0,0,0,2.40249E-4,-9.6169726999999997E-2,26.430899222000001,3817.6509033560001,0.13491462492394254,null," 2/28/2014 1:05:03 PM",0.98906127384085618,600.01,0]
["ss_mov_eq",0,0,0,0,0,0,0.41281628100000001,48.632015991000003,-28.440307282999999,763.87473450000005,0.20222590905716306,null," 2/28/2014 12:44:14 PM",0.97989671936978151,48.1,1]
["ss_pipe_eq",0,0,0,0,0,0,1.25271E-3,-8.4998590000000002E-3,32.766712771999998,1.1730196939999999,0.15017241285030669,null," 2/28/2014 12:33:00 PM",0.97732326849912121,48.1,0]
["ss_redist_eq",0,0,0,0,0,0,140.26721593299999,-1474.6345473480001,5782.2602772890004,1377.520907933,0.13562775212968706,null," 2/28/2014 3:00:04 PM",0.98244278442188793,7.31,0]
["ss_shell_eq",0,0,0,0,26169.293386130001,6.5571E-5,0,0,0,0,0.23782203855315115,null," 2/28/2014 2:52:02 PM",0.82845855816995007,27025,0]
["ss_splate_eq",0,0,0,0,0,0,45.700626565999997,-534.36125093199996,2799.670875407,690.99029812399999,4.1790480770598597E-2,null," 2/28/2014 2:54:38 PM",0.99732664493530321,7.31,0]
["st_pipe_eq",0,0,0,0,0,0,3.0934449999999998E-3,-0.42192453099999999,21.746769,-6.8449443480000003,0.18184340275336211,null," 2/28/2014 12:33:59 PM",0.87410508957120225,60.1,1]
["ven_fm_eq",0,0,0,0,0,0,3.6864558500000002,-125.739537402,2199.0905769030001,993.11147353399997,7.70360660548597E-2,null," 2/28/2014 1:42:17 PM",0.99588755292039921,24.1,0]

{"sheet":"Cost Data","index":24,"n_rows":1409,"n_cols":7,"rows_kept":1409,"cut":false,"hidden":false,"merged":[]}
["Cost Data"]
["This sheet is used internally and contains component cost data extracted from the central cost database"]
["To maintain vendor confidentiality, the central cost database itself is not provided here"]
[]
["bls1072","Aluminum Tower- Shell only"]
[25,"Size needed (gal)","Size selected (gal)","Avg. Unit Cost","Useful Life (large)","Useful Life (small)"]
["al_shell_cost_cl",0,564,21876.673498382283,25,20]
[null,565,1903,24688.520193007269,25,20]
[null,1904,6755,33964.623286587608,25,20]
[null,6756,17295,66630.050961250774,25,20]
[null,17296,21890,81453.002545922689,25,20]
[null,21981,27024,95741.384081147655,25,20]
[null,27025,"contact vendor","contact vendor",25,20]
[]
[]
["bls118","Alarms (High/Low Pressure Alarms, Level Switch/Alarms, Low Alarms)"]
[43,null,null,"Unit Cost","Useful Life (large)","Useful Life (small)"]
["alarm_cost_cl",0,0,644.29028036571617,15,14]
[]
[]
["BCI","Backfill and Compaction"]
[3,null,null,"Avg. Unit Cost (per cy)","Useful Life (large)","Useful Life (small)"]
["backfill_cost_cl",0,0,13.04,"N/A","N/A"]
[]
[]
["CCI","Pipe bedding costs (crushed stone and sand)"]
[2,null,null,"Avg. Unit Cost (per day)","Useful Life (large)","Useful Life (small)"]
["bedding_cost_cl",0,0,49.8,"N/A","N/A"]
[]
[]
["bore_rig_cost",0,0,2675,"N/A","N/A"]
[null,"Borings, cased borings in earth, w/samples, 2.5\" dia",null,"Avg. Unit Cost (per lf)","Useful Life (large)","Useful Life (small)"]
["bore_cost_cl",0,0,72,"N/A","N/A"]
[]
[]
["stake_out_cost",0,0,1275,"N/A","N/A"]
[null,"Borings, drawings showing boring details",null,"Avg. Unit Cost (per job)","Useful Life (large)","Useful Life (small)"]
["bore_draw_cost_cl",0,0,425,"N/A","N/A"]
[]
[]
["bore_report_cost",0,0,970,"N/A","N/A"]
[null,"Borings, mobilization and demobilization, minimum",null,"Avg. Unit Cost","Useful Life (large)","Useful Life (small)"]
["bore_mob_cost_cl",0,0,670,"N/A","N/A"]
[]
[]
["bore_draw_cost",0,0,425,"N/A","N/A"]
[null,"Borings, report and recommendations from P.E.",null,"Avg. Unit Cost (per job)","Useful Life (large)","Useful Life (small)"]
["bore_report_cost_cl",0,0,970,"N/A","N/A"]
[]
[]
["bore_mob_cost",0,0,670,"N/A","N/A"]
[null,"Borings, drill rig and crew with truck mounted auger",null,"Avg. Unit Cost (per day)","Useful Life (large)","Useful Life (small)"]
["bore_rig_cost_cl",0,0,2675,"N/A","N/A"]
[]
[]
["bls11470145","Centrifugal Blowers"]
[34,"Size needed (cfm)","Size selected (cfm)","Avg. Unit Cost","Useful Life (large)","Useful Life (small)"]
["cent_blow_cost_cl",0,40,26443.025162773629,25,20]
[null,41,70,26805.521810527025,25,20]
[null,71,290,29682.546877264977,25,20]
[null,291,500,35152.759940335673,25,20]
[null,501,710,37740.206179704124,25,20]
[null,711,860,38583.925052536622,25,20]
[null,861,1000,39557.110053372329,25,20]
[null,1001,2500,50141.435097808469,25,20]
[null,2501,3750,65423.441724042168,25,20]
[null,3751,5000,79281.946382472481,25,20]
[null,3751,"contact vendor","contact vendor",25,20]
[]
[]
["bls061","Chemical Costs"]
[12,"Chemical","Units","Avg. Unit Cost","Useful Life (large)","Useful Life (small)"]
["chem_cost_cl","Acetic Acid","lb",0.74735615440640935,"N/A","N/A"]
[null,"Aluminum Sulfate (alum)","ton",372.06370056497178,"N/A","N/A"]
[null,"Ammonium Chloride","lb",1.2556315007429422,"N/A","N/A"]
[null,"Antiscalant - Basic","lb",2.1810185745416084,"N/A","N/A"]
[null,"Antiscalant - Premium","lb",3.0526651337869426,"N/A","N/A"]
[null,"Calcium Hydroxide (Lime)","lb",0.70195475935164953,"N/A","N/A"]
[null,"Calcium Hypochlorite","lb",1.2890976723526271,"N/A","N/A"]
[null,"Calcium Oxide (Quicklime)","ton",251.81258501557232,"N/A","N/A"]
[null,"Ethanol","gal",4.0664967225054625,"N/A","N/A"]
[null,"Ferric Chloride","lb",1.0994919648741284,"N/A","N/A"]
[null,"Ferric Sulfate","lb",0.94071995974265643,"N/A","N/A"]
[null,"Ferrous Sulfate","lb",0.72594928525585289,"N/A","N/A"]
[null,"Hydrochloric Acid","lb",0.46433414536722661,"N/A","N/A"]
[null,"Hydrogen Peroxide","lb",1.0945587012445879,"N/A","N/A"]
[null,"Liquid Oxygen","ton",2029.8655334318059,"N/A","N/A"]
[null,"Membrane Cleaner - High pH Detergent","gal",37.354374565278526,"N/A","N/A"]
[null,"Membrane Cleaner - Low pH Sulfate Control","gal",32.545335604239568,"N/A","N/A"]
[null,"Phosphoric Acid","lb",6.5943190094683177E-2,"N/A","N/A"]
[null,"Polyaluminum Chloride","lb",0.76491976423923491,"N/A","N/A"]
[null,"Polymers","lb",0.99938120710506118,"N/A","N/A"]
[null,"Potassium Permanganate","lb",5.2721131397127756,"N/A","N/A"]
[null,"Sodium Bicarbonate","lb",0.86074112202931286,"N/A","N/A"]
[null,"Sodium Bisulfite","lb",2.2955381387975389,"N/A","N/A"]
[null,"Sodium Carbonate (soda ash)","lb",0.16489767943358119,"N/A","N/A"]
[null,"Sodium Chloride","lb",8.6911958568738235E-2,"N/A","N/A"]
[null,"Sodium Chlorite 25.0% Solution","lb",0.73302388143760799,"N/A","N/A"]
[null,"Sodium Chlorite 7.5% Solution","lb",0.41825309757256823,"N/A","N/A"]
[null,"Sodium Hexametaphosphate","lb",2.3467303894317206,"N/A","N/A"]
[null,"Sodium Hydroxide","lb",0.67588855543052917,"N/A","N/A"]
[null,"Sodium Hypochlorite","gal",2.2591976423923494,"N/A","N/A"]
[null,"Sulfuric Acid","lb",0.1819325423728814,"N/A","N/A"]
[null,"Tetrasodium Polyphosphate","lb",22.254297564684496,"N/A","N/A"]
[]
[]
["bls1149","Cast Iron Manual Valves"]
[36,"Size needed (in. diam)","Size selected (in. diam)","Avg. Unit Cost","Useful Life (large)","Useful Life (small)"]
["ci_bfv_cost_cl",0,2,215.50495072294717,25,20]
[null,2.1,2.5,279.78255564376138,25,20]
[null,2.6,3,370.17273270137002,25,20]
[null,3.1,4,513.90936644663668,25,20]
[null,4.0999999999999996,6,930.32643926731271,25,20]
[null,6.1,8,1251.3711936661439,25,20]
[null,8.1,10,2074.6484496344196,25,20]
[null,10.1,12,2855.8815215022632,25,20]
[null,12.1,14,4073.1360178241121,25,20]
[null,14.1,16,5241.883859897107,25,20]
[null,16.100000000000001,18,6766.1477743851528,25,20]
[null,18.100000000000001,20,9014.4152651720669,25,20]
[null,20.100000000000001,24,12989.738149268733,25,20]
[null,24.1,30,13594.342668936884,25,20]
[null,30.1,48,30095.964357042103,25,20]
[null,48.1,"contact vendor","contact vendor",25,20]
[]
[]
["bls1149","Cast Iron Check Valves"]
[36,"Size needed (in. diam)","Size selected (in. diam)","Avg. Unit Cost","Useful Life (large)","Useful Life (small)"]
["ci_chv_cost_cl",0,4,1350,25,20]
[null,4.0999999999999996,6,1825,25,20]
[null,6.1,8,2850,25,20]
[null,8.1,12,4550,25,20]
[null,12.1,16,7750,25,20]
[null,16.100000000000001,18,11300,25,20]
[null,18.100000000000001,24,18400,25,20]
[null,24.1,"contact vendor","contact vendor",25,20]
[]
[]
["bls1149","Cast Iron Motor/Air Operated Valves (on/off)"]
[36,"Size needed (in. diam)","Size selected (in. diam)","Avg. Unit Cost","Useful Life (large)","Useful Life (small)"]
["ci_mov_cost_cl",0,2,1219.1164598257369,25,20]
[null,2.1,2.5,1512.9970396507504,25,20]
[null,2.6,3,1626.459247781906,25,20]
[null,3.1,4,2036.4791167138344,25,20]
[null,4.0999999999999996,6,2939.3846820426734,25,20]
[null,6.1,8,3516.0856131433552,25,20]
[null,8.1,10,5235.8643008252802,25,20]
[null,10.1,12,6945.3328139819341,25,20]
[null,12.1,14,7459.4834921227566,25,20]
[null,14.1,16,7882.6879335094109,25,20]
[null,16.100000000000001,18,9292.1759133828964,25,20]
[null,18.100000000000001,20,13658.903076279774,25,20]
[null,20.100000000000001,24,16688.186319188848,25,20]
[null,24.1,30,18610.963289358395,25,20]
[null,30.1,48,46180.380340663978,25,20]
[null,48.1,"contact vendor","contact vendor",25,20]
[]
[]
["BCI","Concrete for Basins"]
[3,null,null,"Avg. Unit Cost (per cy)","Useful Life (large)","Useful Life (small)"]
["conc_basin_cost_cl",0,0,544.24237500000015,40,37]
[]
[]
["BCI","Concrete Pad"]
[3,null,null,"Avg. Unit Cost (per cy)","Useful Life (large)","Useful Life (small)"]
["conc_pad_cost_cl",0,0,586.52146912500018,40,37]
[]
[]
["bls07210603","CPVC Piping"]
[17,"Size needed (in. diam)","Size selected (in. diam)","Avg. Unit Cost ($/lf)","Useful Life (large)","Useful Life (small)"]
["cpvc_pipe_cost_cl",0,0.5,2.7146265057623875,22,17]
[null,0.6,0.75,3.6762834902518904,22,17]
[null,0.76,1,5.3768255786473533,22,17]
[null,1.1000000000000001,1.25,7.475536045525061,22,17]
[null,1.26,1.5,9.042842116929048,22,17]
[null,1.6,2,12.5403270939973,22,17]
[null,2.1,3,22.986579391986549,22,17]
[null,3.1,4,36.461840431965911,22,17]
[null,4.0999999999999996,6,64.683061070040381,22,17]
[null,6.1,8,108.09534136455892,22,17]
[null,8.1,10,161.00312599256435,22,17]
[null,10.1,12,211.02896888187766,22,17]
[null,12.1,"contact vendor","contact vendor",22,17]
[]
[]
["bls106","Heat Tracing for Storage Tanks"]
[24,"Size Needed (gal)","Size Selected (gal)","Avg. Unit Cost","Useful Life (large)","Useful Life (small)"]
["cst_heat_cost_cl",0,40,1353,10,7]
[null,41,60,1353,10,7]
[null,61,80,1353,10,7]
[null,81,120,1353,10,7]
[null,121,140,1353,10,7]
[null,141,175,1353,10,7]
[null,176,200,1353,10,7]
[null,201,250,1353,10,7]
[null,251,300,1353,10,7]
[null,301,400,1558,10,7]
[null,401,550,1722.5,10,7]
[null,551,625,1558,10,7]
[null,626,700,1584,10,7]
[null,701,850,1645,10,7]
[null,851,950,1645,10,7]
[null,951,1000,1645,10,7]
[null,1001,1100,1645,10,7]
[null,1101,1200,1645,10,7]
[null,1201,1500,1700,10,7]
[null,1501,1850,1700,10,7]
[null,1851,2000,1700,10,7]
[null,2001,2050,1700,10,7]
[null,2051,2400,1919,10,7]
[null,2401,2500,2094.5,10,7]
[null,2501,2900,1945,10,7]
[null,2901,3000,1945,10,7]
[null,3001,4000,1945,10,7]
[null,4001,4100,1945,10,7]
[null,4101,4200,1945,10,7]
[null,4201,5000,2595,10,7]
[null,5001,5200,1945,10,7]
[null,5201,5500,2176,10,7]
[null,5501,5600,2176,10,7]
[null,5601,6500,2254,10,7]
[null,6501,6510,2254,10,7]
[null,6511,7300,2330,10,7]
[null,7301,8000,2549,10,7]
[null,8001,8400,2549,10,7]
[null,8401,10000,2549,10,7]
[null,10001,10500,3054,10,7]
[null,10501,12000,2639,10,7]
[null,12001,"contact vendor","contact vendor",10,7]
[]
[]
["bls106","Insulation for Storage Tanks"]
[24,"Size Needed (gal)","Size Selected (gal)","Avg. Unit Cost","Useful Life (large)","Useful Life (small)"]
["cst_insul_cost_cl",0,40,174,10,7]
[null,41,60,223,10,7]
[null,61,80,268,10,7]
[null,81,120,349,10,7]
[null,121,140,384,10,7]
[null,141,175,424,10,7]
[null,176,200,467,10,7]
[null,201,250,552,10,7]
[null,251,300,668,10,7]
[null,301,500,772,10,7]
[null,501,550,1045,10,7]
[null,551,625,992,10,7]
[null,626,700,992,10,7]
[null,701,850,1310,10,7]
[null,851,950,1336,10,7]
[null,951,1000,1336,10,7]
[null,1001,1100,1393,10,7]
[null,1101,1200,1544,10,7]
[null,1201,1500,1876,10,7]
[null,1501,1850,2145,10,7]
[null,1851,2000,2145,10,7]
[null,2001,2050,2460,10,7]
[null,2051,2400,2448,10,7]
[null,2401,2500,2911.5,10,7]
[null,2501,2900,2772,10,7]
[null,2901,3000,2772,10,7]
[null,3001,4000,3357,10,7]
[null,4001,4100,3457,10,7]
[null,4101,4200,3537,10,7]
[null,4201,5000,4535,10,7]
[null,5001,5200,3842,10,7]
[null,5201,5500,3654,10,7]
[null,5501,5600,4312,10,7]
[null,5601,6500,4769,10,7]
[null,6501,6510,4025,10,7]
[null,6511,7300,5294,10,7]
[null,7301,8000,5294,10,7]
[null,8001,8400,5583,10,7]
[null,8401,10000,6209,10,7]
[null,10001,10500,6075,10,7]
[null,10501,12000,6897,10,7]
[null,12001,"contact vendor","contact vendor",10,7]
[]
[]
[]
["Current Year","current_year_cl",2013]
[]
[]
["bls10150211","Ductile Iron Piping"]
[21,"Size needed (in. diam)","Size selected (in. diam)","Avg. Unit Cost ($/lf)","Useful Life (large)","Useful Life (small)"]
["di_pipe_cost_cl",0,4,34.5,40,35]
[null,4.0999999999999996,6,41,40,35]
[null,6.1,8,53,40,35]
[null,8.1,10,68.5,40,35]
[null,10.1,12,79.5,40,35]
[null,12.1,14,100,40,35]
[null,14.1,16,117,40,35]
[null,16.100000000000001,18,132,40,35]
[null,18.100000000000001,20,155,40,35]
[null,20.100000000000001,24,192,40,35]
[null,24.1,30,772.37836249028499,40,35]
[null,30.1,36,1050.7103367345862,40,35]
[null,36.1,42,2290.2259632966993,40,35]
[null,42.1,48,3293.0561148509723,40,35]
[null,48.1,"contact vendor","contact vendor",40,35]
[]
[]
["bls1154","Dot Matrix Printer"]
[39,null,null,"Avg. Unit Cost","Useful Life (large)","Useful Life (small)"]
["dotmatrix_printer_cost_cl",0,0,701.83717490995969,10,8]
[]
[]
["bls118","Electrical Enclosure"]
[43,null,null,"Avg. Unit Cost","Useful Life (large)","Useful Life (small)"]
["elec_encl_cost_cl",0,0,1125,22,17]
[]
[]
["BCI","Excavation"]
[3,null,null,"Avg. Unit Cost (per cy)","Useful Life (large)","Useful Life (small)"]
["excavate_cost_cl",0,0,28.127499999999998,"N/A","N/A"]
[]
[]
["bls07290197","Fiberglass Chemical Storage Tanks"]
[18,"Size Needed (gal)","Size Selected (gal)","Avg. Unit Cost","Useful Life (large)","Useful Life (small)"]
["fg_cst_cost_cl",0,550,13292.859647568217,10,7]
[null,551,1250,18071.818670955028,10,7]
[null,1251,2090,22487.979730731975,10,7]
[null,2091,3140,25824.323454540605,10,7]
[null,3141,5140,27574.108616349513,10,7]
[null,5141,8140,32774.683187215713,10,7]
[null,8141,10460,39562.558006064057,10,7]
[null,10461,20510,61866.020982525137,10,7]
[null,20511,30025,83512.495082140347,10,7]
[null,30026,"contact vendor","contact vendor",10,7]
[]
[]
["bls07290197","Fiberglass Tower- Shell only"]
[18,"Size needed (gal)","Size selected (gal)","Avg. Unit Cost","Useful Life (large)","Useful Life (small)"]
["fg_shell_cost_cl",0,135,22087.903889849702,20,18]
[null,136,540,26829.192491819595,20,18]
[null,541,1216,20962.242911057416,20,18]
[null,1217,3378,28945.733014777463,20,18]
[null,3379,4022,34258.768843271399,20,18]
[null,4023,4868,38645.616306203505,20,18]
[null,4869,6985,40001.049500720001,20,18]
[null,6986,8648,34017.395038671748,20,18]
[null,8649,13512,38742.36397239926,20,18]
[null,13513,17295,67241.542141373691,20,18]
[null,17296,21890,83698.031840964366,20,18]
[null,21891,27024,94892.893258495737,20,18]
[null,27025,"contact vendor","contact vendor",20,18]
[]
[]
["bls1399","Granular Activated Carbon - Material and Delivery Cost"]
[45,"Quantity Needed (lb)","Quantity Selected (lb)","Avg. Unit Cost ($/lb)","Useful Life(large)","Useful Life (small)"]
["gac_cost_cl",0,300.5,2.9525163172935733,"N/A","N/A"]
[null,601,901,2.9016863568690368,"N/A","N/A"]
[null,1201,1601,2.9016863568690368,"N/A","N/A"]
[null,2001,6000.5,2.526794289950526,"N/A","N/A"]
[null,10000,15000,2.4457365457519291,"N/A","N/A"]
[null,20000,30000,2.3667052451582973,"N/A","N/A"]
[null,40000,40000,2.311991267824244,"N/A","N/A"]
[]
[]
["bls118","Gas Flow Meters (Rotameters)"]
[43,null,null,"Avg. Unit Cost","Useful Life (large)","Useful Life (small)"]
["gas_fm_cost_cl",0,0,1704.2859148311979,15,14]
[]
[]
["bls114","Impeller Mixers for Rapid Mix"]
[30,"Size needed (hp)","Size selected (hp)","Avg. Unit Cost","Useful Life (large)","Useful Life (small)"]
["imp_mix_cost_cl",0,1,5526.8375266497496,25,20]
[null,1.1000000000000001,5,11439.770436168168,25,20]
[null,5.0999999999999996,10,20116.255427875483,25,20]
[null,10.1,20,22053.688035426014,25,20]
[null,20.100000000000001,"contact vendor","contact vendor",25,20]
[]
[]
["bls1154","Laser Jet Printer"]
[39,null,null,"Avg. Unit Cost","Useful Life (large)","Useful Life (small)"]
["laser_printer_cost_cl",0,0,706.28026536213292,10,8]
[]
[]
["bls118","Magnetic Flow Meters"]
[43,"Size needed (in. diam)","Size selected (in. diam)","Avg. Unit Cost","Useful Life (large)","Useful Life (small)"]
["mag_fm_cost_cl",0,2,3786.5269861164479,15,14]
[null,2.1,3,4165.7925260885859,15,14]
[null,3.1,6,6754.9001546457275,15,14]
[null,6.1,12,16980.221540299881,15,14]
[null,12.1,24,24199.798008536087,15,14]
[null,24.1,"contact vendor","contact vendor",15,14]
[]
[]
["bls114","Mounted Mixers (for neutralization tanks, etc)"]
[30,"Size needed (hp)","Size selected (hp)","Avg. Unit Cost","Useful Life (large)","Useful Life (small)"]
["mount_mix_cost_cl",0,0.05,482.66585600763977,25,22]
[null,5.0999999999999997E-2,0.33333333333333331,959.15862967235398,25,22]
[null,0.34,0.5,1539.6070384962513,25,22]
[null,0.51,1,1896.7381073452882,25,22]
[null,1.1000000000000001,1.5,2399.9441577538305,25,22]
[null,1.6,"contact vendor","contact vendor",25,22]
[]
[]
["CPI","Off-site GAC Regeneration"]
[6,"Quantity Needed (lb)","Quantity Selected (lb)","Avg. Unit Cost ($/lb)","Useful Life(large)","Useful Life (small)"]
["off_regen_cost_cl",0,255,1.2472694452182116,"N/A","N/A"]
[null,510,750,1.2472694452182116,"N/A","N/A"]
[null,990,1500,1.2472694452182116,"N/A","N/A"]
[null,2010,3510,1.2472694452182116,"N/A","N/A"]
[null,5010,7500,1.2472694452182116,"N/A","N/A"]
[null,9990,15000,1.2472694452182116,"N/A","N/A"]
[null,20010,29955,1.2472694452182116,"N/A","N/A"]
[null,39900,49950,1.2472694452182116,"N/A","N/A"]
[null,60000,70050,1.2472694452182116,"N/A","N/A"]
[null,80100,90000,1.2472694452182116,"N/A","N/A"]
[null,99900,300450,1.2472694452182116,"N/A","N/A"]
[null,501000,750000,1.2472694452182116,"N/A","N/A"]
[null,999000,1500000,1.2472694452182116,"N/A","N/A"]
[null,2001000,3505500,1.2472694452182116,"N/A","N/A"]
[null,5010000,7500000,1.2472694452182116,"N/A","N/A"]
[null,9990000,9990000,1.2472694452182116,"N/A","N/A"]
[]
[]
["CPI","Catalytic Oxidizer - No heat recovery"]
[6,"Size needed (scfm)","Size selected (scfm)","Avg. Unit Cost","Useful Life (large)","Useful Life (small)"]
["og_co_cost_cl",0,478,62820.578797780414,25,20]
[null,479,1373,97720.90035210285,25,20]
[null,1374,2991,216381.99363679922,25,20]
[null,2992,7257,481624.43744964985,25,20]
[null,7258,21040,1507693.8911467302,25,20]
[null,21041,72226,4816244.3744964981,25,20]
[null,72227,221767,16054147.91498833,25,20]
[null,221768,736000,48162443.744964987,25,20]
[null,736001,"contact vendor","contact vendor",25,20]
[]
[]
["CPI","Catalytic Oxidizer - Recuperative"]
[6,"Size needed (scfm)","Size selected (scfm)","Avg. Unit Cost","Useful Life (large)","Useful Life (small)"]
["og_corec_cost_cl",0,478,76780.707419509388,25,20]
[null,479,1373,111681.02897383185,25,20]
[null,1374,2991,259658.39236415905,25,20]
[null,2992,7257,558405.14486915921,25,20]
[null,7258,21040,1820400.7722734595,25,20]
[null,21041,72226,5779493.2493957989,25,20]
[null,72227,221767,19264977.497985993,25,20]
[null,221768,736000,57794932.493957989,25,20]
[null,736001,"contact vendor","contact vendor",25,20]
[]
[]
["CPI","Catalytic Oxidizer - Regenerative"]
[6,"Size needed (scfm)","Size selected (scfm)","Avg. Unit Cost","Useful Life (large)","Useful Life (small)"]
["og_coreg_cost_cl",0,478,86552.797454719694,25,20]
[null,479,1373,129829.19618207953,25,20]
[null,1374,2991,289672.66890087636,25,20]
[null,2992,5000,302894.12266871956,25,20]
[null,5001,7257,649145.9809103976,25,20]
[null,7258,7500,398620.0953989281,25,20]
[null,7501,10000,507204.78088394075,25,20]
[null,10001,15000,655794.35049501061,25,20]
[null,15001,21040,2047950.8688076418,25,20]
[null,21041,25001,820100.12458417448,25,20]
[null,25001,72226,6501231.8991391864,25,20]
[null,72227,221767,21673099.685234245,25,20]
[null,221768,736000,65019299.055702738,25,20]
[null,736001,"contact vendor","contact vendor",25,20]
[]
[]
["CPI","Gas-Phase GAC Adsorber"]
[6,"Size needed (cu ft)","Size selected (cu ft)","Avg. Unit Cost","Useful Life (large)","Useful Life (small)"]
["og_gac_cost_cl",0,41.7,9952.865241610285,25,20]
[null,41.8,66.7,12459.512783941764,25,20]
[null,66.8,100,19315.931061495517,25,20]
[null,100.1,333.3,24771.575712452261,25,20]
[null,333.4,666.7,54474.611839803132,25,20]
[null,666.8,1333.3,64033.785967411939,25,20]
[null,1333.4,"contact vendor","contact vendor",25,20]
[]
[]
["CPI","Thermal Oxidizer - No heat recovery"]
[6,"Size needed (scfm)","Size selected (scfm)","Avg. Unit Cost","Useful Life (large)","Useful Life (small)"]
["og_to_cost_cl",0,478,55840.514486915927,25,20]
[null,479,1373,83760.77173037389,25,20]
[null,1374,2991,195441.8007042057,25,20]
[null,2992,5000,213168.88255741962,25,20]
[null,5001,7257,390883.6014084114,25,20]
[null,7258,7500,285320.54857048724,25,20]
[null,7501,10000,356329.217894239,25,20]
[null,10001,15000,428338.00932114205,25,20]
[null,15001,25000,540065.93570177362,25,20]
[null,25001,"contact vendor","contact vendor",25,20]
[]
[]
["CPI","Thermal Oxidizer - Recuperative"]
[6,"Size needed (scfm)","Size selected (scfm)","Avg. Unit Cost","Useful Life (large)","Useful Life (small)"]
["og_torec_cost_cl",0,478,69800.643108644901,25,20]
[null,479,1373,97720.90035210285,25,20]
[null,1374,2991,230342.12225852822,25,20]
[null,2992,7257,481624.43744964985,25,20]
[null,7258,"contact vendor","contact vendor",25,20]
[]
[]
["CPI","Thermal Oxidizer - Regenerative/Flameless"]
[6,"Size needed (scfm)","Size selected (scfm)","Avg. Unit Cost","Useful Life (large)","Useful Life (small)"]
["og_toreg_cost_cl",0,478,104700.96466296737,25,20]
[null,479,500,279202.5724345796,25,20]
[null,501,1373,104700.96466296737,25,20]
[null,1374,1500,349003.21554322459,25,20]
[null,1501,2991,237322.18656939268,25,20]
[null,2992,3000,453704.1802061919,25,20]
[null,3001,5000,227599.21576003317,25,20]
[null,5001,7257,558405.14486915921,25,20]
[null,7258,7500,431078.25752743287,25,20]
[null,7501,10000,389333.24729823624,25,20]
[null,10001,15000,485630.71837310278,25,20]
[null,15001,20000,837607.71730373893,25,20]
[null,20001,21040,1605414.7914988329,25,20]
[null,21041,25000,569926.72421015194,25,20]
[null,25001,75000,1745016.0777161224,25,20]
[null,75001,221767,16054147.91498833,25,20]
[null,221768,736000,48162443.744964987,25,20]
[null,736001,"contact vendor","contact vendor",25,20]
[]
[]
["bls118","Orifice Plate Flow Meters"]
[43,"Size needed (in. diam)","Size selected (in. diam)","Avg. Unit Cost","Useful Life (large)","Useful Life (small)"]
["op_fm_cost_cl",0,2,3102.9884038144432,15,14]
[null,2.1,3,3203.0576969520625,15,14]
[null,3.1,6,4704.8147984158795,15,14]
[null,6.1,12,5776.0882682183101,15,14]
[null,12.1,24,9682.9913688167362,15,14]
[null,48.1,60,28061.971541917344,15,14]
[null,60.1,"contact vendor","contact vendor",15,14]
[]
[]
["bls115","Operator Interface Software"]
[37,null,null,"Avg. Unit Cost","Useful Life (large)","Useful Life (small)"]
["op_interface_software_cost_cl",0,0,159.73214000968537,10,8]
[]
[]
["bls072","Packing"]
[15,"Size needed (inches)","Size selected (inches)","Avg. Unit Cost ($/cubic ft)","Useful Life (large)","Useful Life (small)"]
["packing_cost_cl",2,2,22.900945456345042,25,20]
[null,3.5,3.5,19.972584513975704,25,20]
[]
[]
["bls11510114","PC Workstation"]
[38,null,null,"Avg. Unit Cost","Useful Life (large)","Useful Life (small)"]
["pc_workstation_cost_cl",0,0,1545.4444007340992,10,8]
[]
[]
["bls11470145","Positive Displacement Blowers"]
[34,"Size needed (cfm)","Size selected (cfm)","Avg. Unit Cost","Useful Life (large)","Useful Life (small)"]
["pd_blow_cost_cl",0,40,9252.1749487824982,25,20]
[null,41,50,15310.189034961575,25,20]
[null,51,70,9763.526371727985,25,20]
[null,71,134,8383.5114125061664,25,20]
[null,135,135,16047.949821854701,25,20]
[null,136,247,11089.193944147686,25,20]
[null,248,250,17549.006378413633,25,20]
[null,251,280,11503.501096872544,25,20]
[null,281,393,16077.176390333312,25,20]
[null,394,400,23576.48668810683,25,20]
[null,401,500,23526.752859822827,25,20]
[null,501,3000,70233.341793699714,25,20]
[null,3001,5000,96377.7296812149,25,20]
[null,5001,"contact vendor","contact vendor",25,20]
[]
[]
["bls118","pH Meters/Controllers"]
[43,null,null,"Avg. Unit Cost","Useful Life (large)","Useful Life (small)"]
["pH_meter_cost_cl",0,0,2185.4726555323537,15,14]
[]
[]
["bls07290197","Plastic (XLPE) Chemical Storage Tanks"]
[18,"Size Needed (gal)","Size Selected (gal)","Avg. Unit Cost","Useful Life (large)","Useful Life (small)"]
["pl_cst_cost_cl",0,20,495.61638159255619,10,7]
[null,21,40,769.73947109657206,10,7]
[null,41,65,1062.3646518992605,10,7]
[null,66,85,1143.0888397068989,10,7]
[null,86,100,1550.2742244274455,10,7]
[null,101,110,1728.2435236705746,10,7]
[null,111,120,2136.6494863204912,10,7]
[null,121,150,2225.7684523943144,10,7]
[null,151,165,2261.0936793384226,10,7]
[null,166,200,1845.7704193971692,10,7]
[null,201,220,1958.2604481640528,10,7]
[null,221,250,2582.311474915738,10,7]
[null,251,300,2213.461707456087,10,7]
[null,301,500,2822.9226095811423,10,7]
[null,501,550,2657.2426650857642,10,7]
[null,551,850,2854.1686912843056,10,7]
[null,851,1000,2958.1796197458607,10,7]
[null,1001,1050,3613.8096040338096,10,7]
[null,1051,1550,5459.5184529264625,10,7]
[null,1551,2550,10298.053664194169,10,7]
[null,2551,3050,11700.651629822525,10,7]
[null,3001,4050,18338.723926392275,10,7]
[null,4051,5250,20748.267622801915,10,7]
[null,4051,6550,29154.932712464288,10,7]
[null,6551,"contact vendor","contact vendor",10,7]
[]
[]
["bls0721","PVC/FRP Liquid Distributor"]
[16,"Size needed (sq m)","Size selected (sq m)","Avg. Unit Cost","Useful Life (large)","Useful Life (small)"]
["pl_ldist_cost_cl",0,1.7999999999999999E-2,1223.7118104678289,25,20]
[null,1.8100000000000002E-2,7.2999999999999995E-2,2117.4339192364678,25,20]
[null,7.3099999999999998E-2,0.3,4241.7426239250026,25,20]
[null,0.31,0.66,5914.8939094420593,25,20]
[null,0.66100000000000003,1.8,9862.3530683118697,25,20]
[null,1.81,7.3,12645.310371496653,25,20]
[null,7.31,"contact vendor","contact vendor",25,20]
[]
[]
["bls0721","PVC/FRP Liquid Redistributor"]
[16,"Size needed (sq m)","Size selected (sq m)","Avg. Unit Cost","Useful Life (large)","Useful Life (small)"]
["pl_redist_cost_cl",0,1.8100000000000002E-2,1354.3327340570918,25,20]
[null,1.8100000000000002E-2,7.2999999999999995E-2,2337.4270537025945,25,20]
[null,7.3099999999999998E-2,0.3,4674.8541074051891,25,20]
[null,0.31,0.66,7459.1422154921029,25,20]
[null,0.66100000000000003,1.8,11391.519494074113,25,20]
[null,1.81,"contact vendor","contact vendor",25,20]
[]
[]
["bls0721","PVC/FRP Support Plate"]
[16,"Size needed (sq m)","Size selected (sq m)","Avg. Unit Cost","Useful Life (large)","Useful Life (small)"]
["pl_splate_cost_cl",0,1.7999999999999999E-2,1533.0771558108192,25,20]
[null,1.8100000000000002E-2,7.2999999999999995E-2,1725.5711484686799,25,20]
[null,7.3099999999999998E-2,0.3,2529.921046360455,25,20]
[null,0.31,0.7,3533.639722362158,25,20]
[null,0.71,1.8,6971.0324483953846,25,20]
[null,1.81,3.6,12807.725297199804,25,20]
[null,1.81,4.7,16595.732081288421,25,20]
[null,4.71,5.9,20720.603352528295,25,20]
[null,5.91,7.3,25924.815939742599,25,20]
[null,7.31,"contact vendor","contact vendor",25,20]
[]
[]
["bls115","Plant intelligence Software"]
[37,null,null,"Avg. Unit Cost","Useful Life (large)","Useful Life (small)"]
["plant_intel_software_cost_cl",0,0,11468.799346670803,10,8]
[]
[]
["bls115","Expansion Base Controller Module"]
[37,null,null,"Avg. Unit Cost","Useful Life (large)","Useful Life (small)"]
["plc_base_expansion_controller_cost_cl",0,0,71.097934902342161,10,8]
[]
[]
["bls115","Base Expansion Module"]
[37,null,null,"Avg. Unit Cost","Useful Life (large)","Useful Life (small)"]
["plc_base_expansion_cost_cl",0,0,97.383564759945386,10,8]
[]
[]
["bls115","I/O Combination Analog Module"]
[37,null,null,"Avg. Unit Cost","Useful Life (large)","Useful Life (small)"]
["plc_combination_analog_cost_cl",0,0,538.26867927154467,10,8]
[]
[]
["bls115","CPU"]
[37,null,null,"Avg. Unit Cost","Useful Life (large)","Useful Life (small)"]
["plc_cpu_cost_cl",0,0,521.83546674806814,10,8]
[]
[]
["bls115","PLC Data Collection Software"]
[37,null,null,"Avg. Unit Cost","Useful Life (large)","Useful Life (small)"]
["plc_data_software_cost_cl",0,0,348.2845956132428,10,8]
[]
[]
["bls115","I/O Discrete Input Module"]
[37,null,null,"Avg. Unit Cost","Useful Life (large)","Useful Life (small)"]
["plc_discrete_input_cost_cl",0,0,276.30421456568109,10,8]
[]
[]
["bls115","I/O Discrete Output Module"]
[37,null,null,"Avg. Unit Cost","Useful Life (large)","Useful Life (small)"]
["plc_discrete_output_cost_cl",0,0,341.71318814884199,10,8]
[]
[]
["bls115","Ethernet Module"]
[37,null,null,"Avg. Unit Cost","Useful Life (large)","Useful Life (small)"]
["plc_ethernet_cost_cl",0,0,547.77375078255295,10,8]
[]
[]
["bls115","Operator Interface Unit"]
[37,"System Size",null,"Avg. Unit Cost","Useful Life (large)","Useful Life (small)"]
["plc_op_interface_cost_cl","small","small",2390.7875590067538,10,8]
[null,"large","large",287.26438344380671,10,8]
[]
[]
["bls115","PLC Rack/Power Supply"]
[37,null,null,"Avg. Unit Cost","Useful Life (large)","Useful Life (small)"]
["plc_rack_cost_cl",0,0,348.87132842256426,10,8]
[]
[]
["bls115","PLC  Programming Software"]
[37,null,null,"Avg. Unit Cost","Useful Life (large)","Useful Life (small)"]
["plc_software_cost_cl",0,0,369.87636299627394,10,8]
[]
[]
["bls114","Portable Mixers"]
[30,"Size needed (hp)","Size selected (hp)","Avg. Unit Cost","Useful Life (large)","Useful Life (small)"]
["port_mix_cost_cl",0,1,1977.7631003548438,25,20]
[null,1.1000000000000001,"contact vendor","contact vendor",25,20]
[]
[]
["bls1149","PVC Check Valves"]
[36,"Size needed (in. diam)","Size selected (in. diam)","Avg. Unit Cost","Useful Life (large)","Useful Life (small)"]
["pp_chv_cost_cl",0,0.5,75.5,25,20]
[null,0.6,0.75,82.5,25,20]
[null,0.76,1,98.5,25,20]
[null,1.1000000000000001,1.5,150,25,20]
[null,1.51,2,197,25,20]
[null,2.1,2.5,924.15264263282279,25,20]
[null,2.6,3,485,25,20]
[null,3.1,4,670,25,20]
[null,4.0999999999999996,6,1875.9056836883829,25,20]
[null,6.1,8,3097.3711069541023,25,20]
[null,8.1,10,3173.0190475730315,25,20]
[null,10.1,12,4450.8474067826246,25,20]
[null,12.1,"contact vendor","contact vendor",25,20]
[]
[]
["bls1149","Polypropylene/PVC Manual Valves"]
[36,"Size needed (in. diam)","Size selected (in. diam)","Avg. Unit Cost","Useful Life (large)","Useful Life (small)"]
["pp_man_cost_cl",0,0.5,85.672485020269022,25,20]
[null,0.6,0.75,96.058191666660491,25,20]
[null,0.76,1,109.15342253569597,25,20]
[null,1.1000000000000001,1.5,253.13626629747904,25,20]
[null,1.6,2,265.46202266942828,25,20]
[null,2.1,3,325.43724532737673,25,20]
[null,3.1,4,456.68319808516492,25,20]
[null,4.0999999999999996,6,514.75724160235029,25,20]
[null,6.1,8,988.02609223657419,25,20]
[null,8.1,10,1613.9602441966856,25,20]
[null,10.1,12,2164.1843878434147,25,20]
[null,12.1,14,6953.3635714192314,25,20]
[null,14.1,16,11216.149734115295,25,20]
[null,16.100000000000001,18,14712.478663088114,25,20]
[null,18.100000000000001,20,16389.730139500021,25,20]
[null,20.100000000000001,24,23414.462888326856,25,20]
[null,24.1,"contact vendor","contact vendor",25,20]
[]
[]
["bls1149","Polypropylene/PVC Motor/Air Operated Valves (on/off)"]
[36,"Size needed (in. diam)","Size selected (in. diam)","Avg. Unit Cost","Useful Life (large)","Useful Life (small)"]
["pp_mov_cost_cl",0,0.5,540.16098149662184,25,20]
[null,0.6,0.75,539.80609185730168,25,20]
[null,0.76,1,591.99043084256039,25,20]
[null,1.1000000000000001,1.5,762.42315949855276,25,20]
[null,1.6,2,753.79023842117181,25,20]
[null,2.1,3,1133.219430459146,25,20]
[null,3.1,4,1687.9544136049437,25,20]
[null,4.0999999999999996,6,2441.7498827964332,25,20]
[null,6.1,8,1856.0380210910726,25,20]
[null,8.1,10,3075.618233230588,25,20]
[null,10.1,12,3543.2388728132473,25,20]
[null,12.1,14,9519.3311529265284,25,20]
[null,14.1,16,13576.970672320374,25,20]
[null,16.100000000000001,18,18011.975783839436,25,20]
[null,18.100000000000001,20,19616.667887452877,25,20]
[null,20.100000000000001,24,26394.82195150687,25,20]
[null,24.1,"contact vendor","contact vendor",25,20]
[]
[]
["bls118","Propeller Flow Meters"]
[43,"Size needed (in. diam)","Size selected (in. diam)","Avg. Unit Cost","Useful Life (large)","Useful Life (small)"]
["prop_fm_cost_cl",0,2,2214.7639287992993,15,14]
[null,2.1,3,2176.724292250597,15,14]
[null,3.1,4,2267.4158644022268,15,14]
[null,4.0999999999999996,6,3321.7299285803347,15,14]
[null,6.1,8,3742.2101103814016,15,14]
[null,8.1,10,4460.403699530646,15,14]
[null,10.1,12,4817.5175908765714,15,14]
[null,12.1,24,9826.6076950529605,15,14]
[null,24.1,"contact vendor","contact vendor",15,14]
[]
[]
["bls1141","Centrifugal Pumps (Booster)"]
[31,"Size needed (gpm)","Size selected (gpm)","Avg. Unit Cost","Useful Life (large)","Useful Life (small)"]
["pump_cost_cl",0,10,5473.9744670432729,20,17]
[null,11,30,5713.0911043425185,20,17]
[null,31,50,6577.4799036541181,20,17]
[null,51,75,6825.0578093025006,20,17]
[null,76,100,6825.0578093025006,20,17]
[null,101,125,7559.9047030039073,20,17]
[null,126,200,8149.7477041672064,20,17]
[null,201,250,8663.5685397331781,20,17]
[null,251,300,10364.803473258822,20,17]
[null,301,500,14037.35640484225,20,17]
[null,501,750,14453.575901857788,20,17]
[null,751,1000,16567.721447596345,20,17]
[null,1001,1500,19811.719511851501,20,17]
[null,1501,2000,29398.59745040417,20,17]
[null,2001,3000,33773.658584849305,20,17]
[null,3001,3500,38462.122657336367,20,17]
[null,3501,4000,40340.11669835577,20,17]
[null,4001,6000,83558.926026568486,20,17]
[null,6001,10000,74838.470771139575,20,17]
[null,10001,"contact vendor","contact vendor",20,17]
[]
[]
["bls1141","PVC Chemical Metering Pumps - Electric"]
[31,"Size needed (gph)","Size selected (gph)","Avg. Unit Cost","Useful Life (large)","Useful Life (small)"]
["pvc_empump_cost_cl",0,0.25,919.23497888058591,20,15]
[null,0.26,0.5,896.81461354203498,20,15]
[null,0.51,0.9,1046.2837157990407,20,15]
[null,0.91,1.3,1716.7273739728405,20,15]
[null,1.31,1.75,1352.695375425903,20,15]
[null,1.76,2.5,1721.5103852450648,20,15]
[null,2.5099999999999998,5,1464.7972021186574,20,15]
[null,5.01,8,1728.2738621221943,20,15]
[null,8.01,10,1591.8459390371122,20,15]
[null,10.01,21,2216.1783791646258,20,15]
[null,21.01,25,2486.3437814941635,20,15]
[null,25.01,"contact vendor","contact vendor",20,15]
[]
[]
["bls1141","PVC Chemical Metering Pumps - Mechanical"]
[31,"Size needed (gph)","Size selected (gph)","Avg. Unit Cost","Useful Life (large)","Useful Life (small)"]
["pvc_mmpump_cost_cl",0,1,3318.2140701055296,20,17]
[null,1.01,2,3318.2140701055296,20,17]
[null,2.0099999999999998,3,3318.2140701055296,20,17]
[null,3.01,4,3318.2140701055296,20,17]
[null,4.01,5,3318.2140701055296,20,17]
[null,5.01,7,3557.3646337167388,20,17]
[null,7.01,10,4200.0817734218635,20,17]
[null,10.01,14,3482.3655148709795,20,17]
[null,14.01,18,4357.0243307917199,20,17]
[null,18.010000000000002,24,4013.2453956006066,20,17]
[null,24.01,30,3397.6981281762578,20,17]
[null,30.01,36,4439.2323370330732,20,17]
[null,36.01,60,4492.9105145160574,20,17]
[null,60.01,65,3623.583157376504,20,17]
[null,65.010000000000005,83,4742.7338669182545,20,17]
[null,83.01,96,5513.6173543307459,20,17]
[null,96.01,108,4356.184187726647,20,17]
[null,108.01,180,5970.4371987233344,20,17]
[null,180.01,250,8233.1229904803731,20,17]
[null,250.01,360,9103.9358188537426,20,17]
[null,360.01,760,16063.300635772077,20,17]
[null,760.1,"contact vendor","contact vendor",20,17]
[]
[]
["bls07210603","PVC Piping"]
[17,"Size needed (in. diam)","Size selected (in. diam)","Avg. Unit Cost ($/lf)","Useful Life (large)","Useful Life (small)"]
["pvc_pipe_cost_cl",0,0.5,1.0807667372623011,22,17]
[null,0.6,1,2.0966573454989361,22,17]
[null,1.1000000000000001,2,2.06,22,17]
[null,2.1,2.5,3.22,22,17]
[null,2.6,3,5.25,22,17]
[null,3.1,4,8.85,22,17]
[null,4.0999999999999996,6,13,22,17]
[null,6.1,8,18.399999999999999,22,17]
[null,8.1,10,27.5,22,17]
[null,10.1,12,35,22,17]
[null,12.1,14,25.5,22,17]
[null,14.1,16,32.5,22,17]
[null,16.100000000000001,18,41,22,17]
[null,18.100000000000001,20,50,22,17]
[null,20.100000000000001,24,68.5,22,17]
[null,24.1,30,118,22,17]
[null,30.1,36,167,22,17]
[null,36.1,42,223,22,17]
[null,42.1,48,280,22,17]
[null,48.1,"contact vendor","contact vendor",22,17]
[]
[]
[3,null,null,"Avg. Unit Cost (per sf)","Useful Life (large)"]
["sitework_sf_cl","Sitework unit cost","sitework_sf_cl",11.6,"N/A"]
[]
[]
["bls1149","Stainless Steel Check Valves"]
[36,"Size needed (in. diam)","Size selected (in. diam)","Avg. Unit Cost","Useful Life (large)","Useful Life (small)"]
["ss_chv_cost_cl",0,0.25,"contact vendor",25,20]
[null,0.26,0.5,528.70207649981307,25,20]
[null,0.6,0.75,563.75877222862562,25,20]
[null,0.76,1,698.98584033179964,25,20]
[null,1.1000000000000001,1.5,970.75067135825645,25,20]
[null,1.6,2,933.75853067755054,25,20]
[null,2.1,2.5,817.00524891261693,25,20]
[null,2.6,3,1617.6069193683936,25,20]
[null,3.1,4,2363.1190436306133,25,20]
[null,4.0999999999999996,6,4684.2081267591147,25,20]
[null,6.1,8,7418.3261556764264,25,20]
[null,8.1,10,14254.425024367019,25,20]
[null,10.1,12,20875.655065221508,25,20]
[null,12.1,14,9381.0159484589549,25,20]
[null,14.1,16,10978.976321936914,25,20]
[null,16.100000000000001,18,13927.256332525007,25,20]
[null,18.100000000000001,30,40443.368118428145,25,20]
[null,30.1,36,48427.763463089679,25,20]
[null,36.1,42,65727.286709856329,25,20]
[null,42.1,48,79034.61228429222,25,20]
[null,48.1,"contact vendor","contact vendor",25,20]
[]
[]
["bls1072","Stainless Steel Chemical Storage Tanks"]
[25,"Size needed (gal)","Size selected (gal)","Avg. Unit Cost","Useful Life (large)","Useful Life (small)"]
["ss_cst_cost_cl",0,187,30804.235646258174,35,30]
[null,188,300,33809.624421346991,35,30]
[null,301,658,28734.603547631526,35,30]
[null,659,755,29582.228587071048,35,30]
[null,756,883,30863.990012816015,35,30]
[null,884,951,31653.730200748145,35,30]
[null,952,1427,32880.486413929015,35,30]
[null,1428,1727,38213.888933366623,35,30]
[null,1728,2020,39582.348418255671,35,30]
[null,2021,2855,42556.235341400497,35,30]
[null,2856,4265,62701.934271732258,35,30]
[null,4266,4705,77018.847871089878,35,30]
[null,4706,6769,105904.39447224967,35,30]
[null,6770,16920,173977.65755960537,35,30]
[null,16921,27078,202922.55762006671,35,30]
[null,27079,"contact vendor","contact vendor",35,30]
[]
[]
["bls1141","316 Stainless Steel Chemical Metering Pumps - Electric"]
[31,"Size needed (gph)","Size selected (gph)","Avg. Unit Cost","Useful Life (large)","Useful Life (small)"]
["ss_empump_cost_cl",0,0.25,1135.9651771532444,20,15]
[null,0.26,0.5,1113.5448118146935,20,15]
[null,0.51,0.9,1263.0139140716992,20,15]
[null,0.91,1.3,1828.4879203318699,20,15]
[null,1.31,1.75,1569.4255736985615,20,15]
[null,1.76,2.5,1742.1338047874335,20,15]
[null,2.5099999999999998,5,1681.527400391316,20,15]
[null,5.01,8,2466.720192566831,20,15]
[null,8.01,10,1808.5761373097705,20,15]
[null,10.01,21,3261.6400149012529,20,15]
[null,21.01,25,3572.6104821469535,20,15]
[null,25.01,"contact vendor","contact vendor",20,15]
[]
[]
["bls1072","Stainless Steel Liquid Distributor"]
[25,"Size needed (sq m)","Size selected (sq m)","Avg. Unit Cost","Useful Life (large)","Useful Life (small)"]
["ss_ldist_cost_cl",0,1.7999999999999999E-2,1128.4117480470584,35,30]
[null,1.8100000000000002E-2,7.2999999999999995E-2,1973.0899062672554,35,30]
[null,7.3099999999999998E-2,0.3,3196.0795175899343,35,30]
[null,0.31,0.66,4973.4910860455602,35,30]
[null,0.66100000000000003,1.8,8560.9272792587508,35,30]
[null,1.81,3.6,11952.685134660314,35,30]
[null,3.61,4.7,13808.368038240593,35,30]
[null,4.71,7.3,19574.356392423251,35,30]
[null,7.31,"contact vendor","contact vendor",35,30]
[]
[]
["bls1149","Stainless Steel Manual Valves"]
[36,"Size needed (in. diam)","Size selected (in. diam)","Avg. Unit Cost","Useful Life (large)","Useful Life (small)"]
["ss_man_cost_cl",0,0.5,427.63836588195198,25,20]
[null,0.6,0.75,453.2584182932485,25,20]
[null,0.76,1,511.2091883544669,25,20]
[null,1.1000000000000001,1.5,648.80285816359151,25,20]
[null,1.6,2,724.86749540298354,25,20]
[null,2.1,2.5,774.44440845322765,25,20]
[null,2.6,3,1333.2411879381598,25,20]
[null,3.1,4,2071.8878161752787,25,20]
[null,4.0999999999999996,6,3582.7947685912,25,20]
[null,6.1,8,7317.5841554724948,25,20]
[null,8.1,10,11852.93158756278,25,20]
[null,10.1,12,16099.90271802136,25,20]
[null,12.1,48,59911.985433827846,25,20]
[null,48.1,"contact vendor","contact vendor",25,20]
[]
[]
["bls1141","316 Stainless Steel Chemical Metering Pumps - Mechanical"]
[31,"Size needed (gph)","Size selected (gph)","Avg. Unit Cost","Useful Life (large)","Useful Life (small)"]
["ss_mmpump_cost_cl",0,5,3458.7771497111985,20,17]
[null,5.01,7,4825.4912347782792,20,17]
[null,7.01,14,4509.8882903331341,20,17]
[null,14.01,18,3771.2744691922926,20,17]
[null,18.010000000000002,24,5244.5038107834307,20,17]
[null,24.01,30,4240.020448413934,20,17]
[null,30.01,32.299999999999997,5514.2602731135448,20,17]
[null,32.31,36,3842.2965872561781,20,17]
[null,36.01,40.6,5888.0852183730422,20,17]
[null,40.61,55.5,5678.5789303704669,20,17]
[null,55.51,61.8,5961.2105987255381,20,17]
[null,61.81,65,4625.6622007389915,20,17]
[null,65.010000000000005,78.900000000000006,6137.3948902735701,20,17]
[null,78.91,96,4893.7860528819274,20,17]
[null,96.01,104.6,6274.4271170331522,20,17]
[null,104.61,108,4865.3486746243434,20,17]
[null,108.01,137.9,6844.7421941182656,20,17]
[null,137.91,180,8015.1268568691348,20,17]
[null,180.01,218.7,7847.0350527026285,20,17]
[null,218.71,272.60000000000002,8157.6414333576795,20,17]
[null,272.61,600,37208.090785064,20,17]
[null,600.01,"contact vendor","contact vendor",20,17]
[]
[]
["bls1149","Stainless Steel Motor/Air Operated Valves (on/off)"]
[36,"Size needed (in. diam)","Size selected (in. diam)","Avg. Unit Cost","Useful Life (large)","Useful Life (small)"]
["ss_mov_cost_cl",0,1,745.89102875888318,25,20]
[null,1.1000000000000001,1.5,801.23094875811285,25,20]
[null,1.6,2,867.83568552278393,25,20]
[null,2.1,3,1396.5705528786627,25,20]
[null,3.1,4,2642.8491591109964,25,20]
[null,4.0999999999999996,6,2103.7891263595275,25,20]
[null,6.1,8,3335.2969284971296,25,20]
[null,8.1,10,5045.8820904286804,25,20]
[null,10.1,12,6646.7533570333171,25,20]
[null,12.1,14,16002.474168003628,25,20]
[null,14.1,16,18483.218142506172,25,20]
[null,16.100000000000001,20,29829.609493886288,25,20]
[null,20.100000000000001,24,41781.479571043201,25,20]
[null,24.1,30,51553.838870601452,25,20]
[null,30.1,48,142278.18993812319,25,20]
[null,48.1,"contact vendor","contact vendor",25,20]
[]
[]
["bls101706","Stainless Steel Piping"]
[23,"Size needed (in. diam)","Size selected (in. diam)","Avg. Unit Cost ($/lf)","Useful Life (large)","Useful Life (small)"]
["ss_pipe_cost_cl",0,0.5,21,45,40]
[null,0.6,0.75,27,45,40]
[null,0.76,1,30.5,45,40]
[null,1.1000000000000001,1.25,36,45,40]
[null,1.26,1.5,45.5,45,40]
[null,1.6,2,65,45,40]
[null,2.1,2.5,84.5,45,40]
[null,2.6,3,103,45,40]
[null,3.1,4,124,45,40]
[null,4.0999999999999996,6,223,45,40]
[null,6.1,8,325,45,40]
[null,8.1,10,455,45,40]
[null,10.1,12,580,45,40]
[null,12.1,16,426.90840175180773,45,40]
[null,16.100000000000001,24,752.90755220732137,45,40]
[null,24.1,36,1156.9244712699804,45,40]
[null,36.1,48,1811.4170033548489,45,40]
[null,48.1,"contact vendor","contact vendor",45,40]
[]
[]
["bls1072","Stainless Steel Liquid Redistributor"]
[25,"Size needed (sq m)","Size selected (sq m)","Avg. Unit Cost","Useful Life (large)","Useful Life (small)"]
["ss_redist_cost_cl",0,1.7999999999999999E-2,1281.6931126661675,35,30]
[null,1.8100000000000002E-2,7.2999999999999995E-2,2204.6426060110157,35,30]
[null,7.3099999999999998E-2,0.3,3408.0643835525316,35,30]
[null,0.31,0.66,5319.1894828461045,35,30]
[null,0.66100000000000003,1.8,6463.907759044132,35,30]
[null,1.81,3.6,9689.991288431851,35,30]
[null,3.61,4.7,11590.680209708804,35,30]
[null,4.71,7.3,18961.230933946812,35,30]
[null,7.31,"contact vendor","contact vendor",35,30]
[]
[]
["bls1072","Stainless Steel Tower- Shell only"]
[25,"Size needed (gal)","Size selected (gal)","Avg. Unit Cost","Useful Life (large)","Useful Life (small)"]
["ss_shell_cost_cl",0,523,28251.338000791948,25,20]
[null,524,1903,31521.683912435597,25,20]
[null,1904,2056,18844.530863659842,25,20]
[null,2057,4318,28012.429059941758,25,20]
[null,4319,6022,53637.067212857582,25,20]
[null,6023,6755,46366.281326507669,25,20]
[null,6756,8090,42153.215144585614,25,20]
[null,8091,11162,61681.157349494679,25,20]
[null,11163,15415,102255.99759956416,25,20]
[null,15416,17295,77779.676856707374,25,20]
[null,17296,21890,97315.1501091799,25,20]
[null,21891,24087,145217.0710538998,25,20]
[null,24088,27024,117691.89634741147,25,20]
[null,27025,"contact vendor","contact vendor",25,20]
[]
[]
["bls1072","Stainless Steel Support Plate"]
[25,"Size needed (sq m)","Size selected (sq m)","Avg. Unit Cost","Useful Life (large)","Useful Life (small)"]
["ss_splate_cost_cl",0,1.7999999999999999E-2,704.44201612186305,35,30]
[null,1.8100000000000002E-2,7.2999999999999995E-2,926.21079897504217,35,30]
[null,7.3099999999999998E-2,0.3,1611.0849813157424,35,30]
[null,0.31,0.7,2387.2757213018695,35,30]
[null,0.71,1.8,4070.1094264818757,35,30]
[null,1.81,3.6,5821.4305498959511,35,30]
[null,1.81,4.7,6966.1488260939786,35,30]
[null,4.71,5.9,8273.9323838016971,35,30]
[null,5.91,7.3,10181.796177465076,35,30]
[null,7.31,"contact vendor","contact vendor",35,30]
[]
[]
["bls101706","Steel Piping"]
[23,"Size needed (in. diam)","Size selected (in. diam)","Avg. Unit Cost ($/lf)","Useful Life (large)","Useful Life (small)"]
["st_pipe_cost_cl",0,1,18.850000000000001,35,33]
[null,1.1000000000000001,1.5,24,35,33]
[null,1.6,2,30,35,33]
[null,2.1,2.5,42.5,35,33]
[null,2.6,3,48.5,35,33]
[null,3.1,4,60,35,33]
[null,4.0999999999999996,6,104,35,33]
[null,6.1,8,146,35,33]
[null,8.1,10,184,35,33]
[null,10.1,12,223,35,33]
[null,12.1,14,244,35,33]
[null,14.1,16,320,35,33]
[null,16.100000000000001,18,340,35,33]
[null,18.100000000000001,20,385,35,33]
[null,20.100000000000001,24,455,35,33]
[null,24.1,36,272.37466487142302,35,33]
[null,36.1,48,398.24541518942738,35,33]
[null,48.1,60,501.20895179870496,35,33]
[null,60.1,"contact vendor","contact vendor",35,33]
[]
[]
["CCI","Geotechnical costs"]
[2,"Borings, initial field stake out & determination of elevations",null,"Avg. Unit Cost (per day)","Useful Life (large)","Useful Life (small)"]
["stake_out_cost_cl",0,0,1275,"N/A","N/A"]
[]
[]
["bls1173","Standby Generators for Standby Power Calculations"]
[41,"Size needed (kW)","Size selected (kW)","Avg. Unit Cost ($/kW)","Useful Life (large)","Useful Life (small)"]
["std_gen_cost_cl",0,30,931.31975784259782]
[null,31,50,691.60814529444144]
[null,51,125,420.9290038525042]
[null,126,150,400.2839845899835]
[null,151,175,371.61034672537153]
[null,176,200,334.90809025866815]
[null,201,250,312.54265272427079]
[null,251,300,281.00165107319759]
[null,301,350,270.10566868464502]
[null,351,400,287.88332416070449]
[null,401,500,286.67903137039076]
[null,501,750,305.83302146395158]
[null,751,1000,284.72922399559718]
[]
[]
["bls118","Drive Controllers"]
[43,null,null,"Avg. Unit Cost","Useful Life (large)","Useful Life (small)"]
["switch_cost_cl",0,0,984.59764286548318,15,14]
[]
[]
["bls118","TDS Monitor"]
[43,null,null,"Avg. Unit Cost","Useful Life (large)","Useful Life (small)"]
["TDS_monitor_cost_cl",0,0,1756.2642826237691,15,14]
[]
[]
["bls118","Temperature Meter"]
[43,null,null,"Avg. Unit Cost","Useful Life (large)","Useful Life (small)"]
["temp_meter_cost_cl",0,0,522.62094023815598,15,14]
[]
[]
["bls118","Turbidimeter"]
[43,null,null,"Avg. Unit Cost","Useful Life (large)","Useful Life (small)"]
["turbidimeter_cost_cl",0,0,4929.0671335673769,15,14]
[]
[]
["bls115","UPS"]
[37,null,null,"Avg. Unit Cost","Useful Life (large)","Useful Life (small)"]
["ups_cost_cl",0,0,416.78213070467206,10,8]
[]
[]
["bls118","Venturi Flow Meters"]
[43,"Size needed (in. diam)","Size selected (in. diam)","Avg. Unit Cost","Useful Life (large)","Useful Life (small)"]
["ven_fm_cost_cl",0,2,4659.8571785101149,15,14]
[null,2.1,3,7632.3444593803852,15,14]
[null,3.1,6,9698.5328715422202,15,14]
[null,6.1,12,16062.133566131362,15,14]
[null,12.1,24,32198.266363948122,15,14]
[null,24.1,"contact vendor","contact vendor",15,14]
[]
[]
["BCI","High Quality, No Heating or Cooling"]
[3,"Size needed (sf)","Size selected (sf)","Avg. Unit Cost","Useful Life (large)","Useful Life (small)"]
["bldg_hi_cost_cl",0,500,149.95620089537888,40,37]
[null,500.1,1000,126.77715821140147,40,37]
[null,1000.1,2000,113.10938236928918,40,37]
[null,2000.1,3000,106.57172510959576,40,37]
[null,3000.1,4000,100.45273973187896,40,37]
[null,4000.1,5000,95.453850966013306,40,37]
[null,5000.1000000000004,7500,90.711819209136991,40,37]
[null,7500.1,8000,89.988055040622854,40,37]
[null,8000.1,10000,86.190539263858724,40,37]
[null,10000.1,12000,86.18332083497387,40,37]
[null,12000.1,15000,82.448274706233676,40,37]
[null,15000.1,18000,81.105033980402183,40,37]
[null,18000.099999999999,20000,78.986159267788238,40,37]
[null,20000.099999999999,24000,80.253384684219938,40,37]
[null,24000.1,25000,77.255890994878641,40,37]
[null,25000.1,30000,76.657994268618992,40,37]
[null,30000.1,36000,76.462225292832542,40,37]
[null,36000.1,42000,74.300475879174542,40,37]
[null,42000.1,48000,73.943949750887313,40,37]
[null,48000.1,50000,73.058620174512257,40,37]
[null,50000.1,54000,73.216411278212078,40,37]
[null,54000.1,60000,73.08982341482492,40,37]
[null,60000.1,100000,69.939822489030789,40,37]
[null,100000.1,200000,67.536917343237079,40,37]
[null,200000.1,"contact vendor"]
[]
[]
["BCI","Low Quality, No Heating or Cooling"]
[3,"Size needed (sf)","Size selected (sf)","Avg. Unit Cost","Useful Life (large)","Useful Life (small)"]
["bldg_lo_cost_cl",0,500,82.949395234053739,40,37]
[null,500.1,1000,73.170019811406391,40,37]
[null,1000.1,2000,68.53883365914254,40,37]
[null,2000.1,3000,66.408060860520791,40,37]
[null,3000.1,4000,63.257473506680192,40,37]
[null,4000.1,5000,60.408275391478242,40,37]
[null,5000.1000000000004,7500,58.854464773370694,40,37]
[null,7500.1,8000,58.482028709616138,40,37]
[null,8000.1,10000,56.183849141463291,40,37]
[null,10000.1,12000,56.692229832251236,40,37]
[null,12000.1,15000,54.720451594550809,40,37]
[null,15000.1,18000,53.767203715110774,40,37]
[null,18000.099999999999,20000,52.550750629754958,40,37]
[null,20000.099999999999,24000,53.493294337646169,40,37]
[null,24000.1,25000,51.803026529133341,40,37]
[null,25000.1,30000,51.415535996885815,40,37]
[null,30000.1,36000,51.487848576612862,40,37]
[null,36000.1,42000,50.117307682256182,40,37]
[null,42000.1,48000,49.935124498178141,40,37]
[null,48000.1,50000,49.527297235728497,40,37]
[null,50000.1,54000,49.539971941458788,40,37]
[null,54000.1,60000,49.686613621419859,40,37]
[null,60000.1,100000,47.906679085154622,40,37]
[null,100000.1,200000,46.553991615109346,40,37]
[null,200000.1,"contact vendor"]
[]
[]
["BCI","Mid Quality, No Heating or Cooling"]
[3,"Size needed (sf)","Size selected (sf)","Avg. Unit Cost","Useful Life (large)","Useful Life (small)"]
["bldg_mid_cost_cl",0,500,101.17723932234736,40,37]
[null,500.1,1000,89.549733186491792,40,37]
[null,1000.1,2000,83.707093658793937,40,37]
[null,2000.1,3000,80.578262234715552,40,37]
[null,3000.1,4000,76.839208714667478,40,37]
[null,4000.1,5000,73.477695884834702,40,37]
[null,5000.1000000000004,7500,71.046949060768284,40,37]
[null,7500.1,8000,70.628128384261927,40,37]
[null,8000.1,10000,68.058172523971237,40,37]
[null,10000.1,12000,68.37187004422897,40,37]
[null,12000.1,15000,66.026986177739261,40,37]
[null,15000.1,18000,64.917013217014173,40,37]
[null,18000.099999999999,20000,63.585111400400173,40,37]
[null,20000.099999999999,24000,64.56926298622659,40,37]
[null,24000.1,25000,62.61624600928365,40,37]
[null,25000.1,30000,62.203025323966152,40,37]
[null,30000.1,36000,62.25815175582801,40,37]
[null,36000.1,42000,60.699820874304322,40,37]
[null,42000.1,48000,60.502543719819151,40,37]
[null,48000.1,50000,60.034344500777173,40,37]
[null,50000.1,54000,60.065611542058981,40,37]
[null,54000.1,60000,60.177930458107063,40,37]
[null,60000.1,100000,58.134950664379033,40,37]
[null,100000.1,200000,56.599031319333506,40,37]
[null,200000.1,"contact vendor"]
[]
[]
["BCI","Small Low Cost Shed"]
[3,"Size needed (sf)","Size selected (sf)","Avg. Unit Cost","Useful Life (large)","Useful Life (small)"]
["bldg_shed_cost_cl",0,500,41.981048759611276,25,20]
[null,500.1,"contact vendor","contact vendor"]
[]
[]
["bls1148","Air conditioning system"]
[35,"Size needed (tons)","Size selected (tons)","Avg. Unit Cost","Useful Life (large)","Useful Life (small)"]
["hvac_ac_cost_cl",0,3.33,9670.2931555682117,25,20]
[null,3.34,6.66,19604.801971124623,25,20]
[null,6.67,16.66,60241.170477310159,25,20]
[null,16.670000000000002,33.33,132107.82999410125,25,20]
[null,33.339999999999996,66.66,290637.22598702274,25,20]
[null,66.67,113.32,602411.70477310172,25,20]
[null,113.33,"contact vendor","contact vendor",25,20]
[]
[]
["bls106","Electric resistance heaters"]
[24,"Size needed (MBH)","Size selected (MBH)","Avg. Unit Cost","Useful Life (large)","Useful Life (small)"]
["hvac_elec_cost_cl",0,41,22881.177245719478,25,20]
[null,41.1,103,48281.383179041099,25,20]
[null,103.1,461,82986.881084365028,25,20]
[null,461.1,820,179848.1523419281,25,20]
[null,820.1,1010,230365.17348121607,25,20]
[null,1010.1,1432,317775.46894101053,25,20]
[null,1432.1,2273,402183.92188141239,25,20]
[null,2273.1,3071,592292.9177441732,25,20]
[null,3071.1,6148,1019986.2034687032,25,20]
[null,6148.1,"contact vendor","contact vendor",25,20]
[]
[]
["bls106","Natural gas condensing furnace"]
[24,"Size needed (MBH)","Size selected (MBH)","Avg. Unit Cost","Useful Life (large)","Useful Life (small)"]
["hvac_gas_cost_cl",0,80,25602.895164297915,25,20]
[null,80.099999999999994,163,33798.47247745972,25,20]
[null,163.1,544,85316.833127544,25,20]
[null,544.1,1088,148780.58268206794,25,20]
[null,1088.0999999999999,3264,347553.8360037845,25,20]
[null,3264.1,5032,664944.84243725031,25,20]
[null,5032.1000000000004,"contact vendor","contact vendor",25,20]
[]
[]
["bls106","Natural gas non-condensing furnace"]
[24,"Size needed (MBH)","Size selected (MBH)","Avg. Unit Cost","Useful Life (large)","Useful Life (small)"]
["hvac_gas_non_cost_cl",0,80,25602.895164297915,25,20]
[null,80.099999999999994,163,33798.47247745972,25,20]
[null,163.1,544,85316.833127544,25,20]
[null,544.1,1088,148780.58268206794,25,20]
[null,1088.0999999999999,3264,347553.8360037845,25,20]
[null,3264.1,5032,664944.84243725031,25,20]
[null,5032.1000000000004,"contact vendor","contact vendor",25,20]
[]
[]
["bls1148","Heat pump"]
[35,"Size needed (MBH)","Size selected (MBH)","Avg. Unit Cost","Useful Life (large)","Useful Life (small)"]
["hvac_hp_cost_cl",0,0.5,3499.9402946037803,25,20]
[null,0.51,0.75,3818.1166850223062,25,20]
[null,0.76,1,3320.9660749933601,25,20]
[null,1.01,1.5,3440.2822214003072,25,20]
[null,1.51,2,3678.9145142142015,25,20]
[null,2.0099999999999998,2.5,3957.3188558304109,25,20]
[null,2.5099999999999998,3,4215.8371730454628,25,20]
[null,3.01,3.5,4673.2157342720939,25,20]
[null,3.51,4,5031.1641734929344,25,20]
[null,4.01,5,5548.2008079230391,25,20]
[null,5.01,7.5,10698.681127822922,25,20]
[null,7.51,10,13979.875154013967,25,20]
[null,10.01,12,16545.172301763327,25,20]
[null,12.01,15,22272.347329296786,25,20]
[null,15.01,20,24340.493867017205,25,20]
[null,20.010000000000002,25,33090.344603526653,25,20]
[null,25.01,30,36272.108507711906,25,20]
[null,30.01,40,51226.398857382614,25,20]
[null,40.01,50,57908.103056171647,25,20]
[null,50.01,"contact vendor","contact vendor"]
[]
[]
["bls106","Mid-efficiency oil furnace"]
[24,"Size needed (MBH)","Size selected (MBH)","Avg. Unit Cost","Useful Life (large)","Useful Life (small)"]
["hvac_oil_mid_cost_cl",0,109,33211.104507045966,25,20]
[null,109.1,235,48501.076036258157,25,20]
[null,235.1,940,136430.59363223112,25,20]
[null,940.1,1600,217947.87332748919,25,20]
[null,1600.1,2480,338688.94869201374,25,20]
[null,2480.1,3350,424981.29916439997,25,20]
[null,3350.1,"contact vendor","contact vendor",25,20]
[]
[]
["bls106","Standard efficiency oil furnace"]
[24,"Size needed (MBH)","Size selected (MBH)","Avg. Unit Cost","Useful Life (large)","Useful Life (small)"]
["hvac_oil_std_cost_cl",0,109,33211.104507045966,25,20]
[null,109.1,235,48501.076036258157,25,20]
[null,235.1,940,136430.59363223112,25,20]
[null,940.1,1600,217947.87332748919,25,20]
[null,1600.1,2480,338688.94869201374,25,20]
[null,2480.1,3350,424981.29916439997,25,20]
[null,3350.1,"contact vendor","contact vendor",25,20]
[]
[]
[null,"Building maintenance (labor and materials)","building_matl_rate_cl",5.2250562508969765,"/sf/yr"]
[]
[]
[null,"Cooling system maintenance (labor and materials)","cooling_matl_rate_cl",6.6414141414141412E-2,"/sf/yr"]
[]
[]
[null,"Heating oil cost","diesel_cost_cl",3.9758333333333336,"/gal"]
[]
[]
[null,"Energy cost","energy_cost_cl",0.10277862595419847,"/kwh"]
[]
[]
[null,"Natural gas cost","gas_cost_cl",1.0215033782528224,"/therm"]
[]
[]
[null,"Heating system maintenance (labor and materials)","heating_matl_rate_cl",0.11981962481962481,"/sf/yr"]
[]
[]
["ECI","Labor Costs",null,null,"Inf. Adj. Rates"]
[5,"Design Flow Needed (mgd)","Design Flow (mgd)","Average Water Treatment Plant Operators3","Technical Rate (Loaded)","Managerial Rate (Loaded)","Clerical Rate (Loaded)"]
["labor_table_cl",0,0.03,1,28.817737383401102,40.849385314518059,27.519968906960059]
[null,3.1E-2,0.124,1,28.817737383401102,40.849385314518059,27.519968906960059]
[null,0.1241,0.30499999999999999,1.2,28.817737383401102,40.849385314518059,27.519968906960059]
[null,0.30509999999999998,0.74,1.2,28.817737383401102,40.849385314518059,27.519968906960059]
[null,0.74099999999999999,2.1520000000000001,1.6,30.746197082037792,46.719665151877543,27.519968906960059]
[null,2.1520999999999999,7.3650000000000002,2.8,32.456340588375987,52.044154508490791,35.537024635254724]
[null,7.3651,22.614000000000001,3.8,33.875395838316194,60.728287491030855,35.537024635254724]
[null,22.614100000000001,75.069999999999993,7.8,39.588002870126765,64.876295144702226,35.537024635254724]
[]
[]
["CPI","Land Costs"]
[6,"System Size  greater than (MGD)","Assumed Population","Unit Cost ($/acre)"]
["land_cost_cl",0,"25-100",21571.311771739129]
[null,3.1E-2,"101-500",20116.596592391303]
[null,0.1241,"501-1,000",14187.587728260867]
[null,0.30509999999999998,"1,001-3,300",17503.426766304347]
[null,0.74099999999999999,"3,301-10,000",35363.885456521733]
[null,2.1520999999999999,"10,001-50,000",41974.040331521734]
[null,7.3651,"50,001-100,000",43302.148445652172]
[null,22.614100000000001,"100,001-1,000,000",125211.85535869564]
[]
[]
[null,"NEPA Compliance Costs"]
[null,"Land area (acres)","Permit Cost (inf. adj.)"]
["NEPA_cost_cl",0,1645.8918478260869]
[null,1.0009999999999999,9115.7086956521725]
[]
[]
[null,"Non-hazardous waste disposal","nonhaz_disposal_cost_cl",66.2,"/ton"]
[]
[]
[null,"Non-hazardous waste transportation","nonhaz_transportation_cost_cl",0.49978997951868925,"/ton-mile"]
[]
[]
[null,"Pilot study costs"]
[null,"Model ","Total (current yr $)"]
[null,"Large systems"]
["pilot_cost_large_cl","GAC",78624.358426005128]
[null,"PTA",0]
[null,"Medium systems"]
["pilot_cost_medium_cl","GAC",78624.358426005128]
[null,"PTA",0]
[null,"Small systems"]
["pilot_cost_small_cl","GAC",14857.292557741657]
[null,"PTA",0]
[]
[]
["RMP_cost_cl","Risk Management Plan",1937.0880978260868,1530]
[]
[]
[null,"Storm Water Permit Costs"]
[null,"Land area (acres)","Permit Cost (inf. adj.)"]
["SW_permit_cost_cl",0,0]
[null,1,2354.8914130434782]
[null,5,2570.1234239130431]

{"sheet":"Engineering Data","index":25,"n_rows":233,"n_cols":8,"rows_kept":233,"cut":false,"hidden":false,"merged":[]}
["Engineering Data"]
["This sheet is used internally and contains engineering reference and indirect cost data extracted from the central cost database"]
[]
["Architectural Fee"]
["Building cost lookup","Corresponds to the range","Architectural fee"]
[0,"<$250,000",0.09]
[250000,"$250,000 to $500,000",0.08]
[500000,"$500,000 to $1,000,000",7.0000000000000007E-2]
[1000000,"$1,000,000 to $5,000,000",6.2E-2]
[5000000,"$5,000,000 to $10,000,000",5.2999999999999999E-2]
[10000000,"$10,000,000 to $50,000,000",4.9000000000000002E-2]
[50000000,">$50,000,000",4.4999999999999998E-2]
[]
[]
["Blower dimensions"]
["Blower rating needed (cfm)","Blower rating selected (cfm)","rated hp","max  pressure psi","Length (in)","Width (in)","Length (ft)","Width (ft)"]
[0,265,7.5,4,48,20,4,1.6666666666666667]
[266,540,15,4,57,28,4.75,2.3333333333333335]
[541,1080,30,4,70,40,5.833333333333333,3.3333333333333335]
[1081,3475,100,4,78,55,6.5,4.583333333333333]
[3476,4000,125,6,88,72,7.333333333333333,6]
[4001,5000,140,5,100,84,8.3333333333333339,7]
[]
[]
["Catalytic Oxidizer Dimensions"]
["Rating needed (cfm)","Rating selected (cfm)","Length (in)","Width (in)","Length (ft)","Width (ft)"]
[0,1000,96,54,8,4.5]
[1001,1500,96,54,8,4.5]
[1501,2000,120,66,10,5.5]
[2001,3000,120,66,10,5.5]
[3001,4000,120,78,10,6.5]
[4001,5000,120,90,10,7.5]
[5001,10000,144,96,12,8]
[10001,20000,168,120,14,10]
[20001,40000,192,192,16,16]
[40001,80000,384,384,32,32]
[80001,120000,576,576,48,48]
[]
[]
["Construction Management Fee"]
["Building cost lookup","Corresponds to the range","Construction management fee"]
[0,"<$100,000",0.1]
[100000,"$100,000 to $250,000",0.09]
[250000,"$250,000 to $1,000,000",0.06]
[1000000,"$1,000,000 to $5,000,000",0.05]
[5000000,"$5,000,000 to $10,000,000",0.04]
[10000000,">$10,000,000",3.2000000000000001E-2]
[]
[]
["Contingency Factors"]
["Project direct cost","Corresponds to the range","Default contingency (prior to application of technology complexity factor)"]
[0,"<$500,000",6.7000000000000004E-2]
[500000,"$500,000 to $3,000,000",5.8000000000000003E-2]
[3000000,"$3,000,000 to $15,000,000",4.9000000000000002E-2]
[15000000,"$15,000,000 to $50,000,000",4.1000000000000002E-2]
[50000000,"$50,000,000 to $100,000,000",3.2000000000000001E-2]
[100000000,">$100,000,000",5.8000000000000003E-2]
[]
[]
["H2SO4 Properties"]
["Percent H2SO4","Specific Gravity","Concentration (lbs/cubic ft)","Concentration (lbs/gallon)"]
[0.02,1.0118,1.2629999999999999,0.16889999999999999]
[0.75,1.6692,78.150000000000006,10.45]
[0.76,1.681,79.75,10.66]
[0.77,1.6927000000000001,81.37,10.88]
[0.78,1.7042999999999999,82.99,11.09]
[0.79,1.7158,84.62,11.31]
[0.8,1.7272000000000001,86.26,11.53]
[0.81,1.7383,87.9,11.75]
[0.82,1.7491000000000001,89.54,11.97]
[0.83,1.7594000000000001,91.16,12.19]
[0.84,1.7693000000000001,92.78,12.4]
[0.85,1.7786,94.38,12.62]
[0.86,1.7871999999999999,95.95,12.83]
[0.87,1.7950999999999999,97.49,13.03]
[0.88,1.8022,99.01,13.23]
[0.89,1.8087,100.5,13.43]
[0.9,1.8144,101.9,13.63]
[0.91,1.8194999999999999,103.4,13.82]
[0.92,1.8240000000000001,104.8,14]
[0.93,1.8279000000000001,106.1,14.19]
[0.94,1.8311999999999999,107.5,14.36]
[0.95,1.8337000000000001,108.7,14.54]
[]
[]
["HCl Properties"]
["Percent HCL","Specific Gravity","Concentration (lbs/cubic ft)","Concentration (lbs/gallon)"]
[0.01,1.0032000000000001,0.62629999999999997,8.3699999999999997E-2]
[0.02,1.0082,1.2589999999999999,0.16800000000000001]
[0.04,1.0181,2.5419999999999998,0.33989999999999998]
[0.06,1.0279,3.85,0.51470000000000005]
[0.08,1.0376000000000001,5.1820000000000004,0.69269999999999998]
[0.1,1.0474000000000001,6.5890000000000004,0.87409999999999999]
[0.12,1.0573999999999999,7.9210000000000003,1.0589999999999999]
[0.14000000000000001,1.0674999999999999,9.33,1.2470000000000001]
[0.16,1.0775999999999999,10.76,1.4390000000000001]
[0.18,1.0878000000000001,12.22,1.6339999999999999]
[0.2,1.0980000000000001,13.71,1.883]
[0.22,1.1083000000000001,15.22,2.0350000000000001]
[0.24,1.1187,16.760000000000002,2.2410000000000001]
[0.26,1.129,18.32,2.4500000000000002]
[0.28000000000000003,1.1392,19.91,2.6619999999999999]
[0.3,1.1493,21.52,2.8769999999999998]
[0.32,1.1593,23.16,3.0960000000000001]
[0.34,1.1691,24.81,3.3170000000000002]
[0.36,1.1789000000000001,26.49,3.5419999999999998]
[0.38,1.1884999999999999,28.19,3.7690000000000001]
[0.4,1.198,29.92,3.9990000000000001]
[]
[]
["Maximum cooling capacity for heat pump","hp_max_cool_cl",50,"tons"]
[]
[]
["Maximum heating capacity for heat pump","hp_max_heat_cl",200,"MBH"]
[]
[]
["Maximum cooling capacity","max_cool_cl",113.32,"tons"]
[]
[]
["Maximum heating capacity","max_heat_cl",6148,"MBH"]
[]
[]
["NaOH Properties"]
["Percent NaOH","Concentration (lbs/gallon)","Concentration (g/L)","Specific Gravity"]
[0.02,0.1704,20.41,1.0209999999999999]
[0.04,0.34810000000000002,41.71,1.0429999999999999]
[0.06,0.53320000000000001,63.89,1.0649999999999999]
[0.08,0.72560000000000002,86.95,1.087]
[0.1,0.9254,110.9,1.109]
[0.12,1.133,135.69999999999999,1.131]
[0.14000000000000001,1.347,161.4,1.153]
[0.16,1.569,188,1.175]
[0.18,1.798,215.5,1.1970000000000001]
[0.2,2.0350000000000001,243.8,1.2190000000000001]
[0.22,2.2789999999999999,273,1.2410000000000001]
[0.24,2.5289999999999999,303.10000000000002,1.2629999999999999]
[0.26,2.7879999999999998,334,1.2849999999999999]
[0.28000000000000003,3.0529999999999999,365.8,1.306]
[0.3,3.3239999999999998,398.4,1.3280000000000001]
[0.32,3.6019999999999999,431.7,1.349]
[0.34,3.8860000000000001,465.7,1.37]
[0.36,4.1760000000000002,500.4,1.39]
[0.38,4.4720000000000004,535.79999999999995,1.41]
[0.4,4.7729999999999997,572,1.34]
[0.42,5.08,608.70000000000005,1.4490000000000001]
[0.44,5.3920000000000003,646.1,1.468]
[0.46,5.7089999999999996,684.2,1.4870000000000001]
[0.48,6.0350000000000001,723.1,1.506]
[0.5,6.3639999999999999,762.7,1.5249999999999999]
[]
[]
["Performance Bond"]
["Direct cost lookup","Corresponds to the range","Base cost","Plus fraction","Of amount over"]
[0,"<$100,000",0,2.5000000000000001E-2,0]
[100000,"$100,000 to $500,000",2500,1.4999999999999999E-2,100000]
[500000,"$500,000 to $2,500,000",8500,0.01,500000]
[2500000,"$2,500,000 to $5,000,000",28500,7.4999999999999997E-3,2500000]
[5000000,"$5,000,000 to $7,500,000",47250,7.0000000000000001E-3,5000000]
[7500000,">$7,500,000",64750,6.0000000000000001E-3,7500000]
[]
[]
["Pipe Size Selection"]
["Flow (GPM)","Diameter (inch)","Maximum Flow (GPM)"]
[0,0.5,2]
[2.1,0.75,4]
[4.0999999999999996,1,7]
[7.1,1.5,21]
[21.1,2,41]
[41.1,2.5,66]
[66.099999999999994,3,116]
[116.1,4,238]
[238.1,6,697]
[697.1,8,1435]
[1435.1,10,2608]
[2608.1,12,4132]
[4132.1000000000004,14,5299]
[5299.1,16,7528]
[7528.1,18,10265]
[10265.1,20,13643]
[13643.1,24,22174]
[22174.1,30,50561]
[50561.1,36,81777]
[81777.100000000006,42,122025]
[122025.1,48]
[]
[]
["Pump Dimensions (for centrifugal pumps)"]
["Pump Rating Needed (gpm)","Pump Rating Selected (gpm)","Length (ft)","Width (ft)"]
[0,350,2.5,2.5]
[351,1740,3.75,3.75]
[1741,7000,5,5]
[7001,35000,7.083333333333333,7.083333333333333]
[]
[]
["Thrust Blocks for Yard Piping"]
["Pipe Diameter (inches)"," Thrust Force","Based on 90 degree angles"]
["Size Needed","kg","Size Selected"]
[0,347.63563037472028,2]
[2.1,681.91181843044774,3]
[3.1,1260.0087440508869,4]
[4.0999999999999996,2835.0196741144964,6]
[6.1,4990.7439767005962,8]
[8.1,7813.4106239126322,10]
[10.1,11192.326806056015,12]
[12.1,15314.284822868764,14]
[14.1,20002.331197216343,16]
[16.100000000000001,25315.450421476933,18]
[18.100000000000001,31130.717767160371,20]
[20.100000000000001,45064.326572600447,24]
[24.1,61050.596681665913,28]
[28.1,70505.385478216151,30]
[30.1,124768.59941751491,40]
[40.1,137828.56340581886,42]
[42.1,180257.30629040179,48]
[]
[]
["Thermal Oxidizer Dimensions"]
["Rating needed (cfm)","Rating selected (cfm)","Length (in)","Width (in)","Length (ft)","Width (ft)"]
[0,100,72,54,6,4.5]
[101,300,84,54,7,4.5]
[301,500,144,54,12,4.5]
[501,1000,120,66,10,5.5]
[1001,1500,144,66,12,5.5]
[1501,2000,144,66,12,5.5]
[2001,3000,144,78,12,6.5]
[3001,4000,168,78,14,6.5]
[4001,5000,72,72,6,6]
[5001,10000,84,84,7,7]
[10001,15000,96,96,8,8]
[15001,20000,96,96,8,8]
[20001,40000,192,192,16,16]
[40001,80000,384,384,32,32]
[80001,120000,576,576,48,48]

{"sheet":"Lookup Tables","index":26,"n_rows":40,"n_cols":1,"rows_kept":40,"cut":false,"hidden":false,"merged":[]}
["Lookup Tables and Input Validation"]
["This sheet is used internally to support input sheet data validation"]
[]
["comp_level_valid"]
["low cost"]
["mid cost"]
["high cost"]
[]
["system_automation_valid"]
["manual"]
["semi-automated"]
["fully automated"]
[]
["retrofit_valid"]
["retrofit for greater removal"]
["retrofit for new contaminant"]
[]
["og_tech_list"]
[{"$f":"IF(contam=2,\"\",\"none\")","v":"none"}]
[{"$f":"IF(contam=2,\"\",\"GAC\")","v":"GAC"}]
[{"$f":"IF(contam=2,\"\",\"Thermal Oxidation\")","v":"Thermal Oxidation"}]
[{"$f":"IF(contam=2,\"\",\"Catalytic Oxidation\")","v":"Catalytic Oxidation"}]
[]
["contam_list"]
["MTBE"]
["Radon"]
["TCE"]
["PCE"]
["Vinyl Chloride"]
["Carbon Tetrachloride"]
["Benzene"]
["1,2-Dichloropropane"]
["Methylene Chloride"]
["1,2-Dichloroethane"]
["1,3-Butadiene"]
["1,1-Dichloroethane"]
["1,1,1,2-Tetrachloroethane"]
["1,1,2,2-Tetrachloroethane"]
["1,2,3-Trichloropropane"]
["Other"]