{"text_format":"1","workbook":"xlsx","n_sheets":27,"sheets":["Title Page","Index","INPUT","OUTPUT","Air and Packing Reference","Critical Design Assumptions","O&M Assumptions","Indirect Assumptions","Offgas Assumptions","Onda","Tower Design","Retrofit","Chemical Use","Offgas","Pumps Pipe Structure","Instrumentation and Control","O&M","HVAC","Indirect","Henry's Reference","Standard Inputs","Design Macros","Cost Equations","Cost Coefficients","Cost Data","Engineering Data","Lookup Tables"],"not_rendered":{"charts":0,"images":0,"macros":1,"external_links":0,"defined_names":1179,"comments":17,"pivot_tables":0},"unopened":[],"bounds":{"document_bytes":16777216,"sheet_cells":100000,"rows_first":2000,"rows_last":500,"rows_between":2000,"halvings":0,"cell_chars":16384,"cell_head_chars":4096},"cells_cut":0,"cells_raw":0,"read":"whole","date_system":"1900"}

{"sheet":"Title Page","index":0,"n_rows":12,"n_cols":1,"rows_kept":12,"cut":false,"hidden":false,"merged":[]}
["US EPA, Office of Water, Office of Ground Water & Drinking Water"]
["Work Breakdown Structure (WBS) Model for Packed Tower Aeration (PTA) Treatment"]
["Release Date: August 12, 2014"]
["· This model is designed to assist EPA in estimating national compliance costs for drinking water regulations."]
["· As such, the costs are intended to be representative of typical facilities."]
["· The costs, however, do not account for all of the site-specific factors that could affect the cost of any given individual facility."]
["· Use of this model requires Excel 2007."]
["· The model should be opened as Read-only, so that any changes you make are saved under a new file name."]
{"$rows_left_out":5}
{"sheet":"Index","index":1,"n_rows":251,"n_cols":2,"rows_kept":251,"cut":false,"hidden":false,"merged":[]}
["INDEX"]
["This page provides an index to all user-adjustable inputs and assumptions.  Click on a variable name to go directly to the adjustable cells."]
[]
["User-adjustable Input or Assumption","Variable Name and Link"]
["Acceleration of gravity","G"]
["Access space for each pump","space_pumps"]
["Additional height added per tower","r_xtraheight_I"]
["Additional pump head required","add_head"]
{"$rows_left_out":244}
{"sheet":"INPUT","index":2,"n_rows":114,"n_cols":9,"rows_kept":114,"cut":false,"hidden":false,"merged":[]}
["PACKED TOWER AERATION (PTA) SYSTEM DESIGN AND COST INPUT"]
[]
[null,null,null,null,"STEP 1"]
[null,null,null,null,"Select Contaminant"]
[]
[]
[null,null,null,null,"STEP 2",null,null,{"$f":"IF(OR('Standard Inputs'!AV9,'Standard Inputs'!AV17,'Standard Inputs'!AV25,'Standard Inputs'!AV33,'Standard Inputs'!AV41,'Standard Inputs'!AV49,'Standard Inputs'!AV57,'Standard Inputs'!AV65,'Standard Inputs'!AV73,'Standard Inputs'!AV81,'Standard Inputs'!AV89,'Standard Inputs'!AV97,'Standard Inputs'!AV105,'Standard Inputs'!AV113,'Standard Inputs'!AV121,'Standard Inputs'!AV129),\"<- Using this design\",IF(OR('Standard Inputs'!AW9,'Standard Inputs'!AW17,'Standard Inputs'!AW25,'Standard Inputs'!AW33,'Standard Inputs'!AW41,'Standard Inputs'!AW49,'Standard Inputs'!AW57,'Standard Inputs'!AW65,'Standard Inputs'!AW73,'Standard Inputs'!AW81,'Standard Inputs'!AW89,'Standard Inputs'!AW97,'Standard Inputs'!AW105,'Standard Inputs'!AW113,'Standard Inputs'!AW121,'Standard Inputs'!AW129),\"<- You modified this design\",\"\"))","v":"<- Using this design"},{"$f":"IF(contam=16,\" Note: standard designs not defined for other contaminants.  Use manual input or set designs on Standard Inputs page.\",\"\")","v":""}]
[null,null,null,null,"Select one of the eight standard designs at right",null,null,{"$f":"IF(OR('Standard Inputs'!AV10,'Standard Inputs'!AV18,'Standard Inputs'!AV26,'Standard Inputs'!AV34,'Standard Inputs'!AV42,'Standard Inputs'!AV50,'Standard Inputs'!AV58,'Standard Inputs'!AV66,'Standard Inputs'!AV74,'Standard Inputs'!AV82,'Standard Inputs'!AV90,'Standard Inputs'!AV98,'Standard Inputs'!AV106,'Standard Inputs'!AV114,'Standard Inputs'!AV122,'Standard Inputs'!AV130),\"<- Using this design\",IF(OR('Standard Inputs'!AW10,'Standard Inputs'!AW18,'Standard Inputs'!AW26,'Standard Inputs'!AW34,'Standard Inputs'!AW42,'Standard Inputs'!AW50,'Standard Inputs'!AW58,'Standard Inputs'!AW66,'Standard Inputs'!AW74,'Standard Inputs'!AW82,'Standard Inputs'!AW90,'Standard Inputs'!AW98,'Standard Inputs'!AW106,'Standard Inputs'!AW114,'Standard Inputs'!AW122,'Standard Inputs'!AW130),\"<- You modified this design\",\"\"))","v":""}]
{"$rows_left_out":107}
{"sheet":"OUTPUT","index":3,"n_rows":411,"n_cols":35,"rows_kept":411,"cut":false,"hidden":false,"merged":[[335,2,335,3],[27,22,29,22],[27,8,29,8],[27,9,29,9],[27,10,29,10],[27,11,29,11],[27,12,29,12],[27,13,27,21],[28,13,28,15],[28,16,28,18],[27,0,29,0],[27,1,29,1],[27,2,29,3],[27,4,29,5],[27,6,29,7],[27,32,28,33],[335,4,335,5],[28,19,28,21],[27,23,27,31],[28,23,28,25],[28,26,28,28],[28,29,28,31]]}
["OUTPUT SUMMARY"]
[null,"Parameter","Value","Units"]
[null,"Technology","PTA"]
[null,"Contaminant Type",{"$f":"VLOOKUP(contam,contaminant_lookup,2)&IF(retrofit=1,\" Retrofit\",\"\")","v":"TCE"}]
[null,{"$f":"IF(retrofit=1,\"Original \",\"\")&\"Percent Removal\"","v":"Percent Removal"},{"$f":"P_REM","v":0.9}]
[null,"System Size Category",{"$f":"IF(ss_cat2=1,\"small\",\"large\")","v":"small"}]
[null,"Design Flow",{"$f":"design_flow","v":0.03},"MGD (excludes bypass flow)"]
[null,"Average Flow",{"$f":"average_flow","v":7.0000000000000001E-3},"MGD (excludes bypass flow)"]
{"$rows_left_out":404}
{"sheet":"Air and Packing Reference","index":4,"n_rows":131,"n_cols":14,"rows_kept":131,"cut":false,"hidden":false,"merged":[[125,0,127,1],[125,2,125,3],[125,4,125,5],[126,2,126,3],[126,4,126,5],[127,2,128,2],[127,4,128,4],[126,6,126,7],[127,6,128,6],[51,6,51,7],[52,6,52,7],[53,6,54,6],[73,6,73,7],[72,6,72,7],[100,6,101,6],[98,6,98,7],[61,6,61,7],[99,6,99,7],[125,6,125,7],[90,6,90,7],[91,6,92,6],[63,6,64,6],[89,6,89,7],[32,0,33,0],[53,4,54,4],[51,8,51,9],[61,0,63,1],[61,2,61,3],[62,2,62,3],[51,0,53,1],[51,2,51,3],[52,2,52,3],[61,8,61,9],[62,8,62,9],[51,4,51,5],[52,4,52,5],[63,2,64,2],[53,2,54,2],[53,8,54,8],[51,10,51,11],[52,10,52,11],[52,8,52,9],[53,10,54,10],[62,6,62,7],[61,10,61,11],[62,10,62,11],[99,10,99,11],[98,0,100,1],[98,2,98,3],[99,2,99,3],[98,4,98,5],[99,4,99,5],[100,8,101,8],[100,10,101,10],[100,2,101,2],[100,4,101,4],[98,10,98,11],[63,10,64,10],[62,12,62,13],[61,12,61,13],[74,4,75,4],[73,4,73,5],[72,4,72,5],[74,8,75,8],[73,8,73,9],[72,8,72,9],[63,8,64,8],[63,12,64,12],[61,4,61,5],[62,4,62,5],[98,8,98,9],[99,8,99,9],[81,0,83,1],[81,2,81,3],[83,4,84,4],[91,4,92,4],[89,4,89,5],[89,0,91,1],[89,2,89,3],[90,2,90,3],[91,2,92,2],[83,2,84,2],[82,2,82,3],[81,4,81,5],[90,4,90,5],[82,4,82,5],[74,6,75,6],[111,0,113,1],[113,2,114,2],[113,4,114,4],[111,2,111,3],[112,2,112,3],[111,4,111,5],[112,4,112,5],[72,0,74,1],[72,2,72,3],[73,2,73,3],[74,2,75,2]]}
["Reference data for the density and viscosity of air at various temperatures"]
[]
["Temperature (degrees K)","Viscosity (kg/m-s)","Density at 1 atm (kg/m3)"]
[250,1.6200000000000001E-5,1.4128000000000001]
[263,1.6800000000000002E-5,1.3420000000000001]
[268,1.7100000000000002E-5,1.3169999999999999]
[273,1.7400000000000003E-5,1.292]
[278,1.7600000000000001E-5,1.2689999999999999]
{"$rows_left_out":124}
{"sheet":"Critical Design Assumptions","index":5,"n_rows":173,"n_cols":7,"rows_kept":173,"cut":false,"hidden":false,"merged":[]}
["Default Critical Design Assumptions"]
["Users may change any of the cells in the Value column; cells in gold are most important and may vary based on contaminant treated and site-specific conditions"]
[]
["Assumption","Range Name","Value","Units","Guidance"]
["Cost estimating method","curve",1,"<-- enter 1 to use cost equations, leave blank to use lookup tables for component costs","Keeping this assumption with a value of 1 is strongly recommended; the cost equations method is more appropriate for national cost estimating and will be more accurate for nearly all user-specified designs"]
[]
["Tower Design Constraints"]
["Minimum packing height to diameter ratio","Min_d_rat_cda",1.5,"x tower diameter","Constraint is to maintain a practical geometry for radon removal, which in theory could operate with a low packing height.  Constraint not relevant to more conventional contaminants because design program will require high packing height to achieve removal."]
{"$rows_left_out":166}
{"sheet":"O&M Assumptions","index":6,"n_rows":61,"n_cols":5,"rows_kept":61,"cut":false,"hidden":false,"merged":[]}
["Default O&M Assumptions"]
["Users may change any of the cells in the Value column"]
[]
["Assumption","Range Name","Value","Units","Guidance"]
["Materials"]
["Cost for parts & maintenance for pumps and blowers","pump_maintenance",0.01,"of capital cost","For calculating cost of actual maintenance materials; not to be confused with depreciation; 5% would be too high (Richard E. Hubel, Peter Keenan, American Water Works Service Company, Inc)"]
["Cost for parts & maintenance for PTA towers","PTA_maintenance",0.04,"of capital cost","For calculating cost of actual maintenance materials; not to be confused with depreciation"]
[]
{"$rows_left_out":54}
{"sheet":"Indirect Assumptions","index":7,"n_rows":129,"n_cols":5,"rows_kept":129,"cut":false,"hidden":false,"merged":[[109,0,110,0],[109,1,110,1],[109,2,109,4],[120,0,121,0],[120,1,121,1],[120,2,120,4]]}
["Default Assumptions for Indirect and Add-On Costs"]
["Users may change any of the cells in the Value column"]
[]
["Assumption","Range Name","Value","Units","Guidance"]
["Permits"]
["Include permit costs?","include_permits",1,"<--- enter 1 for yes, 0 for no"]
["Always include NEPA compliance costs?","include_NEPA",0,"<--- enter 1 for yes, 2 for no","Default of 0 means NEPA compliance is included in the high component cost estimate only. Selecting 1 means NEPA compliance will be included in all estimates. Selecting 0 means NEPA compliance will never be included."]
["HCl strength to trigger RMP requirement","HCl_strength_RMP",0.37]
{"$rows_left_out":122}
{"sheet":"Offgas Assumptions","index":8,"n_rows":45,"n_cols":6,"rows_kept":45,"cut":false,"hidden":false,"merged":[[27,0,28,0],[27,1,28,1]]}
["Default Offgas Assumptions"]
["Users may change any of the cells in the Value column"]
[]
["Assumption","Range Name","Value","Units","Guidance"]
["Specific heat of air","cpa",1.01,"kJ/kg-deg C","Rough assumption to account for high temperature and relative humidity in this application"]
[]
["GAC"]
["GAC Density","GAC_density",30,"lbs/cu ft","Bulk density, not particle density.  GAC density range of 22-30 lb/cubic ft; lignite GAC approximately 22 and bituminous GAC approximately 28 lb/cubic ft (Randal J. Braker, General Manager, Duck River Utility Commission)"]
{"$rows_left_out":38}
{"sheet":"Onda","index":9,"n_rows":53,"n_cols":5,"rows_kept":53,"cut":false,"hidden":false,"merged":[]}
["Onda Calculations"]
[]
["Calculation","Range Name","Value","Units","Guidance"]
["Inputs"]
["Liquid Loading",null,{"$f":"L_LOAD","v":6.5861483130000027E-3},"m3/m2 s","Calculated on tower design, displayed here for reference"]
["Air Loading",null,{"$f":"GAS_L","v":0.61251179310900028},"m3/m2 s","Calculated on tower design, for reference"]
["Percent removal or effluent concentration","Units_rem",{"$f":"IF(Units_rem_I=\"percent removal\",1,2)","v":2},"<--- 1 for percent removal, 2 for effluent concentration"]
["Henry's Co-efficient for Onda","ONDA_H",{"$f":"HENRY","v":0.187},"atm m3/m3","From Inputs"]
{"$rows_left_out":46}
{"sheet":"Tower Design","index":10,"n_rows":91,"n_cols":22,"rows_kept":91,"cut":false,"hidden":false,"merged":[]}
["Tower Design Calculations"]
["This sheet calculates the design size and other parameters of the PTA system"]
[]
["Calculation","Range Name","Value","Units","Guidance"]
["From Inputs"]
["Maximum Design Flow (metric)","Qw",{"$f":"IF(df_units=\"cubic meters/second\",(1-bp_pct)*QW_IN,IF(df_units=\"MGD\",(1-bp_pct)*QW_IN*0.04583,IF(df_units=\"gpm\",(1-bp_pct)*QW_IN*0.04583*24*60/1000000,\"Unspecified units\")))","v":1.3749000000000001E-3},"m3/s","Converted to SI units if entered in others by user"]
["Daily Production Flow (metric)","Qwa",{"$f":"IF(af_units=\"cubic meters/second\",(1-bp_pct)*QWA_IN,IF(af_units=\"MGD\",(1-bp_pct)*QWA_IN*0.04583,IF(af_units=\"gpm\",(1-bp_pct)*QWA_IN*0.04583*24*60/1000000,QWA_IN*QW)))","v":3.2081000000000004E-4},"m3/s","Converted to SI units if entered in others by user"]
["Design flow in MGD","design_flow",{"$f":"QW/0.04583","v":0.03},"MGD","Design flow expressed in MGD"]
{"$rows_left_out":84}
{"sheet":"Retrofit","index":11,"n_rows":135,"n_cols":22,"rows_kept":135,"cut":false,"hidden":false,"merged":[]}
["Retrofit Calculations"]
[]
["Calculation","Range Name","Value","Units","Guidance"]
["1. INITIAL CALCULATIONS"]
["Is this a retrofit design?","retrofit",{"$f":"IF(retrofit_I=\"\",0,1)","v":0},"1 = retrofit, 0 = new treatment system"]
["Is there a new contaminant?","r_new_contam",{"$f":"IF(AND(retrofit=1,retrofit_I=\"retrofit for new contaminant\"),1,0)","v":0},"1 = new contaminant, 0 = same contaminant"]
["Percent removal or effluent concentration?","r_units_rem",{"$f":"IF(r_new_contam=1,IF(r_units_rem_I=\"percent removal\",1,2),Units_rem)","v":2},"1 = percent removal, 2 = effluent concentration"]
["Influent concentration","r_influent_conc",{"$f":"IF(r_new_contam=1,r_influent_conc_I,Influent_conc)","v":5},"ug/L"]
{"$rows_left_out":128}
{"sheet":"Chemical Use","index":12,"n_rows":122,"n_cols":5,"rows_kept":122,"cut":false,"hidden":false,"merged":[]}
["Chemical Use and Storage Calculations"]
[]
["Calculation","Range Name","Value","Units","Guidance"]
["Maximum Tank Sizes"]
["Maximum chemical storage tank size","max_ctank_size",{"$f":"MAX(VLOOKUP(10^6,fg_cst_cost_cl,1)-1,VLOOKUP(10^6,pl_cst_cost_cl,1)-1,VLOOKUP(10^6,ss_cst_cost_cl,1)-1)","v":30025},"gal","The largest size for which costs are available"]
["Maximum chemical storage tank size excluding stainless steel","max_ctank_size_noSS",{"$f":"MAX(VLOOKUP(10^6,fg_cst_cost_cl,1)-1,VLOOKUP(10^6,pl_cst_cost_cl,1)-1)","v":30025},"gal","The largest size for which costs are available (excluding stainless, which is not compatible with acids)"]
[]
["Chemical Use and Storage - pH adjustment"]
{"$rows_left_out":115}
{"sheet":"Offgas","index":13,"n_rows":76,"n_cols":5,"rows_kept":76,"cut":false,"hidden":false,"merged":[]}
["Offgas Calculations"]
[]
["Calculation","Range Name","Value","Units","Guidance"]
["From Inputs"]
["Off-gas Pollution Control Technology","Offgas_Tech",{"$f":"IF(OR(Offgas_Tech_I=\"none\",Offgas_Tech_I=\"\"),0,IF(Offgas_Tech_I=\"GAC\",1,IF(Offgas_Tech_I=\"thermal oxidation\",2,3)))","v":0},"<--- 0 for none, 1 for GAC, 2 for Thermal Oxidation, 3 for Catalytic Oxidation"]
["Heat recovery type","og_opt1",{"$f":"IF(OR(Offgas_Tech=2,Offgas_Tech=3),IF(og_opt1_I=\"none\",0,IF(og_opt1_I=\"recuperative\",1,2)),\"\")","v":""},"<--- 0 for none, 1 for recuperative, 2 for regenerative"]
["Spent GAC regeneration","og_opt2",{"$f":"IF(Offgas_Tech=1,IF(og_opt2_I=\"throwaway\",0,1),\"\")","v":""},"<--- 0 for throwaway (no regeneration), 1 for off-site regeneration"]
[]
{"$rows_left_out":69}
{"sheet":"Pumps Pipe Structure","index":14,"n_rows":70,"n_cols":5,"rows_kept":70,"cut":false,"hidden":false,"merged":[]}
["Pumps, Piping, and Structure Calculations"]
[]
["Calculation","Range Name","Value","Units","Guidance"]
["Booster Pumps"]
["Flow of Each Pump","Qp",{"$f":"IF(num_pumps_I=\"\",MIN(MAX(average_flow_rate+bp_flow_rate*average_flow_rate/Design_Flow_Rate,(Design_Flow_Rate+bp_flow_rate)/2)*(1+pump_safety_factor),max_pump_size),IF(num_pumps_I=0,0,(Design_Flow_Rate+bp_flow_rate)*(1+pump_safety_factor)/num_pumps_I))","v":13.020833333333332},"gpm","Includes safety factor"]
["Operating Pumps","num_of_pumps",{"$f":"IF(QP=0,0,ROUNDUP(Design_Flow_Rate/QP*(1+pump_safety_factor),0))","v":2},"units"]
["Total Pumps","tot_pumps",{"$f":"NUM_OF_PUMPS+NRD_pump","v":2},"units","Includes redundancy"]
["Maximum pump size","max_pump_size",{"$f":"VLOOKUP(10^6,pump_cost_cl,1)-1","v":10000},"gpm","The largest pump size for which costs are available.  Applies to booster pumps."]
{"$rows_left_out":63}
{"sheet":"Instrumentation and Control","index":15,"n_rows":60,"n_cols":5,"rows_kept":60,"cut":false,"hidden":false,"merged":[]}
["Instrumentation and Control Calculations"]
[]
["Calculation","Range Name","Value","Units","Guidance"]
["From Inputs"]
["Component level","component_level",{"$f":"IF(component_level_I=\"high cost\",2,IF(component_level_I=\"mid cost\",1,\"\"))","v":""},"blank = low cost, 1 = mid cost, 2 = high cost"]
["Manual system controls","manual",{"$f":"IF(manual_I=\"manual\",1,IF(manual_I=\"semi-automated\",2,IF(manual_I=\"fully automated\",3,IF(component_level=\"\",1,IF(component_level=2,3,CHOOSE(ss_cat2,1,3,3))))))","v":3},"1 = fully manual system, 2 = semi-automated system, 3 = fully automated system.","Based on system size and component level (see cell comment), unless user overrides on input sheet"]
[]
["Valves and Instrumentation"]
{"$rows_left_out":53}
{"sheet":"O&M","index":16,"n_rows":68,"n_cols":5,"rows_kept":68,"cut":false,"hidden":false,"merged":[]}
["Operation and Maintenance Calculations"]
[]
["Calculation","Range Name","Value","Units","Guidance"]
["Labor and Materials"]
["Maintenance materials"]
["Material cost for pumps","pump_materials",{"$f":"pump_maintenance*OUTPUT!J47","v":119.20752210585357},"/yr"]
["Material cost for blowers","blow_materials",{"$f":"pump_maintenance*SUMPRODUCT(OUTPUT!J62:J63,OUTPUT!L62:L63)","v":561.8587615465334},"/yr"]
["Material cost for PTA towers","pta_materials",{"$f":"PTA_maintenance*SUMPRODUCT(OUTPUT!J32:J45,OUTPUT!L32:L45)","v":2460.7300101643086},"/yr"]
{"$rows_left_out":61}
{"sheet":"HVAC","index":17,"n_rows":76,"n_cols":12,"rows_kept":76,"cut":false,"hidden":false,"merged":[]}
["Building Heating, Ventilating, and Air Conditioning Calculations"]
[]
["Calculation","Range Name","Value","Units","Guidance"]
["General information"]
["System size","ss_cat2",{"$f":"IF(design_flow<1,1,IF(design_flow<10,2,3))","v":1},"1 indicates small system, 2 indicates medium, 3 indicates large","ss_cat2 is used to select ventilation requirements and building type"]
["Buiding 1 length and width","build1_side",{"$f":"total_fp^0.5","v":13.784048752090222},"ft"]
[]
["Ventilation"]
{"$rows_left_out":69}
{"sheet":"Indirect","index":18,"n_rows":82,"n_cols":5,"rows_kept":82,"cut":false,"hidden":false,"merged":[]}
["Indirect and Add-on Cost Calculations"]
[]
["Calculation","Range Name","Value","Units","Guidance"]
["Standby Power"]
["Booster pumps",null,{"$f":"pump_energy*design_flow/average_flow/365/24*1000","v":0.14444434077427815},"kW"]
["Blowers",null,{"$f":"blow_energy*design_flow/average_flow/365/24*1000","v":0.10408869631803871},"kW"]
["Offgas blowers",null,{"$f":"IF(Offgas_Tech=2,TO_power_yr,IF(Offgas_Tech=3,CO_power_yr,0))*design_flow/average_flow/365/24*1000","v":0},"kW"]
["Lighting",null,{"$f":"(total_fp*lighting_energy_1)/365/24","v":0.18999999999999997},"kW"]
{"$rows_left_out":75}
{"sheet":"Henry's Reference","index":19,"n_rows":52,"n_cols":4,"rows_kept":52,"cut":false,"hidden":false,"merged":[]}
["Reference Data and Sources for Henry's Law Coefficient"]
["Units used in this model"]
["Sources of Henry's coefficient data for various contaminants"]
["Calculator for theoretical prediction of Henry's coefficient"]
["Converting Henry's coefficient from other units"]
["Adjusting Henry's coefficient for temperature"]
[]
["For use in this model, Henry's Coefficient must be entered in the following units:"]
{"$rows_left_out":45}
{"sheet":"Standard Inputs","index":20,"n_rows":139,"n_cols":49,"rows_kept":139,"cut":false,"hidden":false,"merged":[[5,0,5,1],[6,47,6,48],[5,30,5,34],[5,35,5,45],[5,25,5,29],[5,2,5,5],[5,6,5,10],[5,11,5,15],[5,19,5,24]]}
["Standard Designs"]
["Default inputs represent typical options used to generate national average compliance costs."]
[null,null,null,null,null,null,null,null,null,null,null,null,null,null,null,null,null,null,null,null,null,null,null,null,null,null,null,{"$f":"IF(OR(COUNTIF($AA$9:$AA$16,2)>0,COUNTIF($AA$9:$AA$16,3)>0),\"Heat recovery type\",\"\")","v":""}]
[]
[]
["Design Indices",null,"System Size",null,null,null,"Contaminant Removal",null,null,null,null,"Contaminant Properties",null,null,null,null,null,"Operating Parameters",null,"Tower Design",null,null,null,null,null,"Off-gas",null,null,null,null,"Optional",null,null,null,null,"Retrofit (optional)"]
["Contaminant Select","Design #","Design Flow","Design Flow Units","Average Flow","Average flow units","Influent Concentration (ug/L or pCi/L)","Removal units","Percent Removal or Effluenct Concentration","Safety Factor (Kla)","Safety Factor (Henrys)","Henry's Coefficient (atm m^3/m^3)","Molecular Weight (kg/kmole)","Molar Volume (m^3/kmole)","Boiling Point (K)","Melting Point (K)","Operating Temperature (K)","Density of air (kg/m^3)","Viscosity of air (kg/m-sec)","Packing size (inches)","Surface area of packing (m^2/m^3)","Critical surface tension of packing","Friction factor","Alternate packing unit cost","Clearwell Detention Time (min)","VOC Release Limit (lbs/day)","Off-gas Pollution Control Technology","Heat Recovery Type","GAC Regeneration","GAC Bed Life","Number of Pumps","Number of Blowers","Number of Redundant Towers","System Automation","Component level","Retrofit","Additional available height per tower","Height units","Henry's coefficient for new contaminant","Molecular weight of new contaminant","Molar volume of new contaminant","Boiling point of new contaminant","Melting point of new contaminant","Influent concentration of new contaminant","Removal units","Percent Removal or Effluenct Concentration","Contaminant Name","Internal Use"]
[null,null,"QW_IN","df_units","QWA_IN","af_units","Influent_Conc","Units_Rem_I","REM_I","SF_KLA","SF_HENRY","HENRY","MW_IN","MV_IN","TB_IN","TM_IN","T","PA","UA","Packing_size","AP","SP","CF","alt_pack_cost","AW_DET","max_VOC_release","Offgas_tech_I","og_opt1_I","og_opt2_I","og_opt3","num_pumps_I","parallel_I","NRD_I","manual_I","component_level_I","retrofit_I","r_xtraheight_I","r_xtraheight_units","r_Henry","r_Mw_in","r_Mv_in","r_Tb_in","r_Tm_in","r_influent_conc_I","r_units_rem_I","r_rem_I"]
{"$rows_left_out":132}
{"sheet":"Design Macros","index":21,"n_rows":19,"n_cols":3,"rows_kept":19,"cut":false,"hidden":false,"merged":[]}
["Design Macros"]
["This sheet contains constraints, starting values, and calculations used internally by the design macro to size the PTA system.  "]
[]
["Design Constraints"]
["Min_d_rat",{"$f":"Min_d_rat_cda","v":1.5},"x column diameter"]
["Max_d_rat",{"$f":"Max_d_rat_cda","v":10},"x column diameter"]
["Max_pack",{"$f":"IF(contam=1,Max_pack_MTBE,Max_pack_std)","v":6.1},"meters"]
[]
{"$rows_left_out":12}
{"sheet":"Cost Equations","index":22,"n_rows":224,"n_cols":17,"rows_kept":224,"cut":false,"hidden":false,"merged":[]}
["Cost Equations"]
["This sheet is used internally to calculate component costs using the cost equations method; see model documentation for more details on the development of cost equations"]
[]
["Component","Equation Name","Result","Variable",null,2,3,4,5,6,7,8,9,10,11,16,17]
["Pressure Vessels"]
["Shell"]
["Stainless Steel","ss_shell_eq",{"$f":"IF(D7=0,0,IF(OR(D7>P7,D7<Q7),\"contact vendor\",F7*D7^G7+H7*LN(D7)+I7+J7*EXP(K7*D7)+L7*D7^3+M7*D7^2+N7*D7+O7))","v":26378.308748081439},{"$f":"col_vol","v":121.32373803711515},"ss_shell_eq",{"$f":"VLOOKUP($E7,eq_table_cl,F$4,FALSE)","v":0},0,0,0,26169.293386130001,6.5571E-5,0,0,0,0,27025,0]
["Fiberglass","fg_shell_eq",{"$f":"IF(D8=0,0,IF(OR(D8>P8,D8<Q8),\"contact vendor\",F8*D8^G8+H8*LN(D8)+I8+J8*EXP(K8*D8)+L8*D8^3+M8*D8^2+N8*D8+O8))","v":23400.996900552374},{"$f":"col_vol","v":121.32373803711515},"fg_shell_eq",0,0,0,0,0,0,0,5.2023E-5,1.2209150280000001,23252.105175613,27025,0]
{"$rows_left_out":217}
{"sheet":"Cost Coefficients","index":23,"n_rows":69,"n_cols":17,"rows_kept":69,"cut":false,"hidden":false,"merged":[]}
["Coefficients for Component Cost Equations"]
["This sheet is used internally to calculate component costs using the cost equations method; see model documentation for more details on the development of cost equations"]
[]
[null,"Power: C1*x^C2",null,"Logarithmic: C3*Ln(x) + C4",null,"Exponential: C5*e^(C6*x)",null,"Polynomial: C7*x^3 + C8*x^2 + C9*x + C10",null,null,null,"NOTES"]
["Equation Lookup Name","C1","C2","C3","C4","C5","C6","C7","C8","C9","C10","Pct deviation of fit equation",null,"Last modified","Rsq of fit equation","max size used to gen curve","min size for which curve fits are valid"]
["al_shell_eq",0,0,0,0,0,0,-2.0000000000000001E-9,1.23702E-4,1.1827402389999999,21464.206896932999,1.1679261397373936E-2,null," 2/28/2014 2:53:18 PM",0.99986018993075898,27025,0]
["bldg_hi_eq",305.59138946299998,-0.13230006499999999,0,0,0,0,0,0,0,0,3.989110044513617E-2,null," 2/28/2014 3:27:03 PM",0.95292288207253384,200000.1,0]
["bldg_lo_eq",141.837429708,-9.6925793999999996E-2,0,0,0,0,0,0,0,0,2.5518207619233953E-2,null," 2/28/2014 3:25:26 PM",0.96714729333927962,200000.1,0]
{"$rows_left_out":62}
{"sheet":"Cost Data","index":24,"n_rows":1409,"n_cols":7,"rows_kept":1409,"cut":false,"hidden":false,"merged":[]}
["Cost Data"]
["This sheet is used internally and contains component cost data extracted from the central cost database"]
["To maintain vendor confidentiality, the central cost database itself is not provided here"]
[]
["bls1072","Aluminum Tower- Shell only"]
[25,"Size needed (gal)","Size selected (gal)","Avg. Unit Cost","Useful Life (large)","Useful Life (small)"]
["al_shell_cost_cl",0,564,21876.673498382283,25,20]
[null,565,1903,24688.520193007269,25,20]
{"$rows_left_out":1402}
{"sheet":"Engineering Data","index":25,"n_rows":233,"n_cols":8,"rows_kept":233,"cut":false,"hidden":false,"merged":[]}
["Engineering Data"]
["This sheet is used internally and contains engineering reference and indirect cost data extracted from the central cost database"]
[]
["Architectural Fee"]
["Building cost lookup","Corresponds to the range","Architectural fee"]
[0,"<$250,000",0.09]
[250000,"$250,000 to $500,000",0.08]
[500000,"$500,000 to $1,000,000",7.0000000000000007E-2]
{"$rows_left_out":226}
{"sheet":"Lookup Tables","index":26,"n_rows":40,"n_cols":1,"rows_kept":40,"cut":false,"hidden":false,"merged":[]}
["Lookup Tables and Input Validation"]
["This sheet is used internally to support input sheet data validation"]
[]
["comp_level_valid"]
["low cost"]
["mid cost"]
["high cost"]
[]
{"$rows_left_out":32}