{"text_format":"1","workbook":"xlsx","n_sheets":6,"sheets":["Read Me","Data Inputs","Design Parameters","Cost Estimate","Table A","Table B"],"not_rendered":{"charts":0,"images":0,"macros":1,"external_links":0,"defined_names":0,"comments":0,"pivot_tables":0},"unopened":[],"bounds":{"document_bytes":16777216,"sheet_cells":100000,"rows_first":2000,"rows_last":500,"rows_between":2000,"halvings":0,"cell_chars":16384,"cell_head_chars":4096},"cells_cut":0,"cells_raw":0,"read":"whole","date_system":"1900"}

{"sheet":"Read Me","index":0,"n_rows":20,"n_cols":2,"rows_kept":20,"cut":false,"hidden":false,"merged":[[18,1,18,13],[19,1,19,13],[15,1,15,13],[16,1,16,13],[17,1,17,13],[0,0,0,14],[1,0,1,14],[2,0,2,14],[3,0,3,14],[4,0,4,14],[5,0,5,14],[6,0,6,14],[8,1,8,13],[10,1,10,13],[12,1,12,13]]}
["Air Pollution Control Cost Estimation Spreadsheet"]
["For Refrigerated Surface Condensers"]
["U.S. Environmental Protection Agency "]
["Air Economics Group"]
["Health and Environmental Impacts Division"]
["Office of Air Quality Planning and Standards"]
["(November 2017)"]
[]
[null,"This spreadsheet allows users to estimate the capital and annualized costs for installing and operating refrigerated surface condensers used to control emissions of volatile organic compounds (VOCs) and hazardous air pollutants (HAP) from industrial waste gas streams. Refrigerated condensers lower the temperature of the waste stream to the temperature at which the volatile components of a vapor mixture change from the gas to liquid phase. The basic equipment required for a refrigerated condenser system includes a condenser, a single or multi-stage refrigeration unit, and auxiliary equipment, such as pre-coolers, storage tanks for recovered condensate, blowers and piping. Pre-coolers are used where the waste stream contains a water vapor or a VOC that has a high freezing point. Refrigerated condensers are typically used to control waste streams with VOC concentrations above 5,000 ppmv. The condensate can be collected for reuse or sale. "]
[]
[null,"The calculation methodologies used in this spreadsheet are those presented in the U.S. EPA's Air Pollution Control Cost Manual.  This spreadsheet is intended to be used in combination with the Control Cost Manual. For a detailed description of the technology and cost methodology, see Section 3.1 (VOC Recapture Controls), Chapter 2 (Refrigerated Condensers) of the Air Pollution Control Cost Manual (as updated in 2017). Additional control technologies may be necessary for some industrial waste gas streams.  Costs for additional control technologies can be estimated using the methods provided in other chapters of the cost manual.  A copy of the Control Cost Manual is available on the U.S. EPA's \"Technology Transfer Network\" website at: https://www.epa.gov/economic-and-cost-analysis-air-pollution-regulations/cost-reports-and-guidance-air-pollution.  "]
[]
[null,"The spreadsheet can be used to estimate capital and annualized costs for refrigerated surface condensers only. The methodology assumes a two-component mixture of VOC and air, where the emission stream is free of moisture. The methodology is designed to provide study-level cost estimates.  Actual costs, particularly those for installation, can deviate significantly from the costs generated using this spreadsheet due to site conditions. Units of measures in this spreadsheet are English.  "]
[]
[]
[null,"Instructions "]
[null,"Step 1: Please select the Data Inputs tab and click on the Reset Form button. This will reset the values on the Data Inputs tab.  "]
[null,"Step 2:  Use the drop down menu on the Data Inputs tab to select the condenser type from the drop-down list: packaged condenser, custom condenser, or gasoline vapor recovery system. "]
[null,"Step 3:  Complete all of the yellow data entry cells on the Data Inputs tab. Many of the fields are pre-populated with default values.  Where possible, replace default values provided with site-specific values in accordance with the recommendations provided in the Control Cost Manual. Use of actual values other than the default values in this spreadsheet is recommended; however, sources for all values used should be appropriately documented. The molecular weight, heat capacity, enthalpy of condensation, boiling point and Antonine constants for many commonly used VOCs are provided in Appendix A of Section 3.1 (VOC Recapture Controls), Chapter 2 (Refrigerated Condensers) of the Air Pollution Control Cost Manual (as updated in 2017)."]
[null,"Step 4: Once all of the data fields are complete, select the Design Parameters tab to see the calculated design parameters for your condenser. Select the Cost Estimate tab to view the estimated installation and operation costs for the condenser. "]

{"sheet":"Data Inputs","index":1,"n_rows":54,"n_cols":13,"rows_kept":54,"cut":false,"hidden":false,"merged":[[19,4,21,6],[52,2,52,3],[53,2,53,3],[50,4,50,8],[51,4,51,8],[52,4,52,8],[53,4,53,8],[49,4,49,8],[49,2,49,3],[44,0,45,5],[50,2,50,3],[51,2,51,3]]}
[null,null,"Data Inputs",null,null,null,null,null,null,null,null,4]
[null,null,null,null,null,null,null,null,null,null,null,null,"Packaged Condenser System"]
["Is the condenser a packaged, custom or gasoline vapor recovery system?",null,null,null,null,null,null,null,null,null,null,null,"Custom Condenser System"]
[null,null,null,null,null,null,null,null,null,null,null,null,"Gasoline Vapor Recovery System"]
["Enter the design data for the proposed condenser:"]
[]
["Number of operating hours per year and per day (Ɵs)",2080,"hours/year",8,"hours/day"]
["Volumetric flow rate of the waste stream (Qin)",100,{"$f":"\"scfm (at 77 °F; 1 atm)\"&(IF(B8=100,\"*\",\"\"))","v":"scfm (at 77 °F; 1 atm)*"},{"$f":"IF(B8=100,\"* 100 scfm is a default volumetric flow rate. User should enter actual value, if known.\",\" \")","v":"* 100 scfm is a default volumetric flow rate. User should enter actual value, if known."}]
["Inlet stream temperature (Tin)",86,{"$f":"\"°F\"&(IF(B9=86,\"*\",\"\"))","v":"°F*"},{"$f":"IF(B9=86,\"* 86 °F is a default inlet stream temperature. User should enter actual value, if known.\",\" \")","v":"* 86 °F is a default inlet stream temperature. User should enter actual value, if known."}]
["Required VOC removal efficiency (η)",90,{"$f":"\"%\"&(IF(B10=90, \"*\",\"\"))","v":"%*"},{"$f":"IF(B10=90,\"* 90% is a default control efficiency. User should enter actual value, if known.\",\" \")","v":"* 90% is a default control efficiency. User should enter actual value, if known."},null,null,null,null,null,null,null,null,{"$f":"B10/100","v":0.9}]
["Specific heat of the coolant (Cp,cool)",0.65,{"$f":"\"Btu/lb-mole-°F\"&IF(B11=0.65,\"*\",\"\")","v":"Btu/lb-mole-°F*"},{"$f":"IF(B11=0.65,\"* 0.65 Btu/lb-mole-°F is a default value. User should enter actual value, if known.\",\" \")","v":"* 0.65 Btu/lb-mole-°F is a default value. User should enter actual value, if known."}]
["Estimated equipment life (n)",15,{"$f":"\"Years\"&IF(B12=15,\"*\",\"\")","v":"Years*"},{"$f":"IF(B12=15,\"* 15 years is a default equipment life. User should enter actual value, if known.\",\" \")","v":"* 15 years is a default equipment life. User should enter actual value, if known."}]
["Overall heat transfer coefficient (U)",20,{"$f":"\"Btu/hour-ft²-°F\"&IF(B13=20,\"*\",\"\")","v":"Btu/hour-ft²-°F*"},{"$f":"IF(B13=20,\"* 20 Btu/hour-ft²-°F is a default heat transfer coefficient. User should enter actual value, if known.\",\" \")","v":"* 20 Btu/hour-ft²-°F is a default heat transfer coefficient. User should enter actual value, if known."}]
["Mechanical efficiency of compressor (ηcomp) ",85,{"$f":"\"%\"&IF(B14=85,\"*\",\"\")","v":"%*"},{"$f":"IF(B14=85,\"* 85% is a default value. User should enter actual value, if known.\",\" \")","v":"* 85% is a default value. User should enter actual value, if known."}]
[]
["Enter the Characteristics of the VOC/HAP:"]
[]
["Name of VOC/HAP","Benzene"]
[{"$f":"\"Molecular Weight of \"&B18 &\" (MW)\"","v":"Molecular Weight of Benzene (MW)"},78.11,"lb./mole",null,"Note:"]
[{"$f":"\"Density of \"&B18","v":"Density of Benzene"},7.31,"lb./gallon",null,"Values for several common compounds are included on the Table A (Physical Properties) and Table B (Antoine Constants) tabs. "]
[{"$f":"\"Heat Capacity of \"&B18&\" (Cp,voc)\"","v":"Heat Capacity of Benzene (Cp,voc)"},32.51,"Btu/lb.-mole-°F"]
[{"$f":"\"Heat of Condensation of \"&B18&\" (ΔHref)\"","v":"Heat of Condensation of Benzene (ΔHref)"},13210,"Btu/lb.-mole"]
[{"$f":"\"Boiling Point of \"&B18","v":"Boiling Point of Benzene"},176,"°F"]
[{"$f":"\"Antoine Equation Constants for \"&B18","v":"Antoine Equation Constants for Benzene"},"A","B","C"]
[null,6.9056499999999996,1211.0329999999999,220.79]
[{"$f":"\"Critical Temperature for \"&B18","v":"Critical Temperature for Benzene"},1012,"°R"]
[{"$f":"\"Volume Fraction of \"&B18&\" in waste stream entering the condenser (Yvoc,in)\"","v":"Volume Fraction of Benzene in waste stream entering the condenser (Yvoc,in)"},0.25]
[]
["Enter the cost data for the condenser:"]
[]
{"$rows_left_out":25}
{"sheet":"Design Parameters","index":2,"n_rows":55,"n_cols":6,"rows_kept":55,"cut":false,"hidden":false,"merged":[[41,0,42,0],[41,2,42,2],[41,3,42,3],[0,0,0,5],[2,0,2,5],[4,0,5,0],[4,1,5,1]]}
["Design Parameters"]
[]
["The following design parameters for the condenser were calculated based on the values entered on the Data Inputs tab. These values were used to prepare the costs shown on the Cost Estimate tab."]
[]
["VOC","VOC volume Fraction of waste stream entering the condenser (Yvoc,in) ","Heat Capacity (Cp,voc)","Heat of Condensation (ΔHref) "]
[null,null,"(Btu/lb.-mole-°F)","(Btu/lb.-mole)"]
[{"$f":"IF('Data Inputs'!B18=\"\", \"Not Applicable \", 'Data Inputs'!B18)","v":"Benzene"},{"$f":"'Data Inputs'!B27","v":0.25},{"$f":"'Data Inputs'!B21","v":32.51},{"$f":"'Data Inputs'!B22","v":13210}]
[]
["Parameter","Equation",null,"Calculated Value","Units"]
[{"$f":"\"Partial Pressure of \"&A7&\" VOC in Exit Stream (Pvoc) = \"","v":"Partial Pressure of Benzene VOC in Exit Stream (Pvoc) = "},"760 × (Mvoc,out / (Min - Mvoc, recovered)) =","760 × [Yvoc,in × (1 - η)] / [1 - (η × Yvoc,in)] =",{"$f":"760*((B7*(1-'Data Inputs'!$M$10))/(1-(B7*'Data Inputs'!$M$10)))","v":24.516129032258057},"mmHg"]
[{"$f":"\"Estimated Condensation Temperature for \"&A7&\" (Tcon) =  \"","v":"Estimated Condensation Temperature for Benzene (Tcon) =  "},"((B / (A - log (Pvoc))) - C) × 1.8 + 32 =",null,{"$f":"IF(B7>0, ((('Data Inputs'!C25)/('Data Inputs'!B25-LOG10($D10))-'Data Inputs'!D25)*1.8+32), 0)","v":29.752241364918383},"°F"]
[]
["Parameter","Equation","Calculated Value","Units","Calculated Value","Units"]
["Quantities of VOC in Inlet and Outlet streams:"]
["Moles of VOC in the inlet stream (Mvoc,in) = ","(Qin / 392) × (Yvoc,in) × 60 =",{"$f":"('Data Inputs'!B8/392)*(B7*60)","v":3.8265306122448979},"lb.-moles/hour"]
["Moles of VOC in the outlet stream (Mvoc,out) = ","Mvoc,in × (1 - η) =",{"$f":"C15*(1-'Data Inputs'!M10)","v":0.38265306122448972},"lb.-moles/hour"]
[]
["Quantity of VOC Recovered:"]
["Moles of VOC Recovered (Mvoc, recovered) =","Mvoc,in × η =",{"$f":"C15*'Data Inputs'!M10","v":3.443877551020408},"lb.-moles/hour"]
["Quantity of VOC Recovered (Wvoc) =","Mvoc, recovered × MWvoc =",{"$f":"C19*'Data Inputs'!B19","v":269.0012755102041},"lb./operating hour",{"$f":"(C20*'Data Inputs'!B7)/2000","v":279.76132653061222},"Tons/year"]
[]
["Estimated Storage Tank Capacity for Custom Condenser Systems:"]
["Storage Tank Volume (Vtank) =","(Wvoc / ρvoc) × Operating Hours Per Day =",{"$f":"(C20/'Data Inputs'!B20)*'Data Inputs'!D7","v":294.39264077724118},"gallons"]
[]
["Calculation of Enthalpy of Condensation: "]
["Critical Temperature for VOC (Tc) =",null,{"$f":"'Data Inputs'!B26","v":1012},"°R"]
["Reference Temperature for Heat of Condensation (T1) = ",null,{"$f":"'Data Inputs'!B23+459.67","v":635.67000000000007},"°R"]
["Condensation Temperature (T2) =","Tcon + 459.67 =",{"$f":"D11+459.67","v":489.42224136491842},"°R"]
[{"$f":"\"Enthalpy of condensation of VOC (ΔHvoc) at \"&ROUND(D11,1)&\" °F =\"","v":"Enthalpy of condensation of VOC (ΔHvoc) at 29.8 °F ="},"ΔHref × [(1 - T2 / Tc) / (1 - T1 / Tc)]0.38 =",{"$f":"D7*((1-C28/C26)/(1-C27/C26))^0.38","v":14965.251111181435},"Btu/lb.-mole"]
[]
{"$rows_left_out":26}
{"sheet":"Cost Estimate","index":3,"n_rows":100,"n_cols":26,"rows_kept":100,"cut":false,"hidden":false,"merged":[[12,5,14,5],[3,2,8,3],[15,5,16,5],[65,0,65,1],[93,0,93,1],[59,0,59,1],[36,0,36,1]]}
[null,"Cost Estimate",null,null,null,null,null,null,null,null,null,null,null,null,null,"Tcon =",{"$f":"'Design Parameters'!D11","v":29.752241364918383},"R =",{"$f":"'Design Parameters'!C48","v":5.2519471941426161}]
[null,null,null,null,null,null,null,null,null,null,null,null,null,null,null,"Single ",null,null,null,null,null,"Multi"]
[null,"Capital Costs",null,null,null,null,null,null,null,null,null,null,null,null,null,"Temperature ",null,"R Min","R Max",null,null,"Temperature ",null,"R Min","R Max"]
[null,null,{"$f":"IF('Data Inputs'!L1=1,\"Warning!  You failed to select a condenser type. Please return to the Data Inputs tab and select a condenser type (packaged, custom or gasoline vapor recovery).\",\" \")","v":" "}]
[{"$f":"\"Estimated purchase costs for a \"&(IF('Data Inputs'!L1=2,\"packaged condenser\",IF('Data Inputs'!L1=3,\"custom condenser\",\"gasoline vapor recovery system\")&\"  with the following design specifications:\"))","v":"Estimated purchase costs for a gasoline vapor recovery system  with the following design specifications:"},null,null,null,null,null,null,null,null,null,null,null,null,null,null,35,45,85,174,{"$f":"IF(AND($Q$1>P5,$Q$1<Q5,$S$1>R5,$S$1<S5),1,0)","v":0},null,-15,-5,3.5,81,{"$f":"IF(AND($Q$1>V5,$Q$1<W5,$S$1>X5,$S$1<Y5),1,0)","v":0}]
["VOC Controlled/Recovered =",{"$f":"'Data Inputs'!B18","v":"Benzene"},null,null,null,null,null,null,null,null,null,null,null,null,null,25,35,0.63,170,1,null,-25,-15,2.92,68,0]
["Refrigeration Capacity (R) =",{"$f":"ROUND('Design Parameters'!C48,2)&\" tons/hour\"","v":"5.25 tons/hour"},null,null,null,null,null,null,null,null,null,null,null,null,null,15,25,0.71,880,0,null,-35,-25,2.42,85,0]
["Condensation Temperature for Waste Stream  (Tcon) =",{"$f":"ROUND('Design Parameters'!D11,0)&\" °F\"","v":"30 °F"},null,null,null,null,null,null,null,null,null,null,null,null,null,0,15,0.44,200,0,null,-45,-35,1.92,68,0]
[null,null,null,null,null,null,null,null,null,null,null,null,null,null,null,-5,0,0.32,133,0,null,-55,-45,1.58,55,0]
[null,null,null,null,null,null,null,null,null,null,null,null,null,null,null,-15,-5,0.21,6.6,0,null,-65,-55,1.25,100,0]
[{"$f":"\"Total Capital Investment (TCI) (in \"&'Data Inputs'!B41&\" dollars)\"","v":"Total Capital Investment (TCI) (in 2016 dollars)"},null,null,null,null,null,null,null,null,null,null,null,null,null,null,-25,-15,0.13,200,0,null,-75,-65,1.33,42,0]
["Parameter","Equation","Single Stage ","Multi-Stage","Gasoline Vapor Recovery System",null,null,null,null,null,null,null,null,null,null,null,null,null,null,null,null,-85,-75,1.08,150,0]
["Equipment Costs for Single Stage Refrigeration Unit:",null,null,null,null,{"$f":"IF('Data Inputs'!L1=1,\" \",(IF(Q1<-25,\"* A single stage condenser is not appropriate where the Tcon is below -25 °F.\",IF(T13=0,\"*Estimated equipment cost for the single stage condenser (Ecr) may not be accurate. Values of R and Tcon are outside the applicability range for the ECr cost equation.\",\" \"))))","v":" "},null,null,null,null,null,null,null,null,null,null,null,null,"IF value is 1, then ECR equation is applicable",{"$f":"SUM(T5:T11)","v":1},null,-95,-85,0.83,28,0]
[{"$f":"\"ECr\"&(IF(OR(Q1>45, (AND('Cost Estimate'!T13=0,Q1>-25, Q1<45))),\"*\",\" \"))&\" =\"","v":"ECr  ="},{"$f":"IF('Design Parameters'!C48<10,\"1.611 × exp[9.83 - 0.014 × Tcon + 0.34 × ln(R)] × [\"&'Data Inputs'!B41&\" CEPCI / 2014 CEPCI] =\", \"1.611 × exp[9.26 - 0.007 × Tcon + 0.627 × ln(R)] × [\"&'Data Inputs'!B41&\" CEPCI / 2014 CEPCI] =\")","v":"1.611 × exp[9.83 - 0.014 × Tcon + 0.34 × ln(R)] × [2016 CEPCI / 2014 CEPCI] ="},{"$f":"IF(OR('Data Inputs'!L1=1,'Data Inputs'!L1=4),\"Not applicable\",(IF('Design Parameters'!D11>-30,(IF('Design Parameters'!C48<10,(1.611*EXP(9.83-(0.014*'Design Parameters'!D11)+0.34*LN('Design Parameters'!C48)))*('Data Inputs'!B42/'Data Inputs'!E42),(1.611*EXP(9.26-(0.007*'Design Parameters'!D11)+0.627*LN('Design Parameters'!C48)))*('Data Inputs'!B42/'Data Inputs'!E42))),\"Not applicable*\")))","v":"Not applicable"},null,null,null,null,null,null,null,null,null,null,null,null,null,null,null,null,null,null,-105,-95,0.67,22,0]
[]
["Equipment Costs for Multistage Refrigeration Unit:",null,null,null,null,{"$f":"IF(AND('Data Inputs'!L1=1,'Data Inputs'!L1=4),\" \",(IF(Q1>-5,\"* A multi-stage condenser is not necessary where Tcon is above -5 °F.\",(IF(Z17=0,\"*Estimated equipment cost for the multi-stage condenser, ECr, may not be accurate. Values of R and Tcon are outside the applicability range for the ECr cost equation.\",\" \")))))","v":"* A multi-stage condenser is not necessary where Tcon is above -5 °F."}]
[{"$f":"\"ECr\"&IF(OR(Q1<-105, (AND('Cost Estimate'!Z17=0,Q1<-5, Q1>-105))),\"*\",\" \")&\" =\"","v":"ECr  ="},{"$f":"\"1.611 × exp[9.73 - 0.012 × Tcon + 0.58 × ln(R)] × [\"&'Data Inputs'!B41&\" CEPCI / 2014 CEPCI] =\"","v":"1.611 × exp[9.73 - 0.012 × Tcon + 0.58 × ln(R)] × [2016 CEPCI / 2014 CEPCI] ="},null,{"$f":"IF(OR('Data Inputs'!L1=1,'Data Inputs'!L1=4),\"Not applicable\", (IF('Design Parameters'!D11<-10,(1.611*EXP(9.73-(0.012*'Design Parameters'!D11)+(0.58*LN('Design Parameters'!C48))))*('Data Inputs'!B42/'Data Inputs'!E42),\"Not applicable*\")))","v":"Not applicable"},null,null,null,null,null,null,null,null,null,null,null,null,null,null,null,null,null,null,null,null,"IF value is 1, then ECR equation is applicable",{"$f":"SUM(Z5:Z14)","v":0}]
["Other Equipment Costs for a Packaged Solvent Recovery System:"]
["ECp =","0.25 × ECr =",{"$f":"IF(OR('Data Inputs'!L1=1,'Data Inputs'!L1=4),\"Not applicable\",(IF(AND('Design Parameters'!D11>-30,'Data Inputs'!L1=2),(0.25*C14),\"Not applicable\")))","v":"Not applicable"},{"$f":"IF(OR('Data Inputs'!L1=1,'Data Inputs'!L1=4),\"Not applicable\", (IF('Design Parameters'!D11<-10,(0.25*D17),\"Not applicable\")))","v":"Not applicable"}]
["Purchase Costs for a Packaged Gasoline Solvent Recovery System:"]
["ECp =",{"$f":"\"1.611 × (4,910 × R + 341,000) × (\"&'Data Inputs'!B41&\" CEPCI / 2014 CEPCI) =\"","v":"1.611 × (4,910 × R + 341,000) × (2016 CEPCI / 2014 CEPCI) ="},null,null,{"$f":"IF('Data Inputs'!L1=4,(1.611*((4910*'Design Parameters'!C48)+341000))*('Data Inputs'!B42/'Data Inputs'!E42), \"Not applicable\")","v":550174.47902830259}]
[]
["Purchase Costs for a Custom Condenser (ECcon) =",{"$f":"\"1.611 × (34 × Acon + 3,775) x [\"&'Data Inputs'!B41&\" CEPCI / 2014 CEPCI] =\"","v":"1.611 × (34 × Acon + 3,775) x [2016 CEPCI / 2014 CEPCI] ="},{"$f":"IF(OR('Data Inputs'!L1=1,'Data Inputs'!L1=2, 'Data Inputs'!L1=4),\"Not applicable\", IF('Design Parameters'!D11>-30,(1.611*((34*'Design Parameters'!C44)+3775))*('Data Inputs'!B42/'Data Inputs'!E42),\"Not applicable\"))","v":"Not applicable"},{"$f":"IF(OR('Data Inputs'!L1=1,'Data Inputs'!L1=2, 'Data Inputs'!L1=4),\"Not applicable\",IF('Design Parameters'!D11<-10,(1.611*((34*'Design Parameters'!C44)+3775))*('Data Inputs'!B42/'Data Inputs'!E42),\"Not applicable\"))","v":"Not applicable"}]
[]
[]
["Purchase Costs for Storage Tanks for a Custom Condenser (ECtank) =",{"$f":"\"1.611 × (2.72 × Vtank + 1,960) × [\"&'Data Inputs'!B41&\" CEPCI / 2014 CEPCI] =\"","v":"1.611 × (2.72 × Vtank + 1,960) × [2016 CEPCI / 2014 CEPCI] ="},{"$f":"IF(OR('Data Inputs'!L1=1,'Data Inputs'!L1=2, 'Data Inputs'!L1=4),\"Not applicable\",IF('Design Parameters'!D11>-30,(1.611*((2.72*'Design Parameters'!C23)+1960))*('Data Inputs'!B42/'Data Inputs'!E42),\"Not applicable\"))","v":"Not applicable"},{"$f":"IF(OR('Data Inputs'!L1=1,'Data Inputs'!L1=2,'Data Inputs'!L1=4),\"Not applicable\", IF('Design Parameters'!D11<-10,(1.611*((2.72*'Design Parameters'!C23)+1960))*('Data Inputs'!B42/'Data Inputs'!E42),\"Not applicable\"))","v":"Not applicable"}]
["Purchase Costs for Pre-Cooler for Custom Condenser (ECpre) =",{"$f":"IF('Design Parameters'!C48<10,\"1.611 × exp[9.83 - 0.014 × Tcon + 0.34 × ln(R)] × [\"&'Data Inputs'!B41&\" CEPCI / 2014 CEPCI] =\", \"1.611 × exp[9.26 - 0.007 × Tcon + 0.627 × ln(R)] × [\"&'Data Inputs'!B41&\" CEPCI / 2014 CEPCI] =\")","v":"1.611 × exp[9.83 - 0.014 × Tcon + 0.34 × ln(R)] × [2016 CEPCI / 2014 CEPCI] ="},{"$f":"IF(OR('Data Inputs'!L1=1,'Data Inputs'!L1=2,'Data Inputs'!L1=4),\"Not applicable\",IF('Design Parameters'!D11>-30,(IF('Design Parameters'!C48<10,(1.611*EXP(9.83-(0.014*'Design Parameters'!D11)+0.34*LN('Design Parameters'!C48)))*('Data Inputs'!B42/'Data Inputs'!E42),(1.611*EXP(9.26-(0.007*'Design Parameters'!D11)+0.627*LN('Design Parameters'!C48)))*('Data Inputs'!B42/'Data Inputs'!E42))),\"Not applicable\"))","v":"Not applicable"},{"$f":"IF(OR('Data Inputs'!L1=1,'Data Inputs'!L1=2, 'Data Inputs'!L1=4),\"Not applicable\", IF('Design Parameters'!D11<-10,(IF('Design Parameters'!C48<10,(1.611*EXP(9.83-(0.014*'Design Parameters'!D11)+0.34*LN('Design Parameters'!C48)))*('Data Inputs'!B42/'Data Inputs'!E42),(1.611*EXP(9.26-(0.007*'Design Parameters'!D11)+0.627*LN('Design Parameters'!C48)))*('Data Inputs'!B42/'Data Inputs'!E42))),\"Not applicable\"))","v":"Not applicable"}]
["Total Costs for Custom Condenser (A) =","ECr + ECcon + ECtank +ECpre + ECaux =",{"$f":"IF(OR('Data Inputs'!L1=1,'Data Inputs'!L1=2,'Data Inputs'!L1=4),\"Not applicable\", IF('Design Parameters'!D11>-30,(C14+C23+C26+C27+'Data Inputs'!B39),\"Not applicable\"))","v":"Not applicable"},{"$f":"IF(OR('Data Inputs'!L1=1,'Data Inputs'!L1=2,'Data Inputs'!L1=4),\"Not applicable\",IF('Design Parameters'!D11<-10,(D17+D23+D26+D27+'Data Inputs'!B39),\"Not applicable\"))","v":"Not applicable"}]
[]
[]
{"$rows_left_out":71}
{"sheet":"Table A","index":4,"n_rows":48,"n_cols":7,"rows_kept":48,"cut":false,"hidden":false,"merged":[[0,0,0,6],[3,0,4,0],[3,1,4,1],[3,2,4,2],[3,4,4,4],[3,6,4,6]]}
["Table A: Physical Properties for Selected Compounds"]
[]
[]
["Compound","Critical Temp.a (°R)","Boiling Point (°F)","Molecular Weight","Heat of Condensationb (Btu/lb-mole)","Heat Capacityc","State"]
[null,null,null,"(lb/lb-mole)",null,"(Btu/lb-mole-°F)"]
["Acetone",915,134,58.08,12520,30.19,"Liquid"]
[null,null,null,null,null,17.809999999999999,"Gas"]
["Acetylene",555,-119,26.02,7310,10.54,"Gas"]
["Acrylonitrile",965,171,53.06,14030,15.25,"Gas"]
["Aniline",1258,364,93.13,18240,45.87,"Liquid"]
[null,null,null,null,null,25.79,"Gas"]
["Benzene",1012,176,78.11,13210,32.51,"Liquid"]
["Benzonitrile",1259,"375 d",103.12,19750,26.08,"Gas"]
["Butane",765,31,58.12,9640,23.31,"Gas"]
["Chloroethane",829,54,64.52,10630,14.96,"Gas"]
["Chloroform",966,143,119.39,12560,15.71,"Gas"]
["Chloromethane",749,-12,50.49,9210,9.75,"Gas"]
["Cyclobutane",828,55,56.1,10410,17.260000000000002,"Gas"]
["Cyclohexane",996,177,84.16,12910,37.03,"Liquid"]
[null,null,null,null,null,25.41,"Gas"]
["Cyclopentane",921,121,70.13,11750,30.81,"Liquid"]
[null,null,null,null,null,19.84,"Gas"]
["Cyclopropane",716,-27,42.08,8650,13.29,"Gas"]
["Diethyl ether",840,94,74.12,11400,41.26,"Liquid"]
[null,null,null,null,null,28.57,"Gas"]
["Dimethylamine",787,44,45.09,11360,16.899999999999999,"Gas"]
["Ethylbenzene",1111,277,106.17,15320,"30.69 d","Gas"]
["Ethylene oxide",844,51,44.05,10970,11.45,"Gas"]
["Heptane",972,209,100.12,13680,53.76,"Liquid"]
[null,null,null,null,null,39.68,"Gas"]
{"$rows_left_out":19}
{"sheet":"Table B","index":5,"n_rows":41,"n_cols":5,"rows_kept":41,"cut":false,"hidden":false,"merged":[[2,0,3,0],[2,1,2,3],[2,4,3,4],[0,0,0,4]]}
["Table B: Antoine Equation Constants for Selected Compoundsa"]
[]
["Compound","Antoine Equation Constants",null,null,"Valid Temperature Range (°F)"]
[null,"A","B","C"]
["Acetone",7.11714,1210.595,229.66399999999999,"Liquid"]
["Acetylene",9.1402000000000001,1232.5999999999999,280.89999999999998,"-202 to -117"]
[null,7.0998999999999999,711,253.4,"-116 to -98"]
["Acrylonitrile",7.0385499999999999,1232.53,222.47,"-4 to 284"]
["Aniline",7.3201000000000001,1731.5150000000001,206.04900000000001,"216 to 365"]
["Benzene",9.1064000000000007,1885.9,244.2,"10 to 37"]
[null,6.9056499999999996,1211.0329999999999,220.79,"46 to 217"]
["Benzonitrile",6.7463100000000003,1436.72,181,"Liquid"]
["n-Butane",6.80898,935.86,238.73,"-107 to 66"]
["Chloroethane",6.9864699999999997,1030.01,238.61,"-69 to 54"]
["Chloroethylene",6.8911699999999998,905.01,239.48,"-85 to 9"]
["Chloroform",6.4934000000000003,929.44,196.03,"-31 to 142"]
["Chloromethane",7.0934900000000001,948.58,249.34,"-103 to 23"]
["Cyanic acid",7.5685900000000004,1251.8599999999999,243.79,"-105 to 21"]
["Cyclobutane",6.9163100000000002,1054.54,241.37,"-76 to 54"]
["Cyclohexane",6.8413000000000004,1201.53,222.65,"68 to 178"]
["Cyclopentane",6.8867599999999998,1124.162,231.36,"-40 to 162"]
["Cyclopropane",6.88788,856.01,246.5,"-130 to -26"]
["Diethyl ether",6.9203200000000002,1064.07,228.8,"-78 to 68"]
["Diethylamine",5.8015999999999996,583.29999999999995,144.1,"88 to 142"]
["Dimethylamine",7.0821199999999997,960.24199999999996,221.67,"-98 to 44"]
["1,4-Dioxane",7.4315800000000003,1554.68,240.34,"68 to 221"]
["Ethylbenzene",6.9571899999999998,1424.2550000000001,213.21,"79 to 327"]
["Ethylene oxide",7.1284299999999998,1054.54,237.76,"-56 to 54"]
["Heptane",6.8967700000000001,1264.9000000000001,216.54,"28 to 255"]
["Hexane",6.87601,1171.17,224.41,"-13 to 198"]
{"$rows_left_out":11}