{"text_format":"1","workbook":"xlsx","n_sheets":10,"sheets":["Getting Started","Inputs","Results - LowSys","User Supplied Performance Specs","State Average Energy Prices","Results - HighSys","Results","CHP Performance Specifications","Defaults","Applications"],"not_rendered":{"charts":0,"images":5,"macros":1,"external_links":2,"defined_names":247,"comments":1,"pivot_tables":0},"unopened":[],"bounds":{"document_bytes":16777216,"sheet_cells":100000,"rows_first":2000,"rows_last":500,"rows_between":2000,"halvings":0,"cell_chars":16384,"cell_head_chars":4096},"cells_cut":0,"cells_raw":0,"read":"whole","date_system":"1900"}

{"sheet":"Getting Started","index":0,"n_rows":15,"n_cols":6,"rows_kept":15,"cut":false,"hidden":false,"merged":[[14,2,14,14],[10,2,10,14],[12,2,12,14],[7,2,7,14]]}
[]
[]
[null,null,null,null,null,"Getting Started"]
[null,null,null,null,null,"CHP Screening Tool"]
[null,null,null,null,null,"Last Updated May 2019"]
[]
[null,null,"Purpose and Overview"]
[null,null,"The CHP Screening Tool provides estimates of two key indicators for determining the preliminary financial performance of a CHP system, payback period and spark spread, based on a small number of readily-available user inputs.  In addition, the tool includes estimates of CHP equipment and installation costs and energy cost savings. If the analysis determines that either the facility’s average consumption of electricity or thermal energy is less than the output of a commercially available CHP system, the tool will return the result, “No CHP.” Please note that information investigating the technical feasibility of a proposed CHP system is available on the CHP Partnership website."]
[]
[null,null,"User Manual"]
[null,null,"- Please refer to the User Manual (available in the upper right corner of each worksheet) for information about each worksheet and the methodology used by the tool."]
[null,null,"Steps to Follow"]
[null,null,"1. To get started, the user will need the following information:\n\n- The location and line of business of the facility that the CHP system would serve, and the number of annual operating hours of the facility..\n- Energy and electricity consumption and price information for the facility.  Please consult the User Manual for details. \n- Information about any available incentives, such as per-kW capital and per-kWh performance incentive.\n-Information on the efficiency of the equipment the CHP system would displace, and the expected service life, in years of the new CHP system. \n            \n2. The user begins by completing 13 inputs on the “Inputs” worksheet.\n\nAll 13 inputs must be completed. The tool requires that the user supply specific values for Inputs 1, 2, 3, 9, 10, and 11. For the other inputs, users have the option of supplying values or choosing to have the tool supply default values. For best results, users are encouraged to supply project-specific information for as many inputs as possible.\n\n3. After completing inputs 1 through 13, press the “Calculate and Go To Results” button at the bottom of the worksheet.\n\n4. The tool will display the “Results” worksheet, which presents information about the facility, the CHP systems, and the analysis results."]
[null,null,"Help Us Improve the CHP Screening Tool"]
[null,null,"We welcome your input on the CHP Screening Tool's usability and functionality as we strive to improve it. We would also like to know if you encounter any issues when using the tool. Please send us comments or questions via phone or e-mail at: 703-373-8108 or chp@epa.gov."]

{"sheet":"Inputs","index":1,"n_rows":81,"n_cols":6,"rows_kept":81,"cut":false,"hidden":false,"merged":[[75,1,76,2],[37,5,40,5],[37,1,37,2],[38,1,39,2],[46,1,46,2],[75,5,76,5],[44,5,46,5],[51,5,53,5],[57,5,59,5],[63,5,65,5],[69,5,71,5],[45,1,45,2],[52,1,52,2],[58,1,58,2],[64,1,64,2],[70,1,70,2],[31,1,31,2],[31,5,34,5],[32,1,33,2],[5,1,7,2],[10,1,12,2],[15,1,16,2],[20,1,20,2],[21,1,21,2],[22,1,22,2],[26,1,27,2],[21,6,21,7],[20,5,22,5],[26,5,27,5],[6,5,7,5],[11,5,12,5]]}
[]
[]
[null,null,"      Inputs"]
[null,null,"         CHP Screening Tool"]
[]
[null,"1.  What state is the facility located in?",null,null,null,"Instructions"]
[null,null,null,null,null,"Use the drop-down list to select the appropriate state."]
[]
[]
[]
[null,"2.  What is the line of business of the facility?"]
[null,null,null,null,null,"Use the drop-down list to select the appropriate line of business (note that categories are based on two- or four-digit SIC codes). If your facility's line of business is not listed, select a similar line of business."]
[]
[]
[]
[null,"3.  What is the average monthly electric use in kWh?"]
[null,null,null,null,null,"Enter the kWh used during a typical month or divide the annual kWh consumption by 12. "]
[]
[]
[]
{"$rows_left_out":62}
{"sheet":"Results - LowSys","index":2,"n_rows":84,"n_cols":7,"rows_kept":84,"cut":false,"hidden":true,"merged":[[36,4,36,5],[37,4,37,5],[24,2,24,4],[20,2,20,5],[23,2,23,4],[22,2,22,4],[30,2,30,4],[25,2,25,4],[26,2,26,4],[27,2,27,4],[28,2,28,4],[29,2,29,4],[83,2,84,4],[7,2,7,4],[13,2,13,4],[42,2,42,3],[42,4,42,5],[35,4,35,5],[35,2,35,3],[9,5,9,6],[10,5,10,6],[48,2,48,3],[49,2,49,3],[50,2,50,3],[9,2,9,3],[53,2,53,3],[73,2,73,6],[56,2,56,6],[2,3,2,4],[3,3,3,4],[75,2,75,3],[58,2,58,3],[40,2,40,5],[33,2,33,5],[17,2,17,3],[5,1,5,5],[16,2,16,3],[47,2,47,3],[51,2,51,3],[45,2,45,5],[10,2,10,3],[52,2,52,3],[36,2,36,3],[37,2,37,3]]}
[]
[]
[null,null,null,"Results"]
[null,null,null,"CHP Screening Tool"]
[]
[null,"See the User Manual for discussion about the source of the information presented on this worksheet."]
[null,"Facility Energy Use"]
[null,null,"This information is calculated based on values entered on the Inputs worksheet and is used to define the CHP system for analysis."]
[]
[null,null,"Facility Average Electric Load, kW",null,{"$f":"IF(OpHours=0,0,ElecUse/OpHours*12)","v":0}]
[null,null,"Facility Average Heating Load, MMBtu/hour",null,{"$f":"IF(OpHours=0,0,IF(ThermalUse=0,FuelUse*0.8/OpHours*12,ThermalUse/OpHours*12))","v":0}]
[]
[null,"CHP Performance Information"]
[null,null,"This information has been defined by the tool based on values entered on the Inputs worksheet."]
[]
[null,null,"Electric Load that could be Supported by CHP (kW)",null,{"$f":"IFERROR(Defaults!C18,\"No CHP\")","v":0}]
[null,null,"CHP System Type",null,{"$f":"IFERROR(CHPSysTypeDef,\"No CHP\")","v":"No CHP"}]
[null,null,"Total CHP Efficiency (HHV)",null,{"$f":"IFERROR(TotEffDef,\"No CHP\")","v":0.74963369963369964}]
[]
[null,"Estimated CHP Cost to Generate Electricity "]
{"$rows_left_out":65}
{"sheet":"User Supplied Performance Specs","index":3,"n_rows":21,"n_cols":4,"rows_kept":21,"cut":false,"hidden":true,"merged":[[15,14,15,16],[9,12,9,18],[10,12,10,18],[11,12,11,18],[12,12,12,18],[13,12,13,18],[5,14,5,16],[6,14,6,16],[7,12,7,18],[8,12,8,18],[14,14,14,16]]}
[]
[]
[null,null,null,"      User Supplied Performance Specifications"]
[null,null,null,"         CHP Payback Estimator + Spark Spread"]
[]
[null,"CHP Performance Specifications"]
[]
[null,null,"CHP System Size, kW (User Input)"]
[null,null,"CHP System Type (User Input)"]
[null,null,"Heat Rate, Btu/kWh (User Input)"]
[null,null,"Thermal Energy Output, Btu/kWh (User Input)"]
[null,null,"Electric Efficiency, % (HHV) (Calculated Value)"]
[null,null,"Availability, % (User Input)"]
[null,null,"Power to Heat Ratio (Calculated Value)"]
[]
[null,"CHP Cost Specifications"]
[]
[null,null,"Operation and Maintenance Cost, $/kWh (User Input)"]
[null,null,"Equipment Cost, $ (User Input)"]
[null,null,"Installation Cost, $ (User Input)"]
{"$rows_left_out":2}
{"sheet":"State Average Energy Prices","index":4,"n_rows":64,"n_cols":13,"rows_kept":64,"cut":false,"hidden":true,"merged":[[63,2,63,6],[5,3,5,4],[5,2,6,2],[5,5,5,6],[60,2,60,6],[59,2,59,6],[62,2,62,6]]}
[]
[]
[null,null,null,"State Average Energy Prices"]
[null,null,null,"CHP Payback Estimator + Spark Spread",null,null,null,0,1,2,3,4,5]
[]
[null,null,"State","Electric Prices ($/kWh)",null,"Natural Gas Prices ($/MMBtu)"]
[null,null,null,"Commercial ","Industrial","Commercial ","Industrial"]
[null,null,"Alabama",0.11109999999999999,6.0400000000000002E-2,10.65,3.79]
[null,null,"Alaska",0.17559999999999998,0.1522,8.34,5.0599999999999996]
[null,null,"Arizona",0.1041,6.0700000000000004E-2,8.83,5.79]
[null,null,"Arkansas",8.2299999999999998E-2,6.08E-2,7.14,5.78]
[null,null,"California",0.1507,0.1192,8.42,6.79]
[null,null,"Colorado",9.6000000000000002E-2,7.3499999999999996E-2,6.42,4.8899999999999997]
[null,null,"Connecticut",0.1575,0.12809999999999999,8.7899999999999991,6.07]
[null,null,"Delaware",0.1007,8.1099999999999992E-2,9.58,9.02]
[null,null,"District of Columbia",0.11720000000000001,8.8000000000000009E-2,9.8800000000000008,"N/A"]
[null,null,"Florida",8.900000000000001E-2,7.690000000000001E-2,10.42,5.77]
[null,null,"Georgia",9.8100000000000007E-2,5.8400000000000001E-2,7.92,4.0999999999999996]
[null,null,"Hawaii",0.24640000000000001,0.2069,27.02,15.7]
[null,null,"Idaho",7.7600000000000002E-2,6.5500000000000003E-2,7.12,5.19]
{"$rows_left_out":45}
{"sheet":"Results - HighSys","index":5,"n_rows":84,"n_cols":7,"rows_kept":84,"cut":false,"hidden":true,"merged":[[75,2,75,3],[83,2,84,4],[20,2,20,5],[23,2,23,4],[22,2,22,4],[24,2,24,4],[25,2,25,4],[26,2,26,4],[27,2,27,4],[28,2,28,4],[29,2,29,4],[30,2,30,4],[52,2,52,3],[53,2,53,3],[56,2,56,6],[58,2,58,3],[73,2,73,6],[47,2,47,3],[48,2,48,3],[49,2,49,3],[50,2,50,3],[51,2,51,3],[45,2,45,5],[10,2,10,3],[10,5,10,6],[13,2,13,4],[16,2,16,3],[17,2,17,3],[40,2,40,5],[42,2,42,3],[42,4,42,5],[33,2,33,5],[35,2,35,3],[35,4,35,5],[36,2,36,3],[36,4,36,5],[37,2,37,3],[37,4,37,5],[2,3,2,4],[3,3,3,4],[5,1,5,5],[7,2,7,4],[9,2,9,3],[9,5,9,6]]}
[]
[]
[null,null,null,"Results"]
[null,null,null,"CHP Screening Tool"]
[]
[null,"See the User Manual for discussion about the source of the information presented on this worksheet."]
[null,"Facility Energy Use"]
[null,null,"This information is calculated based on values entered on the Inputs worksheet and is used to define the CHP system for analysis."]
[]
[null,null,"Facility Average Electric Load, kW",null,{"$f":"IF(OpHours=0,0,ElecUse/OpHours*12)","v":0}]
[null,null,"Facility Average Heating Load, MMBtu/hour",null,{"$f":"IF(OpHours=0,0,IF(ThermalUse=0,FuelUse*0.8/OpHours*12,ThermalUse/OpHours*12))","v":0}]
[]
[null,"CHP Performance Information"]
[null,null,"This information has been defined by the tool based on values entered on the Inputs worksheet."]
[]
[null,null,"Electric Load that could be Supported by CHP (kW)",null,{"$f":"IFERROR(Defaults!C18,\"No CHP\")","v":0}]
[null,null,"CHP System Type",null,{"$f":"IFERROR(CHPSysTypeDef2,\"No CHP\")","v":"No CHP"}]
[null,null,"Total CHP Efficiency (HHV)",null,{"$f":"IFERROR(TotEffDef2,\"No CHP\")","v":0.74963369963369964}]
[]
[null,"Estimated CHP Cost to Generate Electricity "]
{"$rows_left_out":65}
{"sheet":"Results","index":6,"n_rows":89,"n_cols":7,"rows_kept":89,"cut":false,"hidden":false,"merged":[[49,2,49,5],[40,2,40,3],[41,2,41,3],[42,2,42,3],[43,2,43,3],[44,2,44,3],[56,2,56,3],[57,2,57,3],[51,2,51,3],[52,2,52,3],[53,2,53,3],[54,2,54,3],[55,2,55,3],[10,2,10,3],[10,5,10,6],[17,2,17,3],[18,2,18,3],[21,2,21,5],[24,2,24,3],[28,2,28,5],[31,2,31,3],[32,2,32,3],[36,2,36,5],[34,2,34,5],[2,3,2,4],[3,3,3,4],[5,1,5,5],[7,2,7,4],[9,2,9,3],[9,5,9,6],[88,2,91,4],[13,2,13,5],[25,4,25,5],[62,2,62,3],[60,2,60,6],[79,2,79,3],[77,2,77,6],[45,2,45,3],[46,2,46,3],[38,2,38,3],[23,2,23,3],[25,2,25,3],[33,2,33,3],[15,2,15,3],[30,2,30,3],[39,2,39,3]]}
[]
[]
[null,null,null,"Results"]
[null,null,null," CHP Screening Tool"]
[]
[null,"See the User Manual for discussion about the source of the information presented on this worksheet."]
[null,"Facility Energy Use"]
[null,null,"This information is calculated based on values entered on the Inputs worksheet and is used to define the CHP system for analysis."]
[]
[null,null,"Facility Average Electric Load, kW",null,{"$f":"BaseElecDemand2","v":0}]
[null,null,"Facility Average Heating Load, MMBtu/hour",null,{"$f":"BaseThermalUse","v":0}]
[]
[null,"CHP Performance Information"]
[null,null,"This information has been defined by the tool based on values entered on the Inputs worksheet and default technology options. The tool chooses two CHP system options that most closely match the facility average electric and heating loads. The two system choices are based on selecting one system sized smaller than the calculated load and one sized larger than the calculated load. For both options, the tool uses pro-rated cost and performance data to approximate a CHP system that matches the user’s calculated load. The final equipment selection would depend on a detailed assessment of facility energy requirements and available technology options. More details can be found in the user manual, and additional potential system choices can be found in the EPA's CHP Catalog of Technologies."]
[]
[null,null,"Option Reference Names",null,{"$f":"IF(AND(E17<>0,E18<>0),\"Option 1\",\"\")","v":""},{"$f":"IF(AND(F17<>0,F18<>0),\"Option 2\",\"\")","v":""}]
[null,null,"Electric Load That Could be Supported by CHP (kW)",null,{"$f":"CHP_Size","v":0},{"$f":"CHP_Size2","v":0}]
[null,null,"CHP System Type Options",null,{"$f":"'Results - LowSys'!E17","v":"No CHP"},{"$f":"'Results - HighSys'!E17","v":"No CHP"}]
[null,null,"Total CHP Efficiency (HHV)",null,{"$f":"'Results - LowSys'!E18","v":0.74963369963369964},{"$f":"'Results - HighSys'!E18","v":0.74963369963369964}]
[]
{"$rows_left_out":70}
{"sheet":"CHP Performance Specifications","index":7,"n_rows":72,"n_cols":20,"rows_kept":72,"cut":false,"hidden":true,"merged":[[22,3,22,4],[11,3,11,4],[12,3,12,4],[13,3,13,4],[14,3,14,4],[15,3,15,4],[16,3,16,4],[17,3,17,4],[18,3,18,4],[19,3,19,4],[20,3,20,4],[21,3,21,4],[10,3,10,4],[5,3,5,4],[6,3,6,4],[7,3,7,4],[8,3,8,4],[9,3,9,4]]}
[]
[]
[null,null,null,null,"        Cost and Performance Specifications"]
[null,null,null,null,"            CHP Screening Tool"]
[]
[null,null,null,"System",null,"No CHP","5 kW Packaged Recip Engine","10 kW Packaged Recip Engine","35 kW Packaged Recip Engine","75 kW Packaged Recip Engine"," 100 kW Packaged Recip Engine","285 kW Packaged Recip Engine","375 kW Packaged Recip Engine","550 kW Packaged Engine","1.1 MW Recip Engine","3.3 MW Recip Engine","7.5 MW  Gas Turbine","10.7 MW Gas Turbine","20.4 MW Gas Turbine","40.4 MW Gas Turbine"]
[null,null,1,"Minimum CHP Size, kW",null,0,5,10,35,75,100,285,375,550,1141,3325,7487,10669,20440,40485]
[null,null,{"$f":"C7+1","v":2},"Electric Capacity, kW",null,0,5,10,35,75,100,285,375,550,1141,3325,7487,10669,20440,40485]
[null,null,{"$f":"C8+1","v":3},"Thermal Energy Output, MMBtu/hour",null,0,3.4099999999999998E-2,5.7299999999999997E-2,0.20399999999999999,0.52300000000000002,0.61,1.32,1.78,2.84,4.46,10.69,36.299999999999997,52.2,77.400000000000006,133.80000000000001]
[null,null,4,"Power to Heat Ratio",null,"No CHP",{"$f":"G22","v":0.50029325513196476},{"$f":"H22","v":0.59546247818499132},0.58539215686274515,0.48929254302103248,0.55934426229508205,0.7366818181818181,0.71882022471910123,0.66077464788732398,0.87289058295964128,1.0612628624883069,0.70373674931129493,0.69736835249042128,0.90105012919896632,1.0323977578475336]
[null,null,5,"Market Size Bin",null,"No CHP","3-7.9 kW","8-24.9 kW","25-64.9 kW","65-89.9 kW","90-269.9 kW","270-349.9 kW","350-499.9 kW","500-999.9 kW","1-2.99 MW","3-6.99 MW","7-9.99 MW","10-19.99 MW","20-39.99 MW",">40 MW"]
[null,null,6,"Technology",null,"No CHP","Recip Engine","Recip Engine","Recip Engine","Recip Engine","Recip Engine","Recip Engine","Recip Engine","Recip Engine","Recip Engine","Recip Engine","Gas Turbine","Gas Turbine","Gas Turbine","Gas Turbine"]
[null,null,7,"Equipment Cost, $/kW*",null,"No CHP",4000,3300,1680,1200,1650,1600,1400,1200,1380,1080,1260,{"$f":"619+92+389","v":1100},910,770]
[null,null,8,"Installation Cost, $/kW*",null,"No CHP",8000,6700,2710,2130,1250,1600,1300,1000,990,720,750,700,560,500]
[null,null,9,"Total Installed Cost, $/kW",null,"No CHP",{"$f":"G13+G14","v":12000},{"$f":"H13+H14","v":10000},{"$f":"I13+I14","v":4390},3330,2900,3200,2700,2200,2370,1800,2010,1800,1470,1270]
[null,null,10,"Heat Rate, Btu/kWh",null,"No CHP",{"$f":"ROUND(3412/G18,-1)","v":13650},{"$f":"ROUND(3412/H18,-1)","v":12190},{"$f":"ROUND(3412/I18,-1)","v":11770},{"$f":"ROUND(3412/J18,-1)","v":12640},{"$f":"ROUND(3412/K18,-1)","v":11530},10386.666666666666,10003.333333333334,9950,{"$f":"ROUND(3412/O18,-1)","v":9070},8340,11680,12190,10310,9610]
[null,null,11,"Thermal Energy Output, Btu/kWh",null,"No CHP",{"$f":"G9/G8*1000000","v":6820},{"$f":"H9/H8*1000000","v":5730},{"$f":"I9/I8*1000000","v":5828.5714285714284},6973.3333333333339,6099.9999999999991,4631.5789473684217,4746.6666666666661,5163.6363636363631,3908.8518843120069,3215.0375939849623,4848.4039000934945,4892.6797263098706,3786.6927592954994,3304.9277510188958]
[null,null,12,"Electric Efficiency, % (HHV)",null,"No CHP",0.25,0.28000000000000003,0.28999999999999998,0.27,0.29599999999999999,0.3284980744544288,0.34108630456514494,0.34291457286432159,0.376,0.40899999999999997,0.29199999999999998,0.28000000000000003,0.33100000000000002,0.35499999999999998]
[null,null,13,"O&M Costs, $/kWh",null,"No CHP",0.06,0.03,2.1000000000000001E-2,2.1000000000000001E-2,2.4E-2,2.1000000000000001E-2,1.9E-2,1.7000000000000001E-2,1.9E-2,1.6E-2,1.2E-2,1.2E-2,8.9999999999999993E-3,8.9999999999999993E-3]
[null,null,14,"Equipment Service Life, Years",null,"No CHP",15,15,15,15,15,15,15,15,15,15,20,20,20,20]
{"$rows_left_out":53}
{"sheet":"Defaults","index":8,"n_rows":203,"n_cols":27,"rows_kept":203,"cut":false,"hidden":true,"merged":[[5,4,5,5],[5,6,5,7]]}
["CHP Spark Spread Defaults and Cash Flow Analysis"]
["CHP Screening Tool"]
[]
["CHP Defaults Based on User Inputs"]
[]
[null,"Monthly Fuel Use in MMBtu/month?",{"$f":"ElecUse/VLOOKUP(Application,Applications!$B$5:$D$43,2,FALSE)*3412/1000000/0.8","v":{"$error":"#N/A"}},null,"CHP System 1",null,"CHP System 2"]
[null,"Annual Facility Operating Hours",{"$f":"VLOOKUP(Application,Applications!$B$5:$D$43,3,FALSE)","v":{"$error":"#N/A"}},null,"Default Option Selected",null,"Default Option Selected"]
[null,"Boiler Fuel Price, $/MMBtu",{"$f":"BoilerFuelPrice","v":0}]
[null,"CHP Fuel Price, $/MMBtu",{"$f":"CHPFuelPrice","v":0}]
[null,"Average Electric Price, $/kWh",{"$f":"AvgElecPrice","v":0}]
[null,"Percent of Average Electric Rate Avoided",0.9]
[null,"Site Boiler Efficiency",0.8]
[null,"CHP Thermal Utilization",1]
[null,"Cost of Capital, %",7.0000000000000007E-2]
[null,"Inflation Rate %",0]
[null,"CHP System Size Bin",{"$f":"IF(CHPSize<50,0,IF(CHPSize<500,1,IF(CHPSize<1000,2,IF(CHPSize<5000,3,IF(CHPSize<20000,4,5)))))","v":0}]
[null,"State",{"$f":"State","v":0}]
[null,"Default CHP System Size",{"$f":"IFERROR(MIN(HLOOKUP(MAX(0.0341,BaseThermalUse),'CHP Performance Specifications'!$F$9:$T$10,2)*BaseThermalUse*1000000/3412,BaseElecDemand2),BaseElecDemand2)","v":0}]
[null,"CHP System Type",{"$f":"IF(C18=0,\"No CHP\",IF(C18<5,HLOOKUP(5,'CHP Performance Specifications'!$F$69:$T$72,'CHP Performance Specifications'!C10),HLOOKUP(CHPSize,'CHP Performance Specifications'!$F$69:$T$72,'CHP Performance Specifications'!C10)))","v":"No CHP"},{"$f":"IF(C18=0,\"No CHP\",IF(C18>40485,CHPSysTypeDef,INDEX('CHP Performance Specifications'!$F$72:$T$72,MATCH(CHPSize,'CHP Performance Specifications'!$F$69:$T$69)+1)))","v":"No CHP"}]
[null,"Equipment Cost, $/kW",{"$f":"IF(C18<5,HLOOKUP(5,'CHP Performance Specifications'!$F$7:$T$23,'CHP Performance Specifications'!C13),HLOOKUP(CHPSize,'CHP Performance Specifications'!$F$7:$T$23,'CHP Performance Specifications'!C13))","v":4000},{"$f":"IF(C18>40485,EquipCostDef,INDEX('CHP Performance Specifications'!$F$13:$T$13,MATCH(CHPSize,'CHP Performance Specifications'!$F$7:$T$7)+1))","v":4000}]
{"$rows_left_out":184}
{"sheet":"Applications","index":9,"n_rows":43,"n_cols":4,"rows_kept":43,"cut":false,"hidden":true,"merged":[]}
["CHP Spark Spread Applications"]
["CHP Screening Tool"]
[]
[null,"Industry Description","P/H Ratio","Load, hr/yr"]
[null,"20 - Food and Kindred Products",0.54700000000000004,7500]
[null,"21 - Tobacco Products",1.85,7500]
[null,"22 - Textiles",1.054,7500]
[null,"24 - Lumber and Wood",0.48799999999999999,7500]
[null,"25 - Furniture",4.4370000000000003,7500]
[null,"26 - Paper",0.29299999999999998,7500]
[null,"27 - Printing",11.164999999999999,7500]
[null,"28 - Chemicals",0.65900000000000003,7500]
[null,"29 - Petroleum Refining",0.26100000000000001,7500]
[null,"30 - Rubber/Misc Plastics",3.0790000000000002,7500]
[null,"32 - Stone/Clay/Glass",8.7260000000000009,7500]
[null,"33 - Primary Metals",4.6900000000000004,7500]
[null,"34 - Fabricated Metals",5.0259999999999998,7500]
[null,"35 - Machinery/Computer Equip",6.8460000000000001,7500]
[null,"37 - Trasportation Equip.",2,7500]
[null,"38 - Instruments",7.8419999999999996,7500]
{"$rows_left_out":23}