{"text_format":"1","workbook":"xlsx","n_sheets":23,"sheets":["Title Page","Index","INPUT","OUTPUT","Critical Design Assumptions","O&M Assumptions","Indirect Assumptions","Vessel Constraints","Regen Backwash","Pumps Pipe Structure","Instrumentation and Control","Residuals Management","O&M","HVAC","Indirect","Reference Data","Standard Inputs","AutoSize","Cost Equations","Cost Coefficients","Cost Data","Engineering Data","Lookup Tables"],"not_rendered":{"charts":0,"images":0,"macros":1,"external_links":0,"defined_names":1206,"comments":13,"pivot_tables":0},"unopened":[],"bounds":{"document_bytes":16777216,"sheet_cells":100000,"rows_first":2000,"rows_last":500,"rows_between":2000,"halvings":0,"cell_chars":16384,"cell_head_chars":4096},"cells_cut":0,"cells_raw":0,"read":"whole","date_system":"1900"}

{"sheet":"Title Page","index":0,"n_rows":12,"n_cols":1,"rows_kept":12,"cut":false,"hidden":false,"merged":[]}
["U.S. EPA Office of Ground Water and Drinking Water"]
["Work Breakdown Structure (WBS) Model for Cation Exchange Treatment"]
["Release Date: December 30, 2017"]
["· This model is designed to assist EPA in estimating national compliance costs for drinking water regulations."]
["· As such, the costs are intended to be representative of typical facilities."]
["· The costs, however, do not account for all of the site-specific factors that could affect the cost of any given individual facility."]
["· Use of this model requires Excel 2007 or later."]
["· The model should be opened as Read-only, so that any changes you make are saved under a new file name."]
["· To function properly, macros (\"active content\") must be enabled. If a security warning appears, click \"options\" and \"enable this content.\""]
["· For further information see the following document distributed with this file:"]
{"$rows_left_out":3}
{"sheet":"Index","index":1,"n_rows":319,"n_cols":2,"rows_kept":319,"cut":false,"hidden":false,"merged":[]}
["INDEX"]
["This page provides an index to all user-adjustable inputs and assumptions.  Click on a variable name to go directly to the adjustable cells."]
[]
["User-adjustable Input or Assumption","Variable Name and Link"]
["Access space per pump for custom designed systems","space_pumps_cust"]
["Access space per pump for pre-engineered packages","space_pumps_pre"]
["Add a redundant unit per x parallel lines","redund_freq"]
["Add coagulant to holding tank/basin?","coag_res"]
["Additional building after…","add_2nd_building"]
["Additional conductivity meters","add_cond"]
{"$rows_left_out":310}
{"sheet":"INPUT","index":2,"n_rows":80,"n_cols":9,"rows_kept":80,"cut":false,"hidden":false,"merged":[[12,6,14,7],[33,8,34,8],[12,8,14,8]]}
["CATION EXCHANGE SYSTEM DESIGN AND COSTS"]
[]
[null,null,null,null,"STEP 1",null,null,{"$f":"IF('Standard Inputs'!AC8,\"<- Using this design\",IF('Standard Inputs'!AD8,\"<- You modified this design\",\"\"))","v":""}]
[null,null,null,null,"Select one of the eight standard designs at right",null,null,{"$f":"IF('Standard Inputs'!AC9,\"<- Using this design\",IF('Standard Inputs'!AD9,\"<- You modified this design\",\"\"))","v":""}]
[null,null,null,null,null,null,null,{"$f":"IF('Standard Inputs'!AC10,\"<- Using this design\",IF('Standard Inputs'!AD10,\"<- You modified this design\",\"\"))","v":""}]
[null,null,null,null,"OR",null,null,{"$f":"IF('Standard Inputs'!AC11,\"<- Using this design\",IF('Standard Inputs'!AD11,\"<- You modified this design\",\"\"))","v":""}]
[null,null,null,null,null,null,null,{"$f":"IF('Standard Inputs'!AC12,\"<- Using this design\",IF('Standard Inputs'!AD12,\"<- You modified this design\",\"\"))","v":""}]
[null,null,null,null,"Select \"CLEAR FOR MANUAL ENTRY\"",null,null,{"$f":"IF('Standard Inputs'!AC13,\"<- Using this design\",IF('Standard Inputs'!AD13,\"<- You modified this design\",\"\"))","v":""}]
[null,null,null,null,null,null,null,{"$f":"IF('Standard Inputs'!AC14,\"<- Using this design\",IF('Standard Inputs'!AD14,\"<- You modified this design\",\"\"))","v":""}]
[null,null,null,null,null,null,null,{"$f":"IF('Standard Inputs'!AC15,\"<- Using this design\",IF('Standard Inputs'!AD15,\"<- You modified this design\",\"\"))","v":"<- Using this design"}]
{"$rows_left_out":71}
{"sheet":"OUTPUT","index":3,"n_rows":399,"n_cols":25,"rows_kept":399,"cut":false,"hidden":false,"merged":[[25,13,25,21],[25,22,26,23],[26,13,26,15],[26,16,26,18],[26,19,26,21],[25,0,27,0],[25,1,27,1],[25,2,27,3],[25,4,27,5],[25,12,27,12],[4,3,4,4],[5,3,5,4],[323,8,323,11],[25,6,27,7],[25,8,27,8],[25,9,27,9],[25,10,27,10],[25,11,27,11],[319,2,319,3]]}
["OUTPUT SUMMARY"]
[null,"Parameter","Value","Units"]
[null,"Technology","CX"]
[null,"System Size Category",{"$f":"IF(design_flow<1,\"small\",\"large\")","v":"large"}]
[null,"Design Flow",{"$f":"design_flow","v":75.072000000000003},"MGD (excludes bypass flow)"]
[null,"Average Flow",{"$f":"average_flow","v":37.536000000000001},"MGD (excludes bypass flow)"]
[null,"# of treatment trains",{"$f":"num_treat_lines","v":13}]
[null,"# of vessels in series",{"$f":"Num_tanks","v":1},"(i.e., parallel or series operation)"]
[null,"Total EBCT",{"$f":"EBCT","v":2.5},"minutes"]
[null,"EBCT per vessel",{"$f":"EBCT_tank","v":2.5},"minutes"]
{"$rows_left_out":390}
{"sheet":"Critical Design Assumptions","index":4,"n_rows":260,"n_cols":7,"rows_kept":260,"cut":false,"hidden":false,"merged":[]}
["Default Critical Design Assumptions"]
["Users may change any of the cells in the Value column; cells in gold are most important and may vary based on contaminant treated and site-specific conditions"]
[]
["Assumption","Range Name","Value","Units","Guidance"]
["Cost estimating method","curve",1,"<-- enter 1 to use cost equations, leave blank to use lookup tables for component costs","Keeping this assumption with a value of 1 is strongly recommended; the cost equations method is more appropriate for national cost estimating and will be more accurate for nearly all user-specified designs"]
[]
["Vessel Design"]
["Number of redundant vessels for small systems with only one vessel","NRD_small_1",1,"units","If a design includes only one operating vessel, there should be at least one additional vessel"]
["Number of redundant vessels for small systems with multiple vessels","NRD_small",0,"units","Small systems can operate at reduced capacity while one vessel is down for backwash, if there are multiple vessels"]
["Add a redundant unit per x parallel lines","redund_freq",4,"number of parallel lines/redundant unit"]
{"$rows_left_out":251}
{"sheet":"O&M Assumptions","index":5,"n_rows":58,"n_cols":5,"rows_kept":58,"cut":false,"hidden":false,"merged":[]}
["Default O&M Assumptions"]
["Users may change any of the cells in the Value column"]
[]
["Assumption","Range Name","Value","Units","Guidance"]
["Pump head for booster pumps","booster_pump_head",25,"psi","Von Huben, Harry. Operator's Companion, 4th Edition. USABluebook, 2000.  Pp. 17  25 psi creates a head of 60 feet"]
["Residuals pump head","res_pump_psi",25,"psi"]
["Pump efficiency","booster_pump_efficiency",0.75]
["Pump head for backwash pumps","backwash_pump_head",14.7,"psi"]
["Cost for parts & maintenance for pumps","booster_pump_maintenance",0.01,null,"For calculating cost of actual maintenance materials; not to be confused with depreciation.  Initial proposed estimate of 5% seems high  (Richard E. Hubel, Peter Keenan, American Water Works Service Company, Inc)"]
[]
{"$rows_left_out":49}
{"sheet":"Indirect Assumptions","index":6,"n_rows":130,"n_cols":6,"rows_kept":130,"cut":false,"hidden":false,"merged":[[120,0,121,0],[120,1,121,1],[120,2,120,4],[108,0,109,0],[108,1,109,1],[108,2,108,4]]}
["Default Assumptions for Indirect and Add-On Costs"]
["Users may change any of the cells in the Value column"]
[]
["Assumption","Range Name","Value","Units","Guidance"]
["Buildings"]
["Include buildings in total capital cost?","include_buildings",1,"<--- enter 1 for yes, 0 for no"]
["Include concrete pad in total capital cost?","include_pad",1,"<--- enter 1 for yes, 0 for no"]
[]
["Permits"]
["Include permit costs?","include_permits",1,"<--- enter 1 for yes, 0 for no"]
{"$rows_left_out":121}
{"sheet":"Vessel Constraints","index":7,"n_rows":65,"n_cols":5,"rows_kept":65,"cut":false,"hidden":false,"merged":[]}
["Contactor Constraint Calculations"]
["This sheet performs calculations to confirm that the vessel design on the Input page meets engineering constraints"]
[]
["Calculation","Range Name","Value","Units","Guidance"]
["From Inputs"]
["Design Flow","design_flow",{"$f":"IF(df_units=\"gpm\",(1-bp_pct)*design_flow_I*24*60/1000000,(1-bp_pct)*design_flow_I)","v":75.072000000000003},"MGD","From Inputs"]
["Average Flow","average_flow",{"$f":"(1-bp_pct)*IF(af_units=\"gpm\",average_flow_I*24*60/1000000,IF(af_units=\"fraction of design flow\",average_flow_I*design_flow,average_flow_I))","v":37.536000000000001},"MGD","From Inputs"]
["Design Flow Rate","design_flow_rate",{"$f":"design_flow*1000000/(24*60)","v":52133.333333333336},"gpm","Design flow expressed in gpm"]
["Average Flow Rate","average_flow_rate",{"$f":"average_flow*1000000/(24*60)","v":26066.666666666668},"gpm","Average flow expressed in gpm"]
["Bypass Flow Rate (design)","bp_flow_rate",{"$f":"bp_pct/(1-bp_pct)*design_flow_rate","v":0},"gpm"]
{"$rows_left_out":56}
{"sheet":"Regen Backwash","index":8,"n_rows":65,"n_cols":5,"rows_kept":65,"cut":false,"hidden":false,"merged":[]}
["Backwash and Regeneration Calculations"]
[]
["Calculation","Range Name","Value","Units","Guidance"]
["From Inputs"]
["Useable exchange capacity","useable_capacity",{"$f":"IF(regen_calc_type=\"manual entry\",\"NA\",bv_regen_I)","v":27},"kilograins as CaCO3/cubic foot"]
["Salt regenerant dose level","salt_dose",{"$f":"salt_dose_I","v":15},"lb/cubic ft"]
[]
["Resin Regeneration"]
["Hardness removed per line per day","CaCO3_removed",{"$f":"CaCO3_in*(average_flow/num_treat_lines)*3.7854","v":2185.9811446153849},"kg"]
["Hardness capacity per vessel","reg_capacity",{"$f":"IF(useable_capacity=\"NA\",\"NA\",resin_volume*useable_capacity/15.432)","v":2497.0574769975815},"kg"]
{"$rows_left_out":56}
{"sheet":"Pumps Pipe Structure","index":9,"n_rows":72,"n_cols":5,"rows_kept":72,"cut":false,"hidden":false,"merged":[]}
["Pumps, Piping, and Structure Calculations"]
[]
["Calculation","Range Name","Value","Units","Guidance"]
["Pump Design"]
["Maximum pump size","max_pump_size",{"$f":"MAX(VLOOKUP(10^6,pump_cost_cl,1)-1,VLOOKUP(10^6,back_pump_cost_cl,1)-1)","v":10000},"gpm","The largest pump size for which costs are available"]
["Booster pump rating","pump_rating",{"$f":"IF(lines_pump_I=\"\",IF(ss_cat2=1,0,MIN(MAX(average_flow_rate+bp_flow_rate*average_flow_rate/design_flow_rate,(design_flow_rate+bp_flow_rate)/2)*(1+pump_safety_factor),max_pump_size)),IF(lines_pump_I=0,0,(design_flow_rate+bp_flow_rate)*(1+pump_safety_factor)/lines_pump_I))","v":10000},"gpm","Includes safety factor"]
["Number of booster pumps","booster_pumps",{"$f":"IF(pump_rating=0,0,ROUNDUP((design_flow_rate+bp_flow_rate)*(1+pump_safety_factor)/pump_rating,0))","v":7},"units"]
[]
["Total booster pumps","total_booster_pumps",{"$f":"IF(booster_pumps=0,0,booster_pumps+NRD_pumps)","v":7},"units","Includes redundancy"]
[]
{"$rows_left_out":63}
{"sheet":"Instrumentation and Control","index":10,"n_rows":66,"n_cols":5,"rows_kept":66,"cut":false,"hidden":false,"merged":[]}
["Instrumentation and Control Calculations"]
[]
["Calculation","Range Name","Value","Units","Guidance"]
["From Inputs"]
["Component level","component_level",{"$f":"IF(component_level_I=\"high cost\",2,IF(component_level_I=\"mid cost\",1,\"\"))","v":""},"blank = low cost, 1 = mid cost, 2 = high cost"]
["Manual system controls","manual",{"$f":"IF(manual_I=\"manual\",1,IF(manual_I=\"semi-automated\",2,IF(manual_I=\"fully automated\",3,IF(component_level=\"\",1,IF(component_level=2,3,CHOOSE(ss_cat2,3,3,3))))))","v":1},"1 = fully manual system, 2 = semi-automated system, blank = fully automated system.","Based on system size and component level (see cell comment), unless user overrides on input sheet"]
[]
["Control Valves and Instrumentation"]
["Size of valves for inlet and outlet lines","in_valve_size",{"$f":"in_out_pipe_diam","v":36},"inches"]
["Size of valves for vessel pipe line","tank_valve_size",{"$f":"proc_pipe_diam","v":14},"inches"]
{"$rows_left_out":57}
{"sheet":"Residuals Management","index":11,"n_rows":222,"n_cols":5,"rows_kept":222,"cut":false,"hidden":false,"merged":[]}
["Residuals Management Calculations"]
[]
["Calculation","Range Name","Value","Units","Guidance"]
["From Inputs"]
["Brine delivery method","brine_method",{"$f":"IF(brine_method_I=\"brine mixing tanks\",1,2)","v":1},"<-- 1 for brine mixing tanks, 2 for salt saturator"]
["Discharge option for spent brine","res_s2_opt",{"$f":"IF(res_s2_opt_I=\"surface water\",1,IF(res_s2_opt_I=\"POTW\",2,IF(res_s2_opt_I=\"evaporation pond\",3,IF(res_s2_opt_I=\"septic system\",4,5))))","v":2},"<-- 1 for direct discharge to surface water, 2 for discharge to POTW, 3 for evaporation pond, 4 for septic system. 5 for hazardous waste disposal"]
["Holding tank for spent brine","res_s1_opt",{"$f":"IF(OR(res_s2_opt=3,res_s2_opt=4),2,IF(res_s2_opt=5,1,IF(res_s1_opt_I=\"holding tank\",1,2)))","v":2},"<-- 1 for holding tank, 2 for no holding tank (input ignored if continuous regeneration is required)"]
["Characteristics of spent resin","media_haz",{"$f":"IF(media_haz_I=\"\",\"\",IF(media_haz_I=\"hazardous\",2,IF(media_haz_I=\"radioactive\",3,IF(media_haz_I=\"radioactive hazardous\",4,1))))","v":1},"<-- 1 for non-hazardous, 2 for hazardous, 3 for radioactive, 4 for radioactive hazardous"]
[{"$f":"IF(res_s2_opt=3,\"Characteristics of evaporation pond solids\",IF(res_s1_opt=1,\"Characteristics of holding tank solids\",\"\"))","v":""},"solids_haz",{"$f":"IF(res_s2_opt=4,1,IF(solids_haz_I=\"hazardous\",2,IF(solids_haz_I=\"radioactive\",3,IF(solids_haz_I=\"radioactive hazardous\",4,1))))","v":1},"<-- 1 for non-hazardous, 2 for hazardous, 3 for radioactive, 4 for radioactive hazardous"]
[]
{"$rows_left_out":213}
{"sheet":"O&M","index":12,"n_rows":79,"n_cols":5,"rows_kept":79,"cut":false,"hidden":false,"merged":[]}
["Operation and Maintenance Calculations"]
[]
["Calculation","Range Name","Value","Units","Guidance"]
["Materials"]
["Booster pump materials","pump_mtl",{"$f":"OUTPUT!J153*booster_pump_maintenance","v":5660.8015726163994},"/yr"]
["Backwash pump materials","back_pump_mtl",{"$f":"IF(regen_yr>=52,IF(ISNUMBER(OUTPUT!J154),booster_pump_maintenance*OUTPUT!J154,0),0)","v":667.66331191664995},"/yr"]
[]
["Chemicals and Resin"]
["Salt needed per year","salt_year",{"$f":"365*salt_store/cstore_days","v":88926733.087488011},"lbs"]
["Resin loss replacement","resin_loss_vol_annual",{"$f":"media_volume*op_num_tanks*resin_loss_annual","v":834.91613800891139},"cf"]
{"$rows_left_out":70}
{"sheet":"HVAC","index":13,"n_rows":134,"n_cols":12,"rows_kept":134,"cut":false,"hidden":false,"merged":[[79,1,79,4],[88,1,88,4]]}
["Building Heating, Ventilating, and Air Conditioning Calculations"]
[]
["Calculation","Range Name","Value","Units","Guidance"]
["General information",null,null,null,"ss_cat2 is used to select ventilation requirements and building type"]
["System size","ss_cat2",{"$f":"IF(design_flow<1,1,IF(design_flow<10,2,3))","v":3},"1 indicates small system, 2 indicates medium, 3 indicates large"]
["Building height","Building_height",{"$f":"IF(tank_geom=1,comm_height_length,comm_diam)+Top_bottom_Vessel_space","v":18.5},"ft"]
["Buiding 1 length and width","build1_side",{"$f":"build1_fp^0.5","v":110.36303729057116},"ft"]
["Building 2 length and width","build2_side",{"$f":"build2_fp^0.5","v":107.09808588392231},"ft"]
[]
["Ventilation"]
{"$rows_left_out":125}
{"sheet":"Indirect","index":14,"n_rows":88,"n_cols":5,"rows_kept":88,"cut":false,"hidden":false,"merged":[]}
["Indirect and Add-on Cost Calculations"]
[]
["Calculation","Range Name","Value","Units","Guidance"]
["Standby Power"]
["Booster pumps",null,{"$f":"pump_energy*design_flow/average_flow/365/24*1000","v":755.25369134611446},"kW"]
["Lighting",null,{"$f":"(build1_fp*lighting_energy_1+build2_fp*lighting_energy_2)/365/24","v":23.650000000000002},"kW"]
["Building 1 ventilation",null,{"$f":"0.746*Fan_pressure_drop*build1_fp*Building_height*air_changes_build1/33000","v":1.2734559090909092},"kW"]
["Building 2 ventilation",null,{"$f":"0.746*Fan_pressure_drop*build2_fp*Building_height*air_changes_build2/33000","v":4.3993824090909088},"kW"]
["Total base standby power requirement","std_base",{"$f":"SUM(C5:C8)","v":784.57652966429623},"kW"]
[]
{"$rows_left_out":79}
{"sheet":"Reference Data","index":15,"n_rows":21,"n_cols":3,"rows_kept":21,"cut":false,"hidden":false,"merged":[]}
["Reference Data for Influent Hardness and Regenerant Dose"]
["This Sheet presents data that can be used to select alternate inputs that may vary based on resin type and water quality"]
[]
["Guidance on influent CaCO3"]
["Water Hardness","Grains per Gallon","mg/L"]
["Soft","0 to 3","0 to 60"]
["Moderate","3 to 7","60 to 120"]
["Hard","7 to 10","120 to 180"]
["Very Hard","more than 10","more than 180"]
[]
{"$rows_left_out":12}
{"sheet":"Standard Inputs","index":16,"n_rows":18,"n_cols":30,"rows_kept":18,"cut":false,"hidden":false,"merged":[[4,10,4,15],[5,27,5,29]]}
["Standard Designs"]
["Default inputs represent typical options used to generate national average compliance costs."]
[]
[]
[null,"System Size",null,null,null,"Regeneration",null,null,null,null,"System Configuration and Vessel Design",null,null,null,null,null,"Residuals",null,null,null,null,"Optional"]
["Design #","Design flow","Design Flow Units","Average Flow","Average flow units","Influent Hardness","Resin Type","Regen Calculation Type","Resin Capacity or Bed Volumes","Regenerant dose level","Number of Tanks","EBCT","Bed Depth","Vessel Geometry","Height or Length","Diameter","Brine Delivery","Discharge option for spent brine","Holding tank for spent brine","Characteristics of spent resin","Characteristics of evaporation pond or holding tank solids","BoosterPump","# Redundant Units","Backwash pumps?","Backwash storage?","Component level","System Automation","Internal Use"]
[null,"design_flow_I","df_units","average_flow_I","af_units","CaCO3_in","resin_type_I","regen_calc_type","BV_regen_I","salt_dose_I","num_tanks_I","EBCT_I","bed_depth","tank_geom_I","comm_height_length","comm_diam","brine_method_I","res_s2_opt_I","res_s1_opt_I","media_haz_I","solids_haz_I","lines_pump_I","NRD_I","no_backwash_I","no_back_tank_I","component_level_I","manual_I"]
[1,0.03,"MGD",7.0000000000000001E-3,"MGD",200,"Strong acid polystyrenic macroporous","calculate based on hardenss and resin capacity",27,15,1,2.5,2.5,"upright",5,1.5,"brine mixing tanks","POTW","holding tank","non-hazardous","non-hazardous",null,null,null,null,null,null,null,{"$f":"AND(B8:AA8=inp_used)","v":false},{"$f":"AND(B8:E8=inp_used_minimal)","v":false}]
[2,0.124,"MGD",3.5000000000000003E-2,"MGD",200,"Strong acid polystyrenic macroporous","calculate based on hardenss and resin capacity",27,15,1,2.5,3,"upright",6,2.5,"brine mixing tanks","POTW","holding tank","non-hazardous","non-hazardous",null,null,null,null,null,null,null,{"$f":"AND(B9:AA9=inp_used)","v":false},{"$f":"AND(B9:E9=inp_used_minimal)","v":false}]
[3,0.30499999999999999,"MGD",9.4E-2,"MGD",200,"Strong acid polystyrenic macroporous","calculate based on hardenss and resin capacity",27,15,1,2.5,2.9,"upright",6,4,"brine mixing tanks","POTW","holding tank","non-hazardous","non-hazardous",null,null,null,null,null,null,null,{"$f":"AND(B10:AA10=inp_used)","v":false},{"$f":"AND(B10:E10=inp_used_minimal)","v":false}]
{"$rows_left_out":9}
{"sheet":"AutoSize","index":17,"n_rows":126,"n_cols":10,"rows_kept":126,"cut":false,"hidden":false,"merged":[]}
["Autosize"]
["This sheet is used internally by the Auto Size macro to iteratively select the lowest capital cost design meeting engineering constraints. "]
["This sheet is used only if the Auto Size button is clicked.  Advanced users may adjust the automated sizing procedure following the guidance below."]
["Bold blue cells are copied to the input sheet"]
["Bold gold cells are inputs to the sizing procedure"]
[]
["Input Parameters"]
["design flow rate",null,{"$f":"design_flow_rate","v":52133.333333333336},"gpm"]
["vessels per line",null,{"$f":"Num_tanks","v":1}]
["EBCT per line",null,{"$f":"EBCT","v":2.5},"min"]
{"$rows_left_out":117}
{"sheet":"Cost Equations","index":18,"n_rows":208,"n_cols":17,"rows_kept":208,"cut":false,"hidden":false,"merged":[]}
["Cost Equations"]
["This sheet is used internally to calculate component costs using the cost equations method; see model documentation for more details on the development of cost equations"]
[]
["Component",null,"Result","Variable",null,2,3,4,5,6,7,8,9,10,11,16,17]
["Pressure Vessels","Equation Name","Result","Variable","Equation Lookup Name",2,3,4,5,6,7,8,9,10,11,16,17]
["Stainless Steel","ss_pv_eq",{"$f":"IF(OR(D6>P6,D6<Q6),\"contact vendor\",F6*D6^G6+H6*LN(D6)+I6+J6*EXP(K6*D6)+L6*D6^3+M6*D6^2+N6*D6+O6)","v":340485.91890836053},{"$f":"comm_vol_gal","v":23866.286690239962},"ss_pv_eq",{"$f":"VLOOKUP($E6,eq_table_cl,F$5,FALSE)","v":0},0,0,0,0,0,0,-7.6737999999999996E-5,15.444158594999999,15601.139394092999,27101,0]
["Carbon Steel - Stainless Internals","cs_pv_eq",{"$f":"IF(OR(D7>P7,D7<Q7),\"contact vendor\",F7*D7^G7+H7*LN(D7)+I7+J7*EXP(K7*D7)+L7*D7^3+M7*D7^2+N7*D7+O7)","v":232136.86501521029},{"$f":"comm_vol_gal","v":23866.286690239962},"cs_pv_eq",0,0,0,0,0,0,0,-5.872E-5,10.510938614000001,14726.681553128999,27101,0]
["Carbon Steel - Plastic Internals","csp_pv_eq",{"$f":"IF(OR(D8>P8,D8<Q8),\"contact vendor\",F8*D8^G8+H8*LN(D8)+I8+J8*EXP(K8*D8)+L8*D8^3+M8*D8^2+N8*D8+O8)","v":144025.18511773416},{"$f":"comm_vol_gal","v":23866.286690239962},"csp_pv_eq",0,0,0,0,0,0,5.0000000000000001E-9,-1.5907200000000001E-4,6.5680481459999998,9906.4774847219996,27101,0]
["Fiberglass","fg_pv_eq",{"$f":"IF(OR(D9>P9,D9<Q9),\"contact vendor\",F9*D9^G9+H9*LN(D9)+I9+J9*EXP(K9*D9)+L9*D9^3+M9*D9^2+N9*D9+O9)","v":"contact vendor"},{"$f":"comm_vol_gal","v":23866.286690239962},"fg_pv_eq",0,0,0,0,0,0,0,-5.7213999999999995E-4,18.639575937,756.34544690600001,901,0]
["Cation Resin"]
{"$rows_left_out":199}
{"sheet":"Cost Coefficients","index":19,"n_rows":64,"n_cols":17,"rows_kept":64,"cut":false,"hidden":false,"merged":[]}
["Coefficients for Component Cost Equations"]
["This sheet is used internally to calculate component costs using the cost equations method; see model documentation for more details on the development of cost equations"]
[]
[]
[null,"Power: C1*x^C2",null,"Logarithmic: C3*Ln(x) + C4",null,"Exponential: C5*e^(C6*x)",null,"Polynomial: C7*x^3 + C8*x^2 + C9*x + C10",null,null,null,"NOTES"]
["Equation Lookup Name","C1","C2","C3","C4","C5","C6","C7","C8","C9","C10","Pct deviation of fit equation","Modified by","Last modified","Rsq of fit equation","max size used to gen curve","min size for which curve fits are valid "]
["back_pump_eq",0,0,0,0,0,0,0,-4.6792200000000001E-4,12.098844774,6672.3461545199998,0.13367574610699431,null," 6/21/2017 4:05:02 PM",0.93195820403084639,10001,0]
["bldg_hi_eq",324.18264690900003,-0.13230006499999999,0,0,0,0,0,0,0,0,3.9891100445136697E-2,null," 6/23/2017 3:04:02 PM",0.95292288207252096,200000.1,0]
["bldg_lo_eq",150.466390674,-9.6925793999999996E-2,0,0,0,0,0,0,0,0,2.5518207619233565E-2,null," 6/23/2017 3:03:10 PM",0.96714729333927008,200000.1,0]
["bldg_mid_eq",184.678993655,-9.8240209999999994E-2,0,0,0,0,0,0,0,0,2.751136169037021E-2,null," 6/23/2017 3:03:32 PM",0.96388247777818237,200000.1,0]
{"$rows_left_out":55}
{"sheet":"Cost Data","index":20,"n_rows":1604,"n_cols":7,"rows_kept":1604,"cut":false,"hidden":false,"merged":[]}
["Cost Data"]
["This sheet is used internally and contains component cost data extracted from the central cost database"]
["To maintain vendor confidentiality, the central cost database itself is not provided here"]
[]
["bls118","Alarms (High/Low Pressure Alarms, Level Switch/Alarms, Low Alarms)"]
[43,null,null,"Unit Cost","Useful Life (large)","Useful Life (small)"]
["alarm_cost_cl",0,0,580.58711311592128,15,14]
[]
[]
["bls1141","Centrifugal Pumps (Backwash)"]
{"$rows_left_out":1595}
{"sheet":"Engineering Data","index":21,"n_rows":209,"n_cols":5,"rows_kept":209,"cut":false,"hidden":false,"merged":[]}
["Engineering Data"]
["This sheet is used internally and contains engineering reference and indirect cost data extracted from the central cost database"]
[]
["Architectural Fee"]
["Building cost lookup","Corresponds to the range","Architectural fee"]
[0,"<$250,000",0.09]
[250000,"$250,000 to $500,000",0.08]
[500000,"$500,000 to $1,000,000",7.0000000000000007E-2]
[1000000,"$1,000,000 to $5,000,000",6.2E-2]
[5000000,"$5,000,000 to $10,000,000",5.2999999999999999E-2]
{"$rows_left_out":200}
{"sheet":"Lookup Tables","index":22,"n_rows":45,"n_cols":2,"rows_kept":45,"cut":false,"hidden":false,"merged":[]}
["Lookup Tables and Input Validation"]
["This sheet is used internally to perform certain reference calculations and support input sheet data validation"]
[]
["resin_list"]
["Strong acid polystyrenic gel-type",1]
["Strong acid polystyrenic macroporous",2]
["brine_method_valid"]
["brine mixing tanks"]
["salt saturator"]
["discharge_valid"]
{"$rows_left_out":35}