{"text_format":"1","workbook":"xlsx","n_sheets":5,"sheets":["Instructions","Required Information","QAPP","A Section","B Section"],"not_rendered":{"charts":0,"images":3,"macros":1,"external_links":0,"defined_names":0,"comments":0,"pivot_tables":0},"unopened":[],"bounds":{"document_bytes":16777216,"sheet_cells":100000,"rows_first":2000,"rows_last":500,"rows_between":2000,"halvings":0,"cell_chars":16384,"cell_head_chars":4096},"cells_cut":0,"cells_raw":0,"read":"whole","date_system":"1900"}

{"sheet":"Instructions","index":0,"n_rows":89,"n_cols":2,"rows_kept":89,"cut":false,"hidden":false,"merged":[[65,0,65,1],[69,0,69,1],[89,0,89,1],[4,0,8,6],[11,0,11,1],[17,0,17,1],[10,0,10,6],[14,0,14,6]]}
["Interim Site-Specific Quality Assurance Project Plan Template for Evaluating Asbestos-Containing Material and Lead-Based Paint in Building Materials"]
["EPA Region 4 Brownfields & Redevelopment Section"]
["Version 1: November 15, 2022"]
["Introduction:"]
["The EPA Region 4 Brownfields & Redevelopment Section is offering this Interim Streamlined Site-Specific Quality Assurance Project Plan (SSQAPP) Template for evaluating the presence of Asbestos-Containing Material (ACM) and Lead-Based Paint (LBP) in building materials. The use of this Interim SSQAPP Template has limitations, as described below: \n•\tThis Interim SSQAPP Template is intended for use in EPA Region 4 at sites undergoing assessment through an EPA Brownfields Grant.\n•\tThis Interim SSQAPP Template is intended for use where the sampling objective is to determine whether ACM and/or LBP are present in building materials.  \n•\tThis Interim SSQAPP Template is intended for use where a Generic QAPP is final and has been approved by EPA, as the Generic QAPP is referenced throughout this document.\n•\tThe final SSQAPP must be approved by EPA prior to sample collection. If any of the required information is not known in advance of mobilization for field sampling activities, please coordinate with the EPA Project Officer regarding the information that may need to be obtained upon mobilization and ensuring that final EPA approval will be obtained prior to sample collection.       "]
[]
[]
[]
[]
[]
["If this Interim SSQAPP Template does not align with a particular project, please submit a standard Site-Specific QAPP Addendum using the EPA Region 4 Brownfields QAPP guidance at: "]
["www.epa.gov/brownfields/region-4-quality-assurance-project-plan-qapp-tool-box"]
[]
["Comments and Revisions:"]
["The EPA Region 4 Brownfields & Redevelopment Section may revise this Interim SSQAPP Template based on comments and/or new information. Before using this Interim SSQAPP Template, please verify that it is the most recent version posted on the EPA Region 4 Brownfields QAPP Tool Box webpage at the link above. Users of this Interim SSQAPP Template are encouraged to provide comments and feedback for improvement. The EPA Region 4 Brownfields & Redevelopment Section is particularly interested in developing default language (where possible) that could be used where the template currently refers to the QAPP Checklist for data entry. Please provide comments and feedback to David Hayes and Freddie Wilson of the EPA Region 4 Brownfields & Redevelopment Section at: hayes.david@epa.gov and wilson.freddie@epa.gov    "]
[]
["Instructions:"]
["All data entry is conducted in the \"Required Information\" Sheet (data entry cells contain no fill color).  Based on the information entered in the \"Required Information\" Sheet, the Site-Specific QAPP is generated in the \"QAPP\" Sheet.  See the instructions below for particular data entry fields and for saving a PDF of the QAPP. "]
["Required Information","Instructions"]
["Constituents of Concern (COCs)","Check off one box for the COC for this QAPP by clicking the check box next to the contaminant name. If this QAPP involves both Asbestos and Lead-Based Paint, Check off \"Both\"."]
{"$rows_left_out":70}
{"sheet":"Required Information","index":1,"n_rows":299,"n_cols":19,"rows_kept":299,"cut":false,"hidden":false,"merged":[[127,1,137,2],[145,1,176,2],[177,1,188,2],[189,1,192,2],[197,0,210,0],[189,0,192,0],[193,0,196,0],[145,0,176,0],[177,0,188,0],[127,0,137,0],[193,1,196,2],[197,1,210,2],[138,0,144,0],[0,0,40,0],[50,0,59,0],[52,1,52,3],[53,2,53,3],[56,1,56,3],[47,0,49,0],[47,1,47,3],[48,1,48,3],[49,1,49,3],[42,0,46,0],[46,2,46,3],[60,0,61,0],[61,1,61,3],[62,1,62,3],[99,0,111,0],[112,0,126,0],[72,1,72,2],[76,1,85,1],[76,2,85,2],[68,0,85,0],[112,1,112,2],[113,1,120,2],[62,0,67,0],[86,0,98,0],[86,1,98,2],[68,1,68,3],[99,1,111,2],[212,0,241,0],[280,1,297,2],[212,1,241,2],[138,1,144,2],[298,1,298,2],[280,0,297,0],[211,1,211,2]]}
[null,"Fill out the Required Information ",false,false,false,false,false,false,false,false,false,false,{"$f":"IF(C9=\"Florida\",\"Florida Department of Environmental Protection\",IF(C9=\"Kentucky\",\"Kentucky Department for Environmental Protection (KDEP)\",IF(C9=\"Tennessee\",\"Tennessee Department of Environment & Conservation (TDEC)\",IF(C9=\"South Carolina\",\"South Carolina Department of Health and Envrionmental Control (SCDHEC)\",IF(C9=\"North Carolina\",\"North Carolina Department of Environmental Quality (NCDEQ)\",IF(C9=\"Georgia\",\"Georgia Environmental Protection Division (GEPD)\",IF(C9=\"Mississippi\",\"Mississippi Department of Environmental Quality (MDEQ)\",IF(C9=\"Alabama\",\"Alabama Department of Environmental Management (ADEM)\",\"\"))))))))","v":""},"Due to a lack of previous analytical sampling or reconnaissance of the site by ",", field decisions will be made based on observations of building materials encountered, the linear feet of such materials, square feet of material, and/or general location. This sampling is limited to visible materials and will not involve invasive methods to penetrate walls or areas deemed inaccessible or unsafe, such as the roof. Sampling locations will be recorded in the field book and photographed as evidence following the rational presented in A7 (See A7) and documented in the final report submitted to "," and EPA","An inspection will be conducted of all accessible and safe interior and exterior areas of the subject facility to identify ACM by a State licensed asbestos inspector in accordance with the protocols established by the Environmental Protection Agency (EPA) and the ",".  Roofing samples will not be collected if safe access does not exist. Roofing materials will be visually inspected to determine whether presumed asbestos containing materials (PACM) are likely present. The "," Licensed Asbestos Inspector will use professional judgement and experience to determine whether roofing material should be considered PACM."]
[null,false,{"$f":"CONCATENATE(I2,M1,\".\",J2)","v":"The objective of this project is to provide exploratory data through inspection of all accessible and safe interior and exterior areas of the subject site to determine the presence or absence of ACM in accordance with the protocols established by the United States Environmental Protection Agency (U.S. EPA) and the .  Determining the presence or absence of ACM will determine the need for remediation to redevelop or safely reuse the site structure(s). Should ACM be found on site a more comprehensive assessment may be required to quantify the volume of materials present for disposal."},{"$f":"CONCATENATE(K2,M1,\".\",M2)","v":"The objective of this project is to provide exploratory data through inspection of all accessible and safe interior and exterior areas of the subject site to determine the presence or absence of LBP in accordance with the protocols established by the United States Environmental Protection Agency (U.S. EPA) and the .  Determining the presence or absence of LBP will determine the need for remediation to redevelop or safely reuse the site structure(s). Should LBP be found on site a more comprehensive assessment may be required to quantify the volume of materials present for disposal."},{"$f":"CONCATENATE(G2,M1,\". \",H2)","v":"The objective of this project is to provide exploratory data through inspection of all accessible and safe interior and exterior areas of the subject site to determine the presence or absence of ACM and LBP in accordance with the protocols established by the United States Environmental Protection Agency (U.S. EPA) and the . Determining the presence or absence of ACM and LBP will determine the need for remediation to redevelop or safely reuse the site structure(s). Should ACM and LBP be found on site a more comprehensive assessment may be required to quantify the volume of materials present for disposal."},"When LBP is present in a building, OSHA (29 CFR 1926.62), along with state regulations, require some form of controls to be followed during any construction work where an employee may be occupationally exposed to lead. The Department of Housing and Urban Development (HUD) Guidelines for the Evaluation and Control of Lead-Based Paint Hazards in Housing and the EPA Requirements for Lead-Based Paint Activities in Target and Child-Occupied Facilities (40 Code of Federal Regulation (CFR) Part 745) provide regulatory and industry guidelines for conducting lead-based paint sampling. Lead-Based Paint (LBP) means paint or other surface coatings that contain lead equal to or in excess of 1.0 milligram per square centimeter (mg/cm2), or 0.5 percent (0.5%) by weight or 5000 parts per million (ppm). OSHA has no lower threshold for exposure to lead.","The objective of this project is to provide exploratory data through inspection of all accessible and safe interior and exterior areas of the subject site to determine the presence or absence of ACM and LBP in accordance with the protocols established by the United States Environmental Protection Agency (U.S. EPA) and the ","Determining the presence or absence of ACM and LBP will determine the need for remediation to redevelop or safely reuse the site structure(s). Should ACM and LBP be found on site a more comprehensive assessment may be required to quantify the volume of materials present for disposal.","The objective of this project is to provide exploratory data through inspection of all accessible and safe interior and exterior areas of the subject site to determine the presence or absence of ACM in accordance with the protocols established by the United States Environmental Protection Agency (U.S. EPA) and the ","  Determining the presence or absence of ACM will determine the need for remediation to redevelop or safely reuse the site structure(s). Should ACM be found on site a more comprehensive assessment may be required to quantify the volume of materials present for disposal.","The objective of this project is to provide exploratory data through inspection of all accessible and safe interior and exterior areas of the subject site to determine the presence or absence of LBP in accordance with the protocols established by the United States Environmental Protection Agency (U.S. EPA) and the ",{"$f":"_xlfn.CONCAT(\"This assessment is being conducted to confirm the presence or absence of \",H3,\" in building materials to inform future use and/or remediation needs.  A figure depicting lines of authority and the organizational layout is included as Attachment A. Key personnel are detailed below.\")","v":"This assessment is being conducted to confirm the presence or absence of  in building materials to inform future use and/or remediation needs.  A figure depicting lines of authority and the organizational layout is included as Attachment A. Key personnel are detailed below."},"  Determining the presence or absence of LBP will determine the need for remediation to redevelop or safely reuse the site structure(s). Should LBP be found on site a more comprehensive assessment may be required to quantify the volume of materials present for disposal.",null,null," and EPA"]
[null,"Constituents of Concern (COCs)",null,null,null,null,"COC selection:",{"$f":"IF('Required Information'!C1=TRUE,\"Asbestos-Containing Material (ACM)\",IF('Required Information'!D1=TRUE,\"Lead-Based Paint (LBP)\",IF('Required Information'!E1=TRUE,\"Asbestos-Containing Material (ACM) and Lead-Based Paint (LBP)\",\"\")))","v":""}]
[null,"EPA Brownfields Grant Number"]
[null,"Site Name"]
[null,"Site Street Address"]
[null,"Site Address Line 2"]
[null,"Site City"]
[null,"Site State (select from drop-down list)",null,null,null,null,"Site State Selection:"]
[null,"Site Zip Code",null,null,null,null,"Alabama"]
[null,"ACRES ID",null,null,null,null,"Florida"]
[null,"Cooperative Agreement Recipient (CAR) Name",null,null,null,null,"Georgia"]
[null,"CAR Address Line 1",null,null,null,null,"Kentucky"]
[null,"CAR Address Line 2",null,null,null,null,"Mississippi"]
[null,"CAR City",null,null,null,null,"North Carolina"]
[null,"CAR State (select from drop-down list)",null,null,null,null,"South Carolina"]
[null,"CAR Zip Code",null,null,null,null,"Tennessee"]
[null,"Contractor Project Number (optional)"]
[null,"Contractor Name"]
[null,"Contractor Address Line 1"]
{"$rows_left_out":280}
{"sheet":"QAPP","index":2,"n_rows":298,"n_cols":9,"rows_kept":298,"cut":false,"hidden":false,"merged":[[4,1,4,8],[5,1,5,8],[1,1,3,8],[187,1,215,10],[216,0,227,0],[216,1,227,10],[229,0,252,0],[64,0,70,0],[64,1,70,8],[71,0,71,8],[72,1,74,8],[97,0,103,0],[104,0,124,0],[80,0,82,0],[83,0,96,0],[75,6,75,8],[76,6,76,8],[77,6,77,8],[78,6,78,8],[79,6,79,8],[58,0,63,0],[58,1,59,3],[58,4,59,6],[60,1,61,3],[75,4,75,5],[76,4,76,5],[77,4,77,5],[78,4,78,5],[79,4,79,5],[75,1,75,3],[76,1,76,3],[77,1,77,3],[78,1,78,3],[79,1,79,3],[62,7,63,8],[52,1,52,8],[53,1,53,8],[54,1,54,8],[55,1,55,8],[56,1,56,8],[57,1,57,8],[52,0,57,0],[60,4,61,6],[62,1,63,3],[62,4,63,6],[50,1,50,8],[51,1,51,8],[41,1,41,8],[42,1,42,8],[43,1,46,8],[41,0,46,0],[47,0,48,0],[47,1,47,8],[48,1,48,8],[49,1,49,8],[35,0,40,0],[39,1,39,8],[37,1,37,8],[38,1,38,8],[34,5,34,8],[34,0,34,1],[34,2,34,4],[35,1,35,8],[36,1,36,8],[32,5,32,8],[32,0,32,1],[32,2,32,4],[33,5,33,8],[33,0,33,1],[33,2,33,4],[30,0,30,1],[30,2,30,4],[30,5,30,8],[31,5,31,8],[31,0,31,1],[31,2,31,4],[15,4,15,8],[16,4,16,8],[17,4,17,8],[18,4,18,8],[19,4,19,8],[15,1,15,3],[16,1,16,3],[17,1,17,3],[18,1,18,3],[19,1,19,3],[297,0,312,0],[6,1,6,8],[0,1,0,8],[12,1,12,8],[72,0,79,0],[28,1,29,8],[11,1,11,4],[11,5,11,8],[13,1,13,8],[14,1,14,3],[14,4,14,8],[7,1,7,4],[8,1,8,4],[9,1,9,4],[10,1,10,4],[7,5,7,8],[8,5,8,8],[9,5,9,8],[10,5,10,8],[20,0,21,0],[20,1,21,8],[23,0,24,0],[23,1,24,8],[28,0,29,0],[1,0,19,0],[82,1,82,10],[81,1,81,10],[80,1,80,10],[228,0,228,10],[229,1,252,10],[297,1,312,10],[253,1,296,10],[186,0,186,10],[169,1,185,10],[163,1,168,10],[136,1,162,10],[129,1,135,10],[125,1,128,10],[104,1,124,10],[97,1,103,10],[83,1,96,10],[125,0,128,0],[169,0,185,0],[187,0,215,0],[129,0,135,0],[136,0,162,0],[163,0,168,0],[253,0,296,0]]}
[null,"SECTION A: Project Management"]
["A1: Title and Approval",{"$f":"IF('Required Information'!C1=TRUE,\"Site-Specific Quality Assurance Project Plan Addendum for Evaluating Asbestos-Containing Material in Building Materials\",IF('Required Information'!D1=TRUE,\"Site-Specific Quality Assurance Project Plan Addendum for Evaluating Lead-Based Paint in Building Materials\",IF('Required Information'!E1=TRUE,\"Site-Specific Quality Assurance Project Plan Addendum for Evaluating Asbestos-Containing Material and Lead-Based Paint in Building Materials\",\"\")))","v":""}]
[]
[]
[null,"Subject Site:"]
[null,{"$f":"'Required Information'!C5","v":0}]
[null,{"$f":"_xlfn.CONCAT('Required Information'!C6,\", \",'Required Information'!C8,\", \", 'Required Information'!C9)","v":", , "}]
[null,{"$f":"_xlfn.CONCAT(\"Prepared For: \",'Required Information'!C12)","v":"Prepared For: "},null,null,null,{"$f":"_xlfn.CONCAT(\"Prepared By: \",'Required Information'!C19)","v":"Prepared By: "}]
[null,{"$f":"IF('Required Information'!C13=\"\",\"\",'Required Information'!C13)","v":""},null,null,null,{"$f":"IF('Required Information'!C20=\"\",\"\",'Required Information'!C20)","v":""}]
[null,{"$f":"IF('Required Information'!C14=\"\",\"\",'Required Information'!C14)","v":""},null,null,null,{"$f":"IF('Required Information'!C21=\"\",\"\",'Required Information'!C21)","v":""}]
[null,{"$f":"_xlfn.CONCAT('Required Information'!C15,\", \",'Required Information'!C16,\" \",'Required Information'!C17)","v":",  "},null,null,null,{"$f":"_xlfn.CONCAT('Required Information'!C22,\", \",'Required Information'!C23,\" \",'Required Information'!C24)","v":",  "}]
[null,{"$f":"_xlfn.CONCAT(\"EPA Brownfields Grant Number: \",'Required Information'!C4)","v":"EPA Brownfields Grant Number: "},null,null,null,{"$f":"_xlfn.CONCAT(\"Contractor Project Number: \",'Required Information'!C18)","v":"Contractor Project Number: "}]
[null,{"$f":"IF('Required Information'!B2=FALSE,\"\",_xlfn.CONCAT(\"ACRES ID: \",'Required Information'!C11))","v":""}]
[null,{"$f":"TODAY()","v":"2025-05-20"}]
[null,"Approver Organization/Name",null,null,"Signature/Date"]
[null,{"$f":"_xlfn.CONCAT(\"Cooperative Agreement Recipient (CAR) Approver: \",'Required Information'!C25)","v":"Cooperative Agreement Recipient (CAR) Approver: "}]
[null,{"$f":"_xlfn.CONCAT('Required Information'!C19,\" Project Manager: \",'Required Information'!C26)","v":" Project Manager: "}]
[null,{"$f":"_xlfn.CONCAT('Required Information'!C19,\" Technical Director; QA/QC: \",'Required Information'!C27)","v":" Technical Director; QA/QC: "}]
[null,{"$f":"_xlfn.CONCAT('Required Information'!B28,\"/Designated Approving Official: \",'Required Information'!C28)","v":"EPA Project Officer/Designated Approving Official: "}]
[null,{"$f":"_xlfn.CONCAT('Required Information'!C30,\": \",'Required Information'!C31)","v":": "}]
{"$rows_left_out":279}
{"sheet":"A Section","index":3,"n_rows":16,"n_cols":106,"rows_kept":16,"cut":false,"hidden":true,"merged":[[2,1,4,1],[9,1,11,1],[8,0,12,0]]}
["Section","Required Information"]
["A4",null,{"$f":"'Required Information'!C12","v":0},"selected ",{"$f":"'Required Information'!C19","v":0}]
["A5","State the Problem Defeinition/Background \n\nBackground: Briefly describe the known history of the site. Stick to the facts only.  This section must describe what you are doing and why you are doing it. Some example, but incomplete, text is provided.\n\nEx. The Site was first developed in 1935 as a municipal building and was susequently sold to a private developer in 2009. The Site has been unoccupied since being acquired in 2009.  Due to the age of the structure and lack of documentation on previous assessments it is believed asbestos containming materials (ACM) and Lead-Based Paint (LBP)  may be present in the structure.\n\n\n\n\n\n\n\n\n\n\n ","Due","to","a","lack","of","previous","analytical","sampling","or","a","reconizance","of","the","site","by",{"$f":"'Required Information'!C35","v":0},"field","descisions","will","be","made","based","on","observations","of","building","materials","encountered,","the","linear","feet","of","such","materials,","square","feet","of","material,","and/or","general","location.","This","sampling","is","limited","to","visible","materials","and","will","not","involve","invasive","methods","to","penetrate","walls","or","areas","deemed","inaccible","or","unsafe,","such","as","the","roof.","Sampling","locations","will","be","recorded","in","the","field","book","and","photographed","as","evidence","following","the","rational","presented","in","A7","(See","A7)","and","documented","in","the","final","report","submitted","to",{"$f":"'Required Information'!C12","v":0},"and","EPA"]
[null,null,"The","objective","of","this","Project","is","to","provide","exploratory","data","through","inspection","of","all","accessible","and","safe","interior","and","exterior","areas","of","the","subject","site","to","determine","the","presence","or","absence","of","ACM","and/or","LBP","in","accordance","with","the","protocols","established","by","the","United","States","Environmental","Protection","Agency","(USEPA)","and","the","Mississippi","Department","of","Environmental","Quality","(MDEQ).","Determining","the","presence","or","absence","of","ACM","and","LBP","will","determine","the","need","for","remediation","to","redvelop","or","safely","reuse","the","site","structure(s).","Should","ACM","and","LBP","be","found","on","site","a","more","comprenehisive","assessment","will","be","required","to","quantify","the","volume","of","materials","present","for","disposal."]
[]
[]
[]
[]
["A6","Projected Lab Conpletion Date","days of sample receipt. "]
[null,"Project/Task Description",{"$f":"CONCATENATE('Required Information'!Q1,'Required Information'!M1,'Required Information'!R1,'Required Information'!C9,'Required Information'!S1)","v":"An inspection will be conducted of all accessible and safe interior and exterior areas of the subject facility to identify ACM by a State licensed asbestos inspector in accordance with the protocols established by the Environmental Protection Agency (EPA) and the .  Roofing samples will not be collected if safe access does not exist. Roofing materials will be visually inspected to determine whether presumed asbestos containing materials (PACM) are likely present. The  Licensed Asbestos Inspector will use professional judgement and experience to determine whether roofing material should be considered PACM."}]
[null,null,{"$f":"_xlfn.CONCAT(\"Representative bulk samples of homogenous materials will be collected and analyzed at NVLAP accredited \",'Required Information'!C19)","v":"Representative bulk samples of homogenous materials will be collected and analyzed at NVLAP accredited "},"l, inc. by polarized light microscopy (PLM) at standard turn-around time (TAT) of approximately 10 working days.  PLM analysis of some non-friable organically bound ACM materials (NOB) such as floor tiles, roofing, etc. may be inconclusive for ACM.  Transmission electron microscopy (TEM) analysis provides lower asbestos detection limits, and will be utilized if PLM analysis is inconclusive. "]
[null,null,"Representative bulk samples of homogeneous building materials will be sampled and analyzed for asbestos at a laboratory accredited by the National Voluntary Laboratory Accreditation Program (NVLAP) as described in Section A7, B1, B2, and B4 of this Site-Specific QAPP. "]
[null,"LBP",{"$f":"'Required Information'!C47","v":"The lead-based paint survey will be conducted of all accessible and safe interior and exterior areas of the subject facility. Representative bulk samples of homogeneous building materials will be sampled and analyzed for lead in paint as described in Section A7, B1, B2, and B4 of this Site-Specific QAPP.  <Specify whether representative paint samples will be analyzed for lead using a laboratory method, a hand-held X-Ray Fluorescence (XRF) device, or both XRF and laboratory methods.> "}]
["A7","ACM","Once the licensed ACM contractor arrives on site, a comprehensive walkthrough of the site will be conducted to identify materials and surfaces for sampling (i.e. painted/peeling walls, mastic, adhesives, floor tiles, caulks, acoustic ceiling tiles, etc.)."]
[null,"LBP","Once the licensed LBP contractor arrives on site, a comprehensive walkthrough of the site will be conducted to identify materials and surfaces for sampling (i.e. painted/peeling walls, mastic, adhesives, floor tiles, caulks, acoustic ceiling tiles, etc.)."]
[null,"Both","Once the licensed ACM/LBP contractor arrives on site, a comprehensive walkthrough of the site will be conducted to identify materials and surfaces for sampling (i.e. painted/peeling walls, mastic, adhesives, floor tiles, caulks, acoustic ceiling tiles, etc.)."]

{"sheet":"B Section","index":4,"n_rows":7,"n_cols":2,"rows_kept":7,"cut":false,"hidden":true,"merged":[]}
["B2","Procedures"]
[null,{"$f":"IF('Required Information'!$F$1=TRUE, \"SESDPROC-010-R5 Log Books\",\"\")","v":""}]
[null,{"$f":"IF('Required Information'!$G$1=TRUE, \"SFDGUID-001-R0 Superfund X-Ray Fluorescence Field Operations\",\"\")","v":""}]
[null,{"$f":"IF('Required Information'!$H$1=TRUE, \"HUD Guidelines For The Evaluation And Control Of Lead-Based Paint Hazards In Housing Appendix 13.2 Paint Chip Sampling, (2012 Edition)\",\"\")","v":""}]
[null,{"$f":"IF('Required Information'!$I$1=TRUE, \"SESDGUID-104-R1 Bulk Sampling for Asbestos (attach a copy of this document to the QAPP)\",\"\")","v":""}]
[null,{"$f":"IF('Required Information'!$J$1=TRUE, \"SESDPROC-005-R2 Sample and Evidence Management\",\"\")","v":""}]
[null,{"$f":"IF('Required Information'!$K$1=TRUE, \"ASTM E1729 - 16 Standard Practice for Field Collection of Dried Paint Samples for Subsequent Lead Determination\",\"\")","v":""}]