{"text_format":"1","workbook":"xlsx","n_sheets":12,"sheets":["Cover Page","ReadMe","Release Summary","QC Sheet","Release Point Summary","Release Parameters","Release Calcs","Release Results","Scenario 1_Static_OH","Scenario 1_Static","Scenario 2_Static_OH","Scenario 2_Static"],"not_rendered":{"charts":0,"images":1,"macros":1,"external_links":5,"defined_names":246,"comments":0,"pivot_tables":0},"unopened":[],"bounds":{"document_bytes":16777216,"sheet_cells":100000,"rows_first":2000,"rows_last":500,"rows_between":2000,"halvings":0,"cell_chars":16384,"cell_head_chars":4096},"cells_cut":0,"cells_raw":0,"read":"whole","date_system":"1900"}

{"sheet":"Cover Page","index":0,"n_rows":11,"n_cols":2,"rows_kept":11,"cut":false,"hidden":false,"merged":[]}
[]
[]
[]
[]
[null,"Risk Evaluation for 1,1-Dichloroethane  -"]
[]
[null,"Supplemental Information File:"]
[]
[null,"Repackaging Environmental Release Modeling Results"]
[]
[null,"CASRN: 75-34-3"]

{"sheet":"ReadMe","index":1,"n_rows":19,"n_cols":3,"rows_kept":19,"cut":false,"hidden":false,"merged":[[18,1,18,2],[3,1,3,2],[17,1,17,2],[16,1,16,2],[15,1,15,2],[14,1,14,2]]}
[]
[null,"Instructions for Using this Spreadsheet"]
[]
[null,"Table of Contents"]
[null,"Worksheet","Description"]
[null,"Instructions (this worksheet)","Provides instructions to the user on the use of this spreadsheet"]
[null,"Release Point Summary","Summarizes the Release Points and associated parameters used to calculate the amount of annual release from each Release Point"]
[null,"Release Parameters","A list of parameters for the release calculations. Allows an advanced user to select between performing a deterministic or Monte Carlo simulation. Monte Carlo formulas on this worksheet are based on the Monte Carlo simulator @Risk. Certain cells will appear with the \"#NAME?\" error indicator if a user does not have the program @Risk. The user must not alter parameters in this worksheet. Turn Monte Carlo \"Off\" using the toggle at the top of the sheet to view deterministic calculations (@Risk not needed for this)."]
[null,"Release Calcs","Performs the release calculations. This worksheet contains @Risk formulas to capture results during a Monte Carlo simulation iteration. Certain cells will appear with the \"#NAME?\" error indicator if a user does not have the program @Risk. The user must not alter this worksheet."]
[null,"Release Results","Provides the release results for the baseline scenario from the Monte Carlo simulation. The user must not alter this worksheet."]
[null,"Scenario 1_Static","Scenario 1: Fixed number of sites, PV=5,000 lbs\n\nProvides static release results from running the simulation with the specified parameters for the given scenario. @Risk not needed to view."]
[null,"Scenario 2_Static","Scenario 2: Fixed number of sites, PV=50,000 lbs\n\nProvides static release results from running the simulation with the specified parameters for the given scenario. @Risk not needed to view."]
[]
[]
[null,"General Notes/Assumptions"]
{"$rows_left_out":5}
{"sheet":"Release Summary","index":2,"n_rows":23,"n_cols":19,"rows_kept":23,"cut":false,"hidden":false,"merged":[[4,5,5,5],[6,3,10,3],[4,3,5,3],[15,3,16,3],[4,0,5,0],[4,1,5,1],[22,0,23,5],[4,13,4,18],[15,7,15,12],[15,13,15,18],[4,2,5,2],[15,2,16,2],[4,4,5,4],[15,4,16,4],[11,0,12,5],[15,5,16,5],[15,6,16,6],[17,3,21,3],[4,7,4,12],[15,0,16,0],[15,1,16,1],[4,6,5,6]]}
["Release Summary - 50th and 95th Percentile estimates"]
[{"$f":"\"Scenario 2: PV = \" & 'Scenario 2_Static'!B2 & \" kg/yr\"","v":"Scenario 2: PV = 22680 kg/yr"}]
[]
["50th Percentile"]
["Release Source","Media of Release","Daily Release (kg/site-day)","Days per Year","Annual Release (kg/site-yr)","Release Duration (hr/day)","Release Pattern","Daily Release Estimate by Media (kg/site-day)",null,null,null,null,null,"Annual Release Estimate by Media (kg/site-yr)"]
[null,null,null,null,null,null,null,"Water (Direct)","Water (Indirect)","Hazardous Waste Incineration","Hazardous Waste Landfill","Stack Air","Fugitive Air","Water (Direct)","Water (Indirect)","Hazardous Waste Incineration","Hazardous Waste Landfill","Stack Air","Fugitive Air"]
["1. Emptying (drums)","Fugitive or Stack Air",{"$f":"INDEX('Scenario 2_Static'!$B$43:$I$49,MATCH(A$4,'Scenario 2_Static'!$A$43:$A$49, 0), MATCH($A7, 'Scenario 2_Static'!$B$30:$F$30, 0))","v":0.20339540721804897},{"$f":"'Scenario 2_Static'!$F$12","v":26},{"$f":"INDEX('Scenario 2_Static'!$B$34:$I$40,MATCH(A$4,'Scenario 2_Static'!$A$43:$A$49, 0), MATCH($A7, 'Scenario 2_Static'!$B$30:$F$30, 0))","v":9.2345840022479848},"mean: 2.4\nrange: 1.3 to 6.4","unknown - see operating days",null,null,null,null,{"$f":"C7","v":0.20339540721804897},{"$f":"C7","v":0.20339540721804897},null,null,null,null,{"$f":"E7","v":9.2345840022479848},{"$f":"E7","v":9.2345840022479848}]
["2. Storage","N/A","n/a",null,{"$f":"INDEX('Scenario 2_Static'!$B$34:$I$40,MATCH(A$4,'Scenario 2_Static'!$A$43:$A$49, 0), MATCH($A8, 'Scenario 2_Static'!$B$30:$F$30, 0))","v":"-"},"N/A","unknown - see operating days"]
["3. Filling (small containers)","Fugitive or Stack Air",{"$f":"INDEX('Scenario 2_Static'!$B$43:$I$49,MATCH(A$4,'Scenario 2_Static'!$A$43:$A$49, 0), MATCH($A9, 'Scenario 2_Static'!$B$30:$F$30, 0))","v":3.3718187214541756E-2},null,{"$f":"INDEX('Scenario 2_Static'!$B$34:$I$40,MATCH(A$4,'Scenario 2_Static'!$A$43:$A$49, 0), MATCH($A9, 'Scenario 2_Static'!$B$30:$F$30, 0))","v":1.5553780218495301},"mean: 4.8\nrange: 2.1 to 8.5","unknown - see operating days",null,null,null,null,{"$f":"C9","v":3.3718187214541756E-2},{"$f":"C9","v":3.3718187214541756E-2},null,null,null,null,{"$f":"E9","v":1.5553780218495301},{"$f":"E9","v":1.5553780218495301}]
["4. Open Surface Losses to Air During Container Cleaning","Fugitive or Stack Air",{"$f":"INDEX('Scenario 2_Static'!$B$43:$I$49,MATCH(A$4,'Scenario 2_Static'!$A$43:$A$49, 0), MATCH($A10, 'Scenario 2_Static'!$B$30:$F$30, 0))","v":2.6052098468059585E-3},null,{"$f":"INDEX('Scenario 2_Static'!$B$34:$I$40,MATCH(A$4,'Scenario 2_Static'!$A$43:$A$49, 0), MATCH($A10, 'Scenario 2_Static'!$B$30:$F$30, 0))","v":0.11838213841245621},"mean: 2.4\nrange: 1.3 to 6.4","unknown - see operating days",null,null,null,null,{"$f":"C10","v":2.6052098468059585E-3},{"$f":"C10","v":2.6052098468059585E-3},null,null,null,null,{"$f":"E10","v":0.11838213841245621},{"$f":"E10","v":0.11838213841245621}]
["5. Container Cleaning (drums)","Hazardous Waste Landfill or Hazardous Waste Incineration*",{"$f":"INDEX('Scenario 2_Static'!$B$43:$I$49,MATCH(A$4,'Scenario 2_Static'!$A$43:$A$49, 0), MATCH($A11, 'Scenario 2_Static'!$B$30:$F$30, 0))","v":5.9958922002900641},null,{"$f":"INDEX('Scenario 2_Static'!$B$34:$I$40,MATCH(A$4,'Scenario 2_Static'!$A$43:$A$49, 0), MATCH($A11, 'Scenario 2_Static'!$B$30:$F$30, 0))","v":274.54931043622059},"N/A","unknown - see operating days",null,null,{"$f":"C11","v":5.9958922002900641},{"$f":"C11","v":5.9958922002900641},null,null,null,null,{"$f":"E11","v":274.54931043622059},{"$f":"E11","v":274.54931043622059}]
["* Note that incineration release estimates represent the amount of chemical sent for incineration and do not account for destruction efficiency. Water releases are not expected as 1,1-Dichloroethane is classified as hazardous by RCRA; according to the GS hazardous wastes are likely sent to hazardous landfill or incineration - water releases are not expected.",null,null,null,null,null,"Total Releases by Media:",{"$f":"IF(SUM(H7:H11)>0, SUM(H7:H11), \"\")","v":""},{"$f":"IF(SUM(I7:I11)>0, SUM(I7:I11), \"\")","v":""},5.9958922002900641,5.9958922002900641,0.23971880427939668,0.23971880427939668,{"$f":"IF(SUM(N7:N11)>0, SUM(N7:N11), \"\")","v":""},{"$f":"IF(SUM(O7:O11)>0, SUM(O7:O11), \"\")","v":""},{"$f":"IF(SUM(P7:P11)>0, SUM(P7:P11), \"\")","v":274.54931043622059},{"$f":"IF(SUM(Q7:Q11)>0, SUM(Q7:Q11), \"\")","v":274.54931043622059},{"$f":"IF(SUM(R7:R11)>0, SUM(R7:R11), \"\")","v":10.908344162509971},{"$f":"IF(SUM(S7:S11)>0, SUM(S7:S11), \"\")","v":10.908344162509971}]
[]
[]
["95th Percentile"]
{"$rows_left_out":9}
{"sheet":"QC Sheet","index":3,"n_rows":31,"n_cols":10,"rows_kept":31,"cut":false,"hidden":false,"merged":[[11,0,11,9],[16,0,16,9],[21,0,21,9],[26,0,26,9]]}
[]
[]
[]
[]
[]
[]
[]
[]
[]
[]
[]
["Scenario 1 (1,1-DCA)"]
["Annual Emissions","Total Fugitive or stack air","Total Release to Hazardous Landfill or Incineration",null,"1. Emptying (drums)","2. Storage","3. Filling (small containers)","4. Open Surface Losses to Air During Container Cleaning","5. Container Cleaning (drums)","Yearly Use Rate/Site (kg/site-yr)"]
[null,null,null,null,"Fugitive or Stack Air","Not expected to lead to significant losses to the environment","Fugitive or Stack Air","Fugitive or Stack Air","Landfill or incineration"]
["Kilograms/site-yr",{"$f":"'Scenario 1_Static'!B11*2","v":6.1446358040325801},{"$f":"'Scenario 1_Static'!C11*2","v":67.998174405483326},null,{"$f":"'Scenario 1_Static'!B34*2","v":4.4270672569758949},null,{"$f":"'Scenario 1_Static'!D34*2","v":2.6908908581393183},{"$f":"'Scenario 1_Static'!E34*2","v":0.12430511568866727},{"$f":"'Scenario 1_Static'!F34*2","v":67.998174405483326},2268]
{"$rows_left_out":17}
{"sheet":"Release Point Summary","index":4,"n_rows":20,"n_cols":18,"rows_kept":20,"cut":false,"hidden":false,"merged":[[0,16,0,17],[1,12,1,13],[1,6,1,7],[1,4,1,5],[1,8,1,9],[1,10,1,11],[0,0,0,1],[0,3,0,13],[2,4,2,5],[2,6,2,7],[2,8,2,9],[2,10,2,11],[2,12,2,13]]}
["Parameter Definition",null,null,"Release Points (from ESD/GS)",null,null,null,null,null,null,null,null,null,null,null,null,"General Parameters"]
["Possible Parameters","Variable",null,"Release Point","1. Emptying (drums)",null,"2. Storage",null,"3. Filling (small containers)",null,"4. Open Surface Losses to Air During Container Cleaning",null,"5. Container Cleaning (drums)",null,null,null,"Number of Sites","Ns"]
["Saturation Factor Unloading","Fsaturation_unloading",null,"Expected/Conservative Release Media","fugitive air or stack air",null,"Not expected to lead to significant losses to the environment",null,"fugitive air or stack air",null,"fugitive air or stack air",null,"wastewater to onsite treatment or discharge to POTW (with or without pretreatment)",null,null,null,"Production Volume","PV"]
["1,1-DCA Molecular Weight","MW",null,"Input Parameters:","Saturation Factor Unloading","Fsaturation_unloading","-","-","Saturation Factor Loading","Fsaturation_loading","1,1-DCA Molecular Weight","MW","Container Loss Fraction","Floss_cont"]
["Import Container Volume","Vimport_cont",null,null,"1,1-DCA  Molecular Weight","MW",null,null,"1,1-DCA Molecular Weight","MW","1,1-DCA Mass Fraction/VP Correction Factor","F11DCA","Production Volume","PV"]
["Fill Rate of Drum","RATEfill_drum",null,null,"Import Container Volume","Vimport_cont",null,null,"Small Container Volume","Vfill_cont","1,1-DCA Vapor Pressure","VP"]
["1,1-DCA Vapor Pressure","VP",null,null,"Fill Rate of Drum","RATEfill_drum",null,null,"Fill Rate of Small Container","RATEfill_smallcont","Air Speed","RATEair_speed"]
["Gas Constant","R",null,null,"1,1-DCA Vapor Pressure","VP",null,null,"1,1-DCA Vapor Pressure","VP","Diameter of Opening for Container Cleaning","Dopening_cont-cleaning"]
["Temperature","T",null,null,"Gas Constant","R",null,null,"Gas Constant","R","Temperature","T"]
["Production Volume","PV",null,null,"Temperature","T",null,null,"Temperature","T","Pressure","P"]
["1,1-DCA Density","r",null,null,"Production Volume","PV",null,null,"Production Volume","PV","Fill Rate of Drum","RATEfill_drum"]
["Saturation Factor Loading","Fsaturation_loading",null,null,"1,1-DCA Density","r",null,null,"1,1-DCA Density","r","Import Container Volume","Vimport_cont"]
["Small Container Volume","Vfill_cont",null,null,null,null,null,null,null,null,"Production Volume","PV"]
["Fill Rate of Small Container","RATEfill_smallcont",null,null,null,null,null,null,null,null,"1,1-DCA Density","r"]
["1,1-DCA Mass Fraction/VP Correction Factor","F11-DCA"]
{"$rows_left_out":6}
{"sheet":"Release Parameters","index":5,"n_rows":31,"n_cols":16,"rows_kept":31,"cut":false,"hidden":false,"merged":[[3,9,4,9],[3,11,4,11],[3,12,4,12],[10,1,11,1],[10,2,11,2],[10,12,11,12],[3,1,4,1],[3,3,4,3],[3,2,4,2],[3,6,3,8],[3,4,3,5]]}
[]
[null,"Turn Monte Carlo On or Off","On"]
[]
[null,"Input Parameter","Symbol","Unit","Deterministic Values",null,"Uncertainty Analysis Distribution Parameters",null,null,"Distribution Type",null,"Selected Value (Deterministic or @Risk Formula)","Notes/Comments"]
[null,null,null,null,"Value","Basis","Lower Bound","Upper Bound","Mode",null,"@Risk Formulas",null,null,null,null,"On/Off Drop Down"]
[null,"Container Loss Fraction","Floss_cont","kg/kg",2.5000000000000001E-2,"Typical",1.7000000000000001E-2,0.03,2.5000000000000001E-2,"Triangular",2.5000000000000001E-2,{"$f":"IF($C$2=$P$6, K6, E6)","v":2.5000000000000001E-2},"Loss fractions for container residual are consistent with EPA/OPPT Drum residual Model using 0.03 loss fraction as high-end and 0.025 as central tendency. Minimum of 0.017 is per review of data used to develop drum model and preliminary EPA guidance on 5/25/2022.",null,null,"On"]
[null,"Saturation Factor Unloading","Fsaturation_unloading","kg/kg",0.5,"Typical",0.5,1.45,0.5,"Triangular",0.5,0.5,"AP-42 provided values",null,null,"Off"]
[null,"Saturation Factor Loading","Fsaturation_loading","kg/kg",0.5,"Typical",0.5,1.45,0.5,"Triangular",0.5,0.5,"AP-42 provided values"]
[null,"Import Container Volume","Vimport_cont","gal/container",55,"Typical",20,100,55,"Triangular",55,{"$f":"IF($C$2=$P$6, K9, E9)","v":55},"Standard EPA values for Vapor Generation Rate/Volatile Air Release Models given as 20 to <100 gallons for drum volume, with 55 gallons as default value. Typically use drums for given throughput as suggested in ESD on Transport and Storage (HERO ID 6393282)."]
[null,"Small Container Volume","Vfill_cont","gal/container",5,"Typical",5,20,5,"Triangular",5,5,"Standard EPA values for Vapor Generation Rate/Volatile Air Release Models given as 5 to <20 gallons for small container volume, with 5 gallons as default value. "]
[null,"Air Speed","RATEair_speed","cm/s",10,"50th percentile",1.3,202.2,"—","Lognormal",10,{"$f":"IF($C$2=$P$6, K11, E11)","v":10},"Distribution using EPA's air speed model for industrial uses; converted to ft/min for model use. For industrial facilities, it’s a lognormal distribution with mean of 22.414 cm/s, standard deviation of 19.958 cm/s, max truncated at 202.2 cm/s."]
[null,null,null,"ft/min",{"$f":"E11*ft_per_cm*60","v":19.684799999999999},"50th percentile",{"$f":"G11*ft_per_cm*60","v":2.559024},{"$f":"H11*ft_per_cm*60","v":398.02665599999995},"—","Lognormal",19.684799999999999,{"$f":"IF($C$2=$P$6, K12, E12)","v":19.684799999999999}]
[]
[null,"Constants and Unit Conversions","Symbol","Value","Unit","Notes/Comments"]
[null,"Number of Sites","Ns",2,"sites","what-if scenario "]
{"$rows_left_out":17}
{"sheet":"Release Calcs","index":6,"n_rows":30,"n_cols":6,"rows_kept":30,"cut":false,"hidden":false,"merged":[]}
[]
[null,"Calculation of Baseline Releases"]
[]
[null,"Parameter Name","Symbol","Equation","Stochastic Value","Unit"]
[null,"Facility Production Rate","PVsite","PV/Ns",11339.822735890993,"kg/site-year"]
[null,"Release Days per site/Number of Import Containers","RD","(PVsite/(rho11DCA*0.00378541 m3/gal*Vimport_cont)",47,"days"]
[null,"Facility Daily Production Rate","Qchem_site_day","PV/(Nsites * RD)",241.27282416789348,"kg/site-day"]
[null,"Facility Annual Production Rate","Qchem_site_yr","PV/(Nsites)",11339.822735890993,"kg/site-day"]
[null,"Mass of Chemical in Unloaded Container","Qproc_container_unload","Vimport_container * RHO12DCA * m^3_per_gal",243.1747384,"kg chemical/unload container"]
[null,"Mass of Chemical in Filled Container","Qproc_container_fill","Vsmall_container * RHO12DCA * m^3_per_gal",22.106794399999998,"kg chemical/fill container"]
[null,"Number of Transport Containers Unloaded Daily per Site","Ncont_unload_day","(Qchem_site_day * RD)/(Fchem * Qproc_cont_unload)",46.632404379265878,"containers unloaded/day"]
[null,"Number of Transport Containers Unloaded Annually per Site","Ncont_unload_yr","(Qchem_site_yr * RD)/(Fchem * Qproc_cont_unload)",2191.7230058254963,"containers unloaded/day"]
[null,"Number of Transport Containers Unloaded Daily per Site","Ncont_load_day","(Qchem_site_day * RD)/(Fchem * Qproc_cont_fill)",512.95644817192465,"containers loaded/day"]
[null,"Number of Transport Containers Unloaded Annually per Site","Ncont_load_yr","(Qchem_site_yr * RD)/(Fchem * Qproc_cont_fill)",24108.953064080459,"containers loaded/day"]
[null,"Daily Hours Spent Unloading Containers","OHunload_day","Ncont_unload_day/RATEfill_drum",2.3316202189632937,"hours/day"]
{"$rows_left_out":16}
{"sheet":"Release Results","index":7,"n_rows":67,"n_cols":6,"rows_kept":67,"cut":false,"hidden":false,"merged":[[4,0,4,1],[0,0,0,1],[8,1,8,2],[28,1,28,5]]}
["What-If Scenario"]
["Production Volume Assessed (kg/yr)",22680]
["Number of Sites",2]
[]
["Monte Carlo Simulation Parameters"]
["Number of Iterations",100000]
["Sampling Method","Latin Hypercube"]
[]
[null,"Release Media"]
["Total Annual Release (kg/site-yr)","fugitive air or stack air","hazardous landfill or incineration",null,"Release Days (days/yr)","RD"]
["Maximum",6.5521318043742083,283.49556839727484,null,"Maximum",47]
["99th Percentile",6.5521318043742083,283.49556839727484,null,"Minimum",47]
["95th Percentile",6.5521318043742083,283.49556839727484]
["50th Percentile",6.5521318043742083,283.49556839727484]
["5th Percentile",6.5521318043742083,283.49556839727484]
{"$rows_left_out":53}
{"sheet":"Scenario 1_Static_OH","index":8,"n_rows":67,"n_cols":6,"rows_kept":67,"cut":false,"hidden":false,"merged":[[0,0,0,1],[4,0,4,1],[8,1,8,2],[28,1,28,5]]}
["What-If Scenario"]
["Production Volume Assessed (kg/yr)",2268]
["Number of Sites",2]
[]
["Monte Carlo Simulation Parameters"]
["Number of Iterations",100000]
["Sampling Method","Latin Hypercube"]
[]
[null,"Release Media"]
["Total Annual Release (kg/site-yr)","fugitive air or stack air","hazardous landfill or incineration",null,"Release Days (days/yr)","RD"]
["Maximum",2.881210779649662,34.009808252079829,null,"Maximum",13]
["99th Percentile",2.2237119772414435,33.105051042015219,null,"Minimum",3]
["95th Percentile",1.9645407897323091,31.9751001436202]
["50th Percentile",1.2174522871701883,27.454956720057002]
["5th Percentile",0.79950872750227364,21.863475095235298]
{"$rows_left_out":53}
{"sheet":"Scenario 1_Static","index":9,"n_rows":49,"n_cols":6,"rows_kept":49,"cut":false,"hidden":false,"merged":[[0,0,0,1],[4,0,4,1],[8,1,8,2],[28,1,28,5]]}
["What-If Scenario"]
["Production Volume Assessed (kg/yr)",2268]
["Number of Sites",2]
[]
["Monte Carlo Simulation Parameters"]
["Number of Iterations",100000]
["Sampling Method","Latin Hypercube"]
[]
[null,"Release Media"]
["Total Annual Release (kg/site-yr)","fugitive air or stack air","hazardous landfill or incineration",null,"Release Days (days/yr)","RD"]
["Maximum",3.0723179020162901,33.999087202741663,null,"Maximum",13]
["99th Percentile",2.2267355404304987,33.105210870776389,null,"Minimum",3]
["95th Percentile",1.9641645657470921,31.974960497144597]
["50th Percentile",1.2157820284539287,27.454950301583601]
["5th Percentile",0.80052088680925304,21.863497109873606]
{"$rows_left_out":35}
{"sheet":"Scenario 2_Static_OH","index":10,"n_rows":67,"n_cols":6,"rows_kept":67,"cut":false,"hidden":false,"merged":[[0,0,0,1],[4,0,4,1],[8,1,8,2],[28,1,28,5]]}
["What-If Scenario"]
["Production Volume Assessed (kg/yr)",22680]
["Number of Sites",2]
[]
["Monte Carlo Simulation Parameters"]
["Number of Iterations",100000]
["Sampling Method","Latin Hypercube"]
[]
[null,"Release Media"]
["Total Annual Release (kg/site-yr)","fugitive air or stack air","hazardous landfill or incineration",null,"Release Days (days/yr)","RD"]
["Maximum",29.402576079305248,340.0643145739935,null,"Maximum",128]
["99th Percentile",20.065606785884345,331.04791109933092,null,"Minimum",26]
["95th Percentile",17.784440718262978,319.75097494741948]
["50th Percentile",11.062528814968326,274.54931669336764]
["5th Percentile",7.3449482453771626,218.63550928509008]
{"$rows_left_out":53}
{"sheet":"Scenario 2_Static","index":11,"n_rows":49,"n_cols":6,"rows_kept":49,"cut":false,"hidden":false,"merged":[[0,0,0,1],[4,0,4,1],[8,1,8,2],[28,1,28,5]]}
["What-If Scenario"]
["Production Volume Assessed (kg/yr)",22680]
["Number of Sites",2]
[]
["Monte Carlo Simulation Parameters"]
["Number of Iterations",100000]
["Sampling Method","Latin Hypercube"]
[]
[null,"Release Media"]
["Total Annual Release (kg/site-yr)","fugitive air or stack air","hazardous landfill or incineration",null,"Release Days (days/yr)","RD"]
["Maximum",27.920118193408385,340.0087059635477,null,"Maximum",129]
["99th Percentile",20.125624815221702,331.04827971380257,null,"Minimum",26]
["95th Percentile",17.79037939822355,319.75028924505489]
["50th Percentile",11.074060477301018,274.54931043622059]
["5th Percentile",7.3341709260821046,218.63354920030272]
{"$rows_left_out":34}