{"text_format":"1","workbook":"xlsx","n_sheets":13,"sheets":["Cover Page","ReadMe","Exposure Summary","QC","Exposure Point Summary","Exposure Parameters","Exposure Calcs","Exposure Results","Exposure Results (2)","Exposure Results (3)","Scenario 1_Static","Scenario 2_Static","Scenario 3_Static"],"not_rendered":{"charts":0,"images":1,"macros":1,"external_links":5,"defined_names":229,"comments":0,"pivot_tables":0},"unopened":[],"bounds":{"document_bytes":16777216,"sheet_cells":100000,"rows_first":2000,"rows_last":500,"rows_between":2000,"halvings":0,"cell_chars":16384,"cell_head_chars":4096},"cells_cut":0,"cells_raw":0,"read":"whole","date_system":"1900"}

{"sheet":"Cover Page","index":0,"n_rows":11,"n_cols":2,"rows_kept":11,"cut":false,"hidden":false,"merged":[]}
[]
[]
[]
[]
[null,"Risk Evaluation for 1,1-Dichloroethane  -"]
[]
[null,"Supplemental Information File:"]
[]
[null,"Repackaging Occupational Exposure Modeling Results"]
[]
{"$rows_left_out":2}
{"sheet":"ReadMe","index":1,"n_rows":23,"n_cols":3,"rows_kept":23,"cut":false,"hidden":false,"merged":[[22,1,22,2],[21,1,21,2],[3,1,3,2],[20,1,20,2],[19,1,19,2],[18,1,18,2],[17,1,17,2]]}
[]
[null,"Instructions for Using this Spreadsheet"]
[]
[null,"Table of Contents"]
[null,"Worksheet","Description"]
[null,"Instructions (this worksheet)","Provides instructions to the user on the use of this spreadsheet"]
[null,"Exposure Point Summary","Summarizes the Exposure Points and associated parameters used to calculate the amount of annual exposure from each Exposure Point"]
[null,"Exposure Parameters","A list of parameters for the exposure calculations. Allows an advanced user to select between performing a deterministic or Monte Carlo simulation. Monte Carlo formulas on this worksheet are based on the Monte Carlo simulator @Risk. Certain cells will appear with the \"#NAME?\" error indicator if a user does not have the program @Risk. The user must not alter parameters in this worksheet. Turn Monte Carlo \"Off\" using the toggle at the top of the sheet to view deterministic calculations (@Risk not needed for this)."]
[null,"Exposure Calcs","Performs the exposure calculations. This worksheet contains @Risk formulas to capture results during a Monte Carlo simulation iteration. Certain cells will appear with the \"#NAME?\" error indicator if a user does not have the program @Risk. The user must not alter this worksheet."]
[null,"Exposure Results","Provides the release results for scenario 1 from the Monte Carlo simulation. The user must not alter this worksheet."]
{"$rows_left_out":14}
{"sheet":"Exposure Summary","index":2,"n_rows":18,"n_cols":13,"rows_kept":18,"cut":false,"hidden":false,"merged":[[15,5,15,6],[15,7,15,8],[15,9,15,10],[15,11,15,12],[15,0,16,0],[15,1,15,2],[15,3,15,4],[2,0,3,0],[2,1,2,2],[2,3,2,4],[2,5,2,6],[9,0,10,0],[9,1,9,2],[9,3,9,4],[9,5,9,6],[11,5,12,5],[11,6,12,6],[9,9,9,10],[9,11,9,12],[2,7,2,8],[4,5,6,5],[4,6,6,6],[4,7,6,7],[4,8,6,8],[9,7,9,8],[2,9,2,10],[2,11,2,12],[4,9,6,9],[4,10,6,10],[4,11,6,11],[4,12,6,12],[11,9,12,9],[11,10,12,10],[11,11,12,11],[11,12,12,12],[11,7,12,7],[11,8,12,8]]}
["Exposure Summary - 50th and 95th Percentile estimates"]
["Scenario 1: Activities A, B, & C"]
["Exposure Point","Mass Concentration [mg/m^3]",null,"Volume Concentration [ppm]",null,"Exposure Days per Year",null,"Exposure Hours per Day",null,"8-hr TWA (ppm)",null,"24-hr TWA (ppm)"]
[null,"50th Percentile","95th Percentile","50th Percentile","95th Percentile","Minimum","Maximum","Minimum","Maximum","50th Percentile","95th Percentile","50th Percentile","95th Percentile"]
["A. Emptying (drums)",{"$f":"INDEX('Scenario 1_Static'!$B$34:$D$40,MATCH(B$4,'Scenario 1_Static'!$A$34:$A$40, 0), MATCH($A5, 'Scenario 1_Static'!$B$31:$D$31,0))","v":1120.0771030592755},{"$f":"INDEX('Scenario 1_Static'!$B$34:$D$40,MATCH(C$4,'Scenario 1_Static'!$A$34:$A$40, 0), MATCH($A5, 'Scenario 1_Static'!$B$31:$D$31,0))","v":4242.7571224562635},{"$f":"INDEX('Scenario 1_Static'!$B$43:$D$49,MATCH(D$4,'Scenario 1_Static'!$A$43:$A$49, 0), MATCH($A5, 'Scenario 1_Static'!$B$31:$D$31,0))","v":276.76488296916915},{"$f":"INDEX('Scenario 1_Static'!$B$43:$D$49,MATCH(E$4,'Scenario 1_Static'!$A$43:$A$49, 0), MATCH($A5, 'Scenario 1_Static'!$B$31:$D$31,0))","v":1048.3619165644834},{"$f":"'Scenario 1_Static'!$G$15","v":26},{"$f":"'Scenario 1_Static'!$G$10","v":129},{"$f":"'Scenario 1_Static'!$G$25","v":0.11767861134737172},{"$f":"'Scenario 1_Static'!$G$20","v":0.42527047448703481},{"$f":"('Scenario 1_Static'!$B$23*24.45)/'Exposure Parameters'!$D$22","v":3.5209120216028555},{"$f":"('Scenario 1_Static'!$B$22*24.45)/'Exposure Parameters'!$D$22","v":12.886183268649702},{"$f":"('Scenario 1_Static'!$C$23*24.45)/'Exposure Parameters'!$D$22","v":1.173637340534285},{"$f":"('Scenario 1_Static'!$C$22*24.45)/'Exposure Parameters'!$D$22","v":4.2953944228832341}]
["B. Filling (small containers)",{"$f":"INDEX('Scenario 1_Static'!$B$34:$D$40,MATCH(B$4,'Scenario 1_Static'!$A$34:$A$40, 0), MATCH($A6, 'Scenario 1_Static'!$B$31:$D$31,0))","v":563.28562867341907},{"$f":"INDEX('Scenario 1_Static'!$B$34:$D$40,MATCH(C$4,'Scenario 1_Static'!$A$34:$A$40, 0), MATCH($A6, 'Scenario 1_Static'!$B$31:$D$31,0))","v":2237.0308152272846},{"$f":"INDEX('Scenario 1_Static'!$B$43:$D$49,MATCH(D$4,'Scenario 1_Static'!$A$43:$A$49, 0), MATCH($A6, 'Scenario 1_Static'!$B$31:$D$31,0))","v":139.18477636245674},{"$f":"INDEX('Scenario 1_Static'!$B$43:$D$49,MATCH(E$4,'Scenario 1_Static'!$A$43:$A$49, 0), MATCH($A6, 'Scenario 1_Static'!$B$31:$D$31,0))","v":552.75799325221942}]
["C. Container Cleaning (drums)",{"$f":"INDEX('Scenario 1_Static'!$B$34:$D$40,MATCH(B$4,'Scenario 1_Static'!$A$34:$A$40, 0), MATCH($A7, 'Scenario 1_Static'!$B$31:$D$31,0))","v":0.56723260275654963},{"$f":"INDEX('Scenario 1_Static'!$B$34:$D$40,MATCH(C$4,'Scenario 1_Static'!$A$34:$A$40, 0), MATCH($A7, 'Scenario 1_Static'!$B$31:$D$31,0))","v":6.624247097127272},{"$f":"INDEX('Scenario 1_Static'!$B$43:$D$49,MATCH(D$4,'Scenario 1_Static'!$A$43:$A$49, 0), MATCH($A7, 'Scenario 1_Static'!$B$31:$D$31,0))","v":0.14016005191912723},{"$f":"INDEX('Scenario 1_Static'!$B$43:$D$49,MATCH(E$4,'Scenario 1_Static'!$A$43:$A$49, 0), MATCH($A7, 'Scenario 1_Static'!$B$31:$D$31,0))","v":1.6368149724584313}]
[]
["Scenario 2: Activities A & C"]
["Exposure Point","Mass Concentration [mg/m^3]",null,"Volume Concentration [ppm]",null,"Exposure Days per Year",null,"Exposure Hours per Day",null,"8-hr TWA (ppm)",null,"24-hr TWA (ppm)"]
{"$rows_left_out":9}
{"sheet":"QC","index":3,"n_rows":35,"n_cols":12,"rows_kept":35,"cut":false,"hidden":true,"merged":[[11,0,11,11],[17,0,17,11],[12,6,12,8],[12,9,12,11],[12,1,12,3],[12,4,12,5],[30,0,30,11],[18,0,18,11],[19,1,19,3],[19,4,19,5],[19,6,19,8],[19,9,19,11],[22,0,23,11],[24,0,24,11],[25,1,25,3],[25,4,25,5],[25,6,25,8],[25,9,25,11],[31,0,31,11],[32,1,32,3],[32,4,32,5],[32,6,32,8],[32,9,32,11]]}
[]
[]
[]
[]
[]
[]
[]
[]
[]
[]
{"$rows_left_out":26}
{"sheet":"Exposure Point Summary","index":4,"n_rows":20,"n_cols":12,"rows_kept":20,"cut":false,"hidden":false,"merged":[[0,3,0,9],[0,10,0,11],[0,0,0,1],[2,4,2,5],[2,6,2,7],[2,8,2,9],[1,4,1,5],[1,6,1,7],[1,8,1,9]]}
["Parameter Definition",null,null,"Exposure Points (from ESD/GS)",null,null,null,null,null,null,"General Parameters"]
["Possible Parameters","Variable",null,"Exposure Point","A. Emptying (drums)",null,"B. Filling (small containers)",null,"C. Container Cleaning",null,"Number of Sites","Ns"]
["Saturation Factor Unloading","Fsaturation_unloading",null,"General Methodology","EPA/OPPT Mass Balance Inhalation Model",null,"EPA/OPPT Mass Balance Inhalation Model",null,"EPA/OPPT Mass Balance Inhalation Model",null,"Production Volume","PV"]
["1,1-DCA Molecular Weight","MW",null,"Input Parameters:","1,1-DCA Mass Fraction","F11DCA ","1,1-DCA Mass Fraction","F11DCA ","1,1-DCA Mass Fraction","F11DCA ","1,1-DCA Density","rho11DCA"]
["Import Container Volume","Vimport_cont",null,null,"Molar Volume","Vm","Molar Volume","Vm","Molar Volume","Vm","Hours exposed per day","ED"]
["Fill Rate of Drum","RATEfill_drum",null,null,"Molecular Weight","MW","Molecular Weight","MW","Molecular Weight","MW","Days exposed per year","EFyearly"]
["1,1-DCA Vapor Pressure","VP",null,null,"Unload Rate of Import Containers","Ratefill_drum","Loading Rate of fill Containers","Ratefill_smallcont","Hours exposed per day for Activity","hC","Working years","WY"]
["Gas Constant","R",null,null,"Hours exposed per day for Activity","hA","Vapor Pressure","VP","Vapor Pressure","VP","Lifetime years","LT"]
["Temperature","T",null,null,"Vapor Pressure","VP","Ventilation Rate","Q","Ventilation Rate","Q","Averaging time","AT"]
["Production Volume","PV",null,null,"Ventilation Rate","Q","Mixing Factor","k","Mixing Factor","k","Averaging time over lifetime","ATc"]
{"$rows_left_out":11}
{"sheet":"Exposure Parameters","index":5,"n_rows":39,"n_cols":16,"rows_kept":39,"cut":false,"hidden":false,"merged":[[3,9,4,9],[3,11,4,11],[3,12,4,12],[12,1,13,1],[12,2,13,2],[12,12,13,12],[3,1,4,1],[3,3,4,3],[3,2,4,2],[3,6,3,8],[3,4,3,5]]}
[]
[null,"Turn Monte Carlo On or Off","On"]
[]
[null,"Input Parameter","Symbol","Unit","Deterministic Values",null,"Uncertainty Analysis Distribution Parameters",null,null,"Distribution Type",null,"Selected Value (Deterministic or @Risk Formula)","Notes/Comments"]
[null,null,null,null,"Value","Basis","Lower Bound","Upper Bound","Mode",null,"@Risk Formulas",null,null,null,null,"On/Off Drop Down"]
[null,"Working Years","WY","years",36,"Typical",10.4,44,36,"Triangular",{"$f":"_xll.RiskTriang(G6,I6,H6,_xll.RiskStatic(E6))","v":{"$error":"#NAME?"}},{"$f":"IF($C$2=$P$6, K6, E6)","v":{"$error":"#NAME?"}},"Based on data from the U.S. Bureau of Labor Statistics (U.S. BLS) Current Population Survey (CPS) and the U.S. Census Bureau Survey of Income and Program Participation (SIPP).",null,null,"On"]
[null,"Ventilation Rate","Q","ft3/min",3000,"Typical",500,10000,3000,"Triangular",{"$f":"_xll.RiskTriang(G7,I7,H7,_xll.RiskStatic(E7))","v":{"$error":"#NAME?"}},{"$f":"IF($C$2=$P$6, K7, E7)","v":{"$error":"#NAME?"}},"From 1991 CEB Manual",null,null,"Off"]
[null,"Mixing Factor","k","dimensionless",0.5,"Typical",0.1,1,0.5,"Triangular",{"$f":"_xll.RiskTriang(G8,I8,H8,_xll.RiskStatic(E8))","v":{"$error":"#NAME?"}},{"$f":"IF($C$2=$P$6, K8, E8)","v":{"$error":"#NAME?"}},"From 1991 CEB Manual"]
[null,"Saturation Factor Unloading","Fsaturation_unloading","kg/kg",0.5,"Typical",0.5,1.45,0.5,"Triangular",{"$f":"_xll.RiskTriang(G9,I9,H9,_xll.RiskStatic(E9))","v":{"$error":"#NAME?"}},{"$error":"#NAME?"},"AP-42 provided values"]
[null,"Saturation Factor Loading","Fsaturation_loading","kg/kg",0.5,"Typical",0.5,1.45,0.5,"Triangular",{"$f":"_xll.RiskTriang(G10,I10,H10,_xll.RiskStatic(E10))","v":{"$error":"#NAME?"}},{"$error":"#NAME?"},"AP-42 provided values"]
{"$rows_left_out":30}
{"sheet":"Exposure Calcs","index":6,"n_rows":38,"n_cols":6,"rows_kept":38,"cut":false,"hidden":false,"merged":[[18,0,25,0],[26,0,31,0],[32,0,37,0]]}
[]
[null,"Calculation of Baseline Exposures"]
[]
[null,"Parameter Name","Symbol","Equation","Stochastic Value","Unit"]
[null,"Facility Production Rate","PVsite","PV/Ns",{"$f":"PV/Ns","v":11339.822735890993},"kg/site-year"]
[null,"Operating Days per site/Number of Import Containers/Days exposed per year","EFyearly","(PVsite/(rho11DCA*0.00378541 m3/gal*Vimport_cont)",{"$f":"_xll.RiskOutput(\"Exposure Days\")+IF(ROUNDUP((PV/Ns)/(rho_11DCA*m3_per_gal*V_importcont),0)>250, 250,ROUNDUP((PV/Ns)/(rho_11DCA*m3_per_gal*V_importcont),0))","v":{"$error":"#NAME?"}},"days/yr"]
[null,"Vapor generation rate for Activity A (Emptying Drums)","GA","[[Fsaturation_unloading*MW*(Vimport_cont*(3785.4 cm3/gal))*(RATEfill_drum/(3600 s/hr))*F11DCA*(VP)]/(R*T)]\n~Vapor generation calculated using AP-42 Loading Model~",{"$f":"((Fsat_unload*MW_11DCA*L_per_gal*V_importcont*Rate_filldrum*F_11DCA*VP_11DCA)/(s_per_hr*Temp*R_Ltorr_molK))","v":{"$error":"#NAME?"}},"g/s"]
[null,"Activity A volumetric concentration of chemical in air (Emptying drums)","CvA","Lesser of:\n(170,000*T*GA)/(MW*Q*k)\nOR\n(1,000,000*F11DCA*VP)/760",{"$f":"_xll.RiskOutput(\"Cv_A\")+IF((170000*Temp*G_A)/(MW_11DCA*Ventilation_rate*Mixing_factor)>((1000000*F_11DCA*VP_11DCA)/760),((1000000*F_11DCA*VP_11DCA)/760),(170000*Temp*G_A)/(MW_11DCA*Ventilation_rate*Mixing_factor))","v":{"$error":"#NAME?"}},"ppm"]
[null,"Activity A mass concentration of chemical in air (Emptying drums)","CmA","CvA*MW/Vm",{"$f":"_xll.RiskOutput(\"Cm_A\")+Cv_A*MW_11DCA/Vm_11DCA","v":{"$error":"#NAME?"}},"mg/m3"]
[null,"Hours exposed per day for activity A (Emptying Drums)","hA","[(Containers/year)/(EFyearly)]/Ratefill_drum",{"$f":"1/Rate_filldrum","v":0.05},"hr/day"]
{"$rows_left_out":29}
{"sheet":"Exposure Results","index":7,"n_rows":50,"n_cols":7,"rows_kept":50,"cut":false,"hidden":false,"merged":[[30,1,30,3],[4,0,4,1],[0,0,0,1],[8,1,8,3],[8,5,8,6],[9,5,9,6],[18,1,18,2],[18,5,18,6],[19,5,19,6]]}
["What-If Scenario"]
["Production Volume Assessed (kg/yr)",{"$f":"ROUND(PV,0)","v":22680}]
["Number of Sites",{"$f":"Ns","v":2}]
[]
["Monte Carlo Simulation Parameters"]
["Number of Iterations",100000]
["Sampling Method","Latin Hypercube"]
[]
[null,"Daily Concentrations",null,null,null,"Exposure Days per Year & Number of Import Containers"]
["Daily Concentrations (mg/m3)","Average Daily Concentration (ADC)","Lifetime Average Daily Concentration (LADC)","Subchronic Average Daily Concentration (ADCsubchronic)",null,"EFyearly (days/yr)"]
{"$rows_left_out":41}
{"sheet":"Exposure Results (2)","index":8,"n_rows":49,"n_cols":7,"rows_kept":49,"cut":false,"hidden":false,"merged":[[18,5,18,6],[29,1,29,2],[3,0,3,1],[7,1,7,3],[7,5,7,6],[8,5,8,6],[17,1,17,2],[17,5,17,6]]}
["Production Volume Assessed (kg/yr)",{"$f":"ROUND(PV,0)","v":22680}]
["Number of Sites",{"$f":"Ns","v":2}]
[]
["Monte Carlo Simulation Parameters"]
["Number of Iterations",100000]
["Sampling Method","Latin Hypercube"]
[]
[null,"Daily Concentrations",null,null,null,"Exposure Days per Year & Number of Import Containers"]
["Daily Concentrations (mg/m3)","Average Daily Concentration (ADC)","Lifetime Average Daily Concentration (LADC)","Subchronic Average Daily Concentration (ADCsubchronic)",null,"EFyearly (days/yr)"]
["Maximum",{"$f":"_xll.RiskMax(ADC_chronic_2)","v":{"$error":"#NAME?"}},{"$f":"_xll.RiskMax(LADC_2)","v":{"$error":"#NAME?"}},{"$f":"_xll.RiskMax(ADC_subchronic_2)","v":{"$error":"#NAME?"}},null,"Maximum",{"$f":"_xll.RiskMax(EF_yearly)","v":{"$error":"#NAME?"}}]
{"$rows_left_out":40}
{"sheet":"Exposure Results (3)","index":9,"n_rows":49,"n_cols":7,"rows_kept":49,"cut":false,"hidden":false,"merged":[[18,5,18,6],[3,0,3,1],[7,1,7,3],[7,5,7,6],[8,5,8,6],[17,1,17,2],[17,5,17,6]]}
["Production Volume Assessed (kg/yr)",{"$f":"ROUND(PV,0)","v":22680}]
["Number of Sites",{"$f":"Ns","v":2}]
[]
["Monte Carlo Simulation Parameters"]
["Number of Iterations",100000]
["Sampling Method","Latin Hypercube"]
[]
[null,"Daily Concentrations",null,null,null,"Exposure Days per Year & Number of Import Containers"]
["Daily Concentrations (mg/m3)","Average Daily Concentration (ADC)","Lifetime Average Daily Concentration (LADC)","Subchronic Average Daily Concentration (ADCsubchronic)",null,"EFyearly (days/yr)"]
["Maximum",{"$f":"_xll.RiskMax(ADC_chronic_3)","v":{"$error":"#NAME?"}},{"$f":"_xll.RiskMax(LADC_3)","v":{"$error":"#NAME?"}},{"$f":"_xll.RiskMax(ADC_subchronic_3)","v":{"$error":"#NAME?"}},null,"Maximum",{"$f":"_xll.RiskMax(EF_yearly)","v":{"$error":"#NAME?"}}]
{"$rows_left_out":40}
{"sheet":"Scenario 1_Static","index":10,"n_rows":49,"n_cols":7,"rows_kept":49,"cut":false,"hidden":false,"merged":[[18,5,18,6],[29,1,29,3],[3,0,3,1],[7,1,7,3],[7,5,7,6],[8,5,8,6],[17,1,17,2],[17,5,17,6]]}
["Production Volume Assessed (kg/yr)",22680]
["Number of Sites",2]
[]
["Monte Carlo Simulation Parameters"]
["Number of Iterations",100000]
["Sampling Method","Latin Hypercube"]
[]
[null,"Daily Concentrations",null,null,null,"Exposure Days per Year & Number of Import Containers"]
["Daily Concentrations (mg/m3)","Average Daily Concentration (ADC)","Lifetime Average Daily Concentration (LADC)","Subchronic Average Daily Concentration (ADCsubchronic)",null,"EFyearly (days/yr)"]
["Maximum",13.368035899662315,6.1642448048508012,297.68134216177532,null,"Maximum",129]
{"$rows_left_out":40}
{"sheet":"Scenario 2_Static","index":11,"n_rows":49,"n_cols":7,"rows_kept":49,"cut":false,"hidden":false,"merged":[[18,5,18,6],[29,1,29,2],[3,0,3,1],[7,1,7,3],[7,5,7,6],[8,5,8,6],[17,1,17,2],[17,5,17,6]]}
["Production Volume Assessed (kg/yr)",22680]
["Number of Sites",2]
[]
["Monte Carlo Simulation Parameters"]
["Number of Iterations",100000]
["Sampling Method","Latin Hypercube"]
[]
[null,"Daily Concentrations",null,null,null,"Exposure Days per Year & Number of Import Containers"]
["Daily Concentrations (mg/m3)","Average Daily Concentration (ADC)","Lifetime Average Daily Concentration (LADC)","Subchronic Average Daily Concentration (ADCsubchronic)",null,"EFyearly (days/yr)"]
["Maximum",7.7226817854928802,3.4475315986505231,165.38106280266419,null,"Maximum",129]
{"$rows_left_out":40}
{"sheet":"Scenario 3_Static","index":12,"n_rows":49,"n_cols":7,"rows_kept":49,"cut":false,"hidden":false,"merged":[[18,5,18,6],[3,0,3,1],[7,1,7,3],[7,5,7,6],[8,5,8,6],[17,1,17,2],[17,5,17,6]]}
["Production Volume Assessed (kg/yr)",22680]
["Number of Sites",2]
[]
["Monte Carlo Simulation Parameters"]
["Number of Iterations",100000]
["Sampling Method","Latin Hypercube"]
[]
[null,"Daily Concentrations",null,null,null,"Exposure Days per Year & Number of Import Containers"]
["Daily Concentrations (mg/m3)","Average Daily Concentration (ADC)","Lifetime Average Daily Concentration (LADC)","Subchronic Average Daily Concentration (ADCsubchronic)",null,"EFyearly (days/yr)"]
["Maximum",8.7275445684695558,3.3215837242665875,162.98182066235006,null,"Maximum",129]
{"$rows_left_out":39}