{"text_format":"1","workbook":"xlsx","n_sheets":9,"sheets":["Cover Page ","ReadMe","Exposure Summary","Exposure Point Summary","Exposure Parameters","Exposure Calcs","Exposure Results","Scenario 1_Static","Scenario 2_Static"],"not_rendered":{"charts":0,"images":1,"macros":1,"external_links":0,"defined_names":355,"comments":0,"pivot_tables":0},"unopened":[],"bounds":{"document_bytes":16777216,"sheet_cells":100000,"rows_first":2000,"rows_last":500,"rows_between":2000,"halvings":0,"cell_chars":16384,"cell_head_chars":4096},"cells_cut":0,"cells_raw":0,"read":"whole","date_system":"1900"}

{"sheet":"Cover Page ","index":0,"n_rows":3,"n_cols":1,"rows_kept":3,"cut":false,"hidden":false,"merged":[]}
["Repackaging Exposure Model for 1,2-Dichloroethane"]
[]
["CASRN 107-06-2"]

{"sheet":"ReadMe","index":1,"n_rows":21,"n_cols":3,"rows_kept":21,"cut":false,"hidden":false,"merged":[[16,1,16,2],[20,1,20,2],[19,1,19,2],[3,1,3,2],[18,1,18,2],[17,1,17,2],[15,1,15,2]]}
[]
[null,"Instructions for Using this Spreadsheet"]
[]
[null,"Table of Contents"]
[null,"Worksheet","Description"]
[null,"ReadMe (this worksheet)","Provides instructions to the user on the use of this spreadsheet"]
[null,"Exposure Summary","Provides the exposure results for the baseline scenario from the Monte Carlo simulation. The user must not alter this worksheet."]
[null,"Exposure Point Summary","Summarizes the Exposure Points and associated parameters used to calculate the amount of annual exposure from each Exposure Point"]
[null,"Exposure Parameters","A list of parameters for the exposure calculations. Allows an advanced user to select between performing a deterministic or Monte Carlo simulation. Monte Carlo formulas on this worksheet are based on the Monte Carlo simulator @Risk. Certain cells will appear with the \"#NAME?\" error indicator if a user does not have the program @Risk. The user must not alter parameters in this worksheet. Turn Monte Carlo \"Off\" using the toggle at the top of the sheet to view deterministic calculations (@Risk not needed for this)."]
[null,"Exposure Calcs","Performs the exposure calculations. This worksheet contains @Risk formulas to capture results during a Monte Carlo simulation iteration. Certain cells will appear with the \"#NAME?\" error indicator if a user does not have the program @Risk. The user must not alter this worksheet."]
[null,"Exposure Results","Provides exposure results from running the simulation with the specified parameters for the given scenario. Cells will appear with the \"#NAME?\" error indicator if a user does not have the program @Risk. The user must not alter this worksheet."]
[null,"Scenario 1_Static","Scenario 1: Fixed number of sites, PV=2,500 lbs\n\nProvides static exposure results from running the simulation with the specified parameters for the given scenario. @Risk not needed to view."]
[null,"Scenario 2_Static","Scenario 2: Fixed number of sites, PV=25,000 lbs\n\nProvides static exposure results from running the simulation with the specified parameters for the given scenario. @Risk not needed to view."]
[]
[]
{"$rows_left_out":7}
{"sheet":"Exposure Summary","index":2,"n_rows":14,"n_cols":13,"rows_kept":14,"cut":false,"hidden":false,"merged":[[11,9,13,9],[11,10,13,10],[11,11,13,11],[11,12,13,12],[11,7,13,7],[11,8,13,8],[11,5,13,5],[11,6,13,6],[9,9,9,10],[9,11,9,12],[2,7,2,8],[4,5,6,5],[4,6,6,6],[4,7,6,7],[4,8,6,8],[9,7,9,8],[2,9,2,10],[2,11,2,12],[4,9,6,9],[4,10,6,10],[4,11,6,11],[4,12,6,12],[2,0,3,0],[2,1,2,2],[2,3,2,4],[2,5,2,6],[9,0,10,0],[9,1,9,2],[9,3,9,4],[9,5,9,6]]}
["Exposure Summary - 50th and 95th Percentile estimates"]
["Scenario 1: PV = 1134 kg/yr"]
["Exposure Point","Mass Concentration [mg/m^3]",null,"Volume Concentration [ppm]",null,"Exposure Days per Year",null,"Exposure Hours per Day",null,"8-hr TWA",null,"24-hr TWA"]
[null,"50th Percentile","95th Percentile","50th Percentile","95th Percentile","Minimum","Maximum","Minimum","Maximum","50th Percentile","95th Percentile","50th Percentile","95th Percentile"]
["A. Emptying (drums)",{"$f":"INDEX('Scenario 1_Static'!$B$35:$D$41,MATCH(B$4,'Scenario 1_Static'!$A$35:$A$41, 0), MATCH($A5, 'Scenario 1_Static'!$B$32:$D$32,0))","v":388.53397341983191},{"$f":"INDEX('Scenario 1_Static'!$B$35:$D$41,MATCH(C$4,'Scenario 1_Static'!$A$35:$A$41, 0), MATCH($A5, 'Scenario 1_Static'!$B$32:$D$32,0))","v":1477.7986558704135},{"$f":"INDEX('Scenario 1_Static'!$B$44:$D$50,MATCH(D$4,'Scenario 1_Static'!$A$44:$A$50, 0), MATCH($A5, 'Scenario 1_Static'!$B$32:$D$32,0))","v":95.99490349752314},{"$f":"INDEX('Scenario 1_Static'!$B$44:$D$50,MATCH(E$4,'Scenario 1_Static'!$A$44:$A$50, 0), MATCH($A5, 'Scenario 1_Static'!$B$32:$D$32,0))","v":365.11900905448277},{"$f":"'Scenario 1_Static'!G16","v":3},{"$f":"'Scenario 1_Static'!G11","v":12},{"$f":"'Scenario 1_Static'!G26","v":0.11863726875640966},{"$f":"'Scenario 1_Static'!G21","v":0.42601324710577132},{"$f":"'Scenario 1_Static'!B24","v":4.9460442256858812},{"$f":"'Scenario 1_Static'!B23","v":18.184339869572472},{"$f":"'Scenario 1_Static'!C24","v":1.6486814085619603},{"$f":"'Scenario 1_Static'!C23","v":6.0614466231908244}]
["B. Filling (small containers)",{"$f":"INDEX('Scenario 1_Static'!$B$35:$D$41,MATCH(B$4,'Scenario 1_Static'!$A$35:$A$41, 0), MATCH($A6, 'Scenario 1_Static'!$B$32:$D$32,0))","v":196.10575136690841},{"$f":"INDEX('Scenario 1_Static'!$B$35:$D$41,MATCH(C$4,'Scenario 1_Static'!$A$35:$A$41, 0), MATCH($A6, 'Scenario 1_Static'!$B$32:$D$32,0))","v":775.90023612005643},{"$f":"INDEX('Scenario 1_Static'!$B$44:$D$50,MATCH(D$4,'Scenario 1_Static'!$A$44:$A$50, 0), MATCH($A6, 'Scenario 1_Static'!$B$32:$D$32,0))","v":48.451754455546791},{"$f":"INDEX('Scenario 1_Static'!$B$44:$D$50,MATCH(E$4,'Scenario 1_Static'!$A$44:$A$50, 0), MATCH($A6, 'Scenario 1_Static'!$B$32:$D$32,0))","v":191.70130126450465}]
["C. Container Cleaning (drums)",{"$f":"INDEX('Scenario 1_Static'!$B$35:$D$41,MATCH(B$4,'Scenario 1_Static'!$A$35:$A$41, 0), MATCH($A7, 'Scenario 1_Static'!$B$32:$D$32,0))","v":0.19763522224936661},{"$f":"INDEX('Scenario 1_Static'!$B$35:$D$41,MATCH(C$4,'Scenario 1_Static'!$A$35:$A$41, 0), MATCH($A7, 'Scenario 1_Static'!$B$32:$D$32,0))","v":2.2996551880882747},{"$f":"INDEX('Scenario 1_Static'!$B$44:$D$50,MATCH(D$4,'Scenario 1_Static'!$A$44:$A$50, 0), MATCH($A7, 'Scenario 1_Static'!$B$32:$D$32,0))","v":4.8829640096978717E-2},{"$f":"INDEX('Scenario 1_Static'!$B$44:$D$50,MATCH(E$4,'Scenario 1_Static'!$A$44:$A$50, 0), MATCH($A7, 'Scenario 1_Static'!$B$32:$D$32,0))","v":0.56817471047653922}]
["Exposure Summary - 50th and 95th Percentile estimates"]
["Scenario 1: PV = 11340 kg/yr"]
["Exposure Point","Mass Concentration [mg/m^3]",null,"Volume Concentration [ppm]",null,"Exposure Days per Year",null,"Exposure Hours per Day",null,"8-hr TWA",null,"24-hr TWA"]
[null,"50th Percentile","95th Percentile","50th Percentile","95th Percentile","Minimum","Maximum","Minimum","Maximum","50th Percentile","95th Percentile","50th Percentile","95th Percentile"]
["A. Emptying (drums)",{"$f":"INDEX('Scenario 2_Static'!$B$35:$D$41,MATCH(B$4,'Scenario 2_Static'!$A$35:$A$41, 0), MATCH($A12, 'Scenario 2_Static'!$B$32:$D$32,0))","v":388.7247781184015},{"$f":"INDEX('Scenario 2_Static'!$B$35:$D$41,MATCH(C$4,'Scenario 2_Static'!$A$35:$A$41, 0), MATCH($A12, 'Scenario 2_Static'!$B$32:$D$32,0))","v":1498.8133915769981},{"$f":"INDEX('Scenario 2_Static'!$B$44:$D$50,MATCH(D$4,'Scenario 2_Static'!$A$44:$A$50, 0), MATCH($A12, 'Scenario 2_Static'!$B$32:$D$32,0))","v":96.042045523392446},{"$f":"INDEX('Scenario 2_Static'!$B$44:$D$50,MATCH(E$4,'Scenario 2_Static'!$A$44:$A$50, 0), MATCH($A12, 'Scenario 2_Static'!$B$32:$D$32,0))","v":370.31110978231209},{"$f":"'Scenario 2_Static'!J16","v":24},{"$f":"'Scenario 2_Static'!J11","v":119},{"$f":"'Scenario 2_Static'!J26","v":0.11889595337904234},{"$f":"'Scenario 2_Static'!J21","v":0.42755723829382902},{"$f":"'Scenario 2_Static'!B24","v":4.9322411096655028},{"$f":"'Scenario 2_Static'!B23","v":18.336349296163085},{"$f":"'Scenario 2_Static'!C24","v":1.6440803698885009},{"$f":"'Scenario 2_Static'!C23","v":6.1121164320543615}]
["B. Filling (small containers)",{"$f":"INDEX('Scenario 2_Static'!$B$35:$D$41,MATCH(B$4,'Scenario 2_Static'!$A$35:$A$41, 0), MATCH($A13, 'Scenario 2_Static'!$B$32:$D$32,0))","v":195.5213622368185},{"$f":"INDEX('Scenario 2_Static'!$B$35:$D$41,MATCH(C$4,'Scenario 2_Static'!$A$35:$A$41, 0), MATCH($A13, 'Scenario 2_Static'!$B$32:$D$32,0))","v":776.57094145876374},{"$f":"INDEX('Scenario 2_Static'!$B$44:$D$50,MATCH(D$4,'Scenario 2_Static'!$A$44:$A$50, 0), MATCH($A13, 'Scenario 2_Static'!$B$32:$D$32,0))","v":48.307369711905949},{"$f":"INDEX('Scenario 2_Static'!$B$44:$D$50,MATCH(E$4,'Scenario 2_Static'!$A$44:$A$50, 0), MATCH($A13, 'Scenario 2_Static'!$B$32:$D$32,0))","v":191.8670121126392}]
["C. Container Cleaning (drums)",{"$f":"INDEX('Scenario 2_Static'!$B$35:$D$41,MATCH(B$4,'Scenario 2_Static'!$A$35:$A$41, 0), MATCH($A14, 'Scenario 2_Static'!$B$32:$D$32,0))","v":0.19746790309212692},{"$f":"INDEX('Scenario 2_Static'!$B$35:$D$41,MATCH(C$4,'Scenario 2_Static'!$A$35:$A$41, 0), MATCH($A14, 'Scenario 2_Static'!$B$32:$D$32,0))","v":2.313133679952859},{"$f":"INDEX('Scenario 2_Static'!$B$44:$D$50,MATCH(D$4,'Scenario 2_Static'!$A$44:$A$50, 0), MATCH($A14, 'Scenario 2_Static'!$B$32:$D$32,0))","v":4.8788300632604115E-2},{"$f":"INDEX('Scenario 2_Static'!$B$44:$D$50,MATCH(E$4,'Scenario 2_Static'!$A$44:$A$50, 0), MATCH($A14, 'Scenario 2_Static'!$B$32:$D$32,0))","v":0.57150483503281535}]

{"sheet":"Exposure Point Summary","index":3,"n_rows":20,"n_cols":12,"rows_kept":20,"cut":false,"hidden":false,"merged":[[0,3,0,9],[0,10,0,11],[0,0,0,1],[2,4,2,5],[2,6,2,7],[2,8,2,9],[1,4,1,5],[1,6,1,7],[1,8,1,9]]}
["Parameter Definition",null,null,"Exposure Points (from ESD/GS)",null,null,null,null,null,null,"General Parameters"]
["Possible Parameters","Variable",null,"Exposure Point","A. Emptying (drums)",null,"B. Filling (small containers)",null,"C. Container Cleaning",null,"Number of Sites","Ns"]
["Saturation Factor Unloading","Fsaturation_unloading",null,"General Methodology","EPA/OPPT Mass Balance Inhalation Model",null,"EPA/OPPT Mass Balance Inhalation Model",null,"EPA/OPPT Mass Balance Inhalation Model",null,"Production Volume","PV"]
["1,2-DCA Molecular Weight","MW",null,"Input Parameters:","1,2-DCA Mass Fraction","F12DCA ","1,2-DCA Mass Fraction","F12DCA ","1,2-DCA Mass Fraction","F12DCA ","1,2-DCA Density","rho12DCA"]
["Import Container Volume","Vimport_cont",null,null,"Molar Volume","Vm","Molar Volume","Vm","Molar Volume","Vm","Hours exposed per day","ED"]
["Fill Rate of Drum","RATEfill_drum",null,null,"Molecular Weight","MW","Molecular Weight","MW","Molecular Weight","MW","Days exposed per year","EFyearly"]
["1,2-DCA Vapor Pressure","VP",null,null,"Unload Rate of Import Containers","Ratefill_drum","Loading Rate of fill Containers","Ratefill_smallcont","Hours exposed per day for Activity","hC","Working years","WY"]
["Gas Constant","R",null,null,"Hours exposed per day for Activity","hA","Vapor Pressure","VP","Vapor Pressure","VP","Lifetime years","LT"]
["Temperature","T",null,null,"Vapor Pressure","VP","Ventilation Rate","Q","Ventilation Rate","Q","Averaging time","AT"]
["Production Volume","PV",null,null,"Ventilation Rate","Q","Mixing Factor","k","Mixing Factor","k","Averaging time over lifetime","ATc"]
["1,2-DCA Density","r",null,null,"Mixing Factor","k","Vapor Pressure Correction Factor","X","Vapor Pressure Correction Factor","X","8-hour Time-weighted average","TWA8hr"]
["Saturation Factor Loading","Fsaturation_loading",null,null,"Vapor Pressure Correction Factor","X","Temperature","T","Temperature","T","24-hour Time-weighted Average","TWA24hr"]
["Small Container Volume","Vfill_cont",null,null,"Temperature","T","Saturation Factor Loading","Fsaturation_Loading","Gas Constant","R","Average Daily Concentration","ADC"]
["Fill Rate of Small Container","RATEfill_smallcont",null,null,"Saturation Factor Unloading","Fsaturation_unloading","Filling Container Volume","Vfillcont","Air speed","Rateair_speed","Lifetime Average Daily Concentration","LADC"]
["1,2-DCA Mass Fraction/VP Correction Factor","F12DCA",null,null,"Import Container Volume","Vimportcont","Gas Constant","R","Diameter of Opening for Container Cleaning","Dopening_cont-cleaning","Subchronic Days exposed per year","EFsubchronic"]
{"$rows_left_out":6}
{"sheet":"Exposure Parameters","index":4,"n_rows":39,"n_cols":16,"rows_kept":39,"cut":false,"hidden":false,"merged":[[3,9,4,9],[3,11,4,11],[3,12,4,12],[12,1,13,1],[12,2,13,2],[12,12,13,12],[3,1,4,1],[3,3,4,3],[3,2,4,2],[3,6,3,8],[3,4,3,5]]}
[]
[null,"Turn Monte Carlo On or Off","On"]
[]
[null,"Input Parameter","Symbol","Unit","Deterministic Values",null,"Uncertainty Analysis Distribution Parameters",null,null,"Distribution Type",null,"Selected Value (Deterministic or @Risk Formula)","Notes/Comments"]
[null,null,null,null,"Value","Basis","Lower Bound","Upper Bound","Mode",null,"@Risk Formulas",null,null,null,null,"On/Off Drop Down"]
[null,"Working Years","WY","years",36,"Typical",10.4,44,36,"Triangular",{"$f":"_xll.RiskTriang(G6,I6,H6,_xll.RiskStatic(E6))","v":{"$error":"#NAME?"}},{"$f":"IF($C$2=$P$6, K6, E6)","v":{"$error":"#NAME?"}},"Based on data from the U.S. Bureau of Labor Statistics (U.S. BLS) Current Population Survey (CPS) and the U.S. Census Bureau Survey of Income and Program Participation (SIPP).",null,null,"On"]
[null,"Ventilation Rate","Q","ft3/min",3000,"Typical",500,10000,3000,"Triangular",{"$f":"_xll.RiskTriang(G7,I7,H7,_xll.RiskStatic(E7))","v":{"$error":"#NAME?"}},{"$f":"IF($C$2=$P$6, K7, E7)","v":{"$error":"#NAME?"}},"From 1991 CEB Manual",null,null,"Off"]
[null,"Mixing Factor","k","dimensionless",0.5,"Typical",0.1,1,0.5,"Triangular",{"$f":"_xll.RiskTriang(G8,I8,H8,_xll.RiskStatic(E8))","v":{"$error":"#NAME?"}},{"$f":"IF($C$2=$P$6, K8, E8)","v":{"$error":"#NAME?"}},"From 1991 CEB Manual"]
[null,"Saturation Factor Unloading","Fsaturation_unloading","kg/kg",0.5,"Typical",0.5,1.45,0.5,"Triangular",{"$f":"_xll.RiskTriang(G9,I9,H9,_xll.RiskStatic(E9))","v":{"$error":"#NAME?"}},{"$error":"#NAME?"},"AP-42 provided values"]
[null,"Saturation Factor Loading","Fsaturation_loading","kg/kg",0.5,"Typical",0.5,1.45,0.5,"Triangular",{"$f":"_xll.RiskTriang(G10,I10,H10,_xll.RiskStatic(E10))","v":{"$error":"#NAME?"}},{"$error":"#NAME?"},"AP-42 provided values"]
[null,"Import Container Volume","Vimport_cont","gal/container",55,"Typical",20,100,55,"Triangular",{"$f":"_xll.RiskTriang(G11,I11,H11,_xll.RiskStatic(E11))","v":{"$error":"#NAME?"}},{"$error":"#NAME?"},"Standard EPA values for Vapor Generation Rate/Volatile Air Release Models given as 20 to <100 gallons for drum volume, with 55 gallons as default value. Typically use drums for given throughput as suggested in ESD on Transport and Storage (HERO ID 6393282)."]
[null,"Small Container Volume","Vfill_cont","gal/container",5,"Typical",5,20,5,"Triangular",{"$f":"_xll.RiskTriang(G12,I12,H12,_xll.RiskStatic(E12))","v":{"$error":"#NAME?"}},{"$error":"#NAME?"},"Standard EPA values for Vapor Generation Rate/Volatile Air Release Models given as 5 to <20 gallons for small container volume, with 5 gallons as default value. "]
[null,"Air Speed","RATEair_speed","cm/s",10,"50th percentile",1.3,202.2,"—","Lognormal",{"$f":"_xll.RiskLognorm(22.414,19.958,_xll.RiskTruncate(G13,H13),_xll.RiskName(B13),_xll.RiskStatic(E13))","v":{"$error":"#NAME?"}},{"$f":"IF($C$2=$P$6, K13, E13)","v":{"$error":"#NAME?"}},"Distribution using EPA's air speed model for industrial uses; converted to ft/min for model use. For industrial facilities, it’s a lognormal distribution with mean of 22.414 cm/s, standard deviation of 19.958 cm/s, max truncated at 202.2 cm/s."]
[null,null,null,"ft/min",{"$f":"E13*ft_per_cm*60","v":19.684799999999999},"50th percentile",{"$f":"G13*ft_per_cm*60","v":2.559024},{"$f":"H13*ft_per_cm*60","v":398.02665599999995},"—","Lognormal",{"$f":"(K13*ft_per_cm*60)","v":{"$error":"#NAME?"}},{"$f":"IF($C$2=$P$6, K14, E14)","v":{"$error":"#NAME?"}}]
[]
{"$rows_left_out":25}
{"sheet":"Exposure Calcs","index":5,"n_rows":26,"n_cols":6,"rows_kept":26,"cut":false,"hidden":false,"merged":[]}
[]
[null,"Calculation of Baseline Exposures"]
[]
[null,"Parameter Name","Symbol","Equation","Stochastic Value","Unit"]
[null,"Facility Production Rate","PVsite","PV/Ns",{"$f":"PV/Ns","v":1133.9822735890993},"kg/site-year"]
[null,"Operating Days per site/Number of Import Containers/Days exposed per year","EFyearly","(PVsite/(rho12DCA*0.00378541 m3/gal*Vimport_cont)",{"$f":"_xll.RiskOutput(\"Exposure Days\")+IF(ROUNDUP((PV/Ns)/(rho_12DCA*m3_per_gal*V_importcont),0)>250, 250,ROUNDUP((PV/Ns)/(rho_12DCA*m3_per_gal*V_importcont),0))","v":{"$error":"#NAME?"}},"days/yr"]
[null,"Vapor generation rate for Activity A (Emptying Drums)","GA","[[Fsaturation_unloading*MW*(Vimport_cont*(3785.4 cm3/gal))*(RATEfill_drum/(3600 s/hr))*F12DCA*(VP)]/(R*T)]\n~Vapor generation calculated using AP-42 Loading Model~",{"$f":"((Fsat_unload*MW_12DCA*L_per_gal*V_importcont*Rate_filldrum*F_12DCA*VP_12DCA)/(s_per_hr*Temp*R_Ltorr_molK))","v":{"$error":"#NAME?"}},"g/s"]
[null,"Activity A volumetric concentration of chemical in air (Emptying drums)","CvA","Lesser of:\n(170,000*T*GA)/(MW*Q*k)\nOR\n(1,000,000*F12DCA*VP)/760",{"$f":"_xll.RiskOutput(\"Cv_A\")+IF((170000*Temp*G_A)/(MW_12DCA*Ventilation_rate*Mixing_factor)>((1000000*F_12DCA*VP_12DCA)/760),((1000000*F_12DCA*VP_12DCA)/760),(170000*Temp*G_A)/(MW_12DCA*Ventilation_rate*Mixing_factor))","v":{"$error":"#NAME?"}},"ppm"]
[null,"Activity A mass concentration of chemical in air (Emptying drums)","CmA","CvA*MW/Vm",{"$f":"_xll.RiskOutput(\"Cm_A\")+Cv_A*MW_12DCA/Vm_12DCA","v":{"$error":"#NAME?"}},"mg/m3"]
[null,"Hours exposed per day for activity A (Emptying Drums)","hA","[(Containers/year)/(EFyearly)]/Ratefill_drum",{"$f":"1/Rate_filldrum","v":0.05},"hr/day"]
[null,"Vapor generation rate for Activity B (Filling Small Containers)","GB","[[Fsaturation_loading*MW*(Vsmallcont*(3785.4 cm3/gal))*(RATEfill_smallcont/(3600 s/hr))*F12DCA*(VP)]/(R*T)]\n~Vapor generation calculated using AP-42 Loading Model~",{"$f":"((Fsat_load*MW_12DCA*L_per_gal*V_smallcont*Rate_fillsmallcont*F_12DCA*VP_12DCA)/(s_per_hr*Temp*R_Ltorr_molK))","v":{"$error":"#NAME?"}},"g/s"]
[null,"Activity B volumetric concentration of chemical in air (Filling small containers)","CvB","Lesser of:\n(170,000*T*GB)/(MW*Q*k)\nOR\n(1,000,000*F12DCA*VP)/760",{"$f":"_xll.RiskOutput(\"Cv_B\")+IF((170000*Temp*G_B)/(MW_12DCA*Ventilation_rate*Mixing_factor)>((1000000*F_12DCA*VP_12DCA)/760),((1000000*F_12DCA*VP_12DCA)/760),(170000*Temp*G_B)/(MW_12DCA*Ventilation_rate*Mixing_factor))","v":{"$error":"#NAME?"}},"ppm"]
[null,"Activity B mass concentration of chemical in air (Filling small containers)","CmB","CvB*MW/Vm",{"$f":"_xll.RiskOutput(\"Cm_B\")+Cv_B*MW_12DCA/Vm_12DCA","v":{"$error":"#NAME?"}},"mg/m3"]
[null,"Hours exposed per day for activity B (Filling small containers)","hB","V_importcont/V_smallcont/Rate_fillsmallcont",{"$f":"V_importcont/V_smallcont/Rate_fillsmallcont","v":{"$error":"#NAME?"}},"hours"]
[null,"Vapor generation rate for Activity C (Container Cleaning)","GC","~Vapor generation rate calculated using Penetration Model or Mass Transfer Coefficient Model as outlined below~\nPenetration Model (if air speed <= 100 ft/min):\nGC=[[(8.24E-8*(MW^0.835)*F12DCA*VP*((1/29+1/MW)^0.25)*(RATEair_speed^0.5)*(0.25*pi*Dopening_cont-cleaning^2)]/(T^0.05*Dopening_cont-cleaning^0.5*P^0.5)]\n\nMass Transfer Coefficient Model (if air speed >100 ft/min):\nGC=[[(1.93E-7*(MW^0.78)*F12DCA*VP*((1/29+1/MW)^0.33)*(RATEair_speed^0.78)*(0.25*pi*Dopening_cont-cleaning^2)]/(T^0.4*Dopening_cont-cleaning^0.11*(T^0.5-5.87)^(2/3)]",{"$f":"IF(Air_speed>100,(0.000000193*POWER(MW_12DCA,0.78)*F_12DCA*VP_12DCA*POWER((1/29)+(1/MW_12DCA),0.33)*POWER(Air_speed,0.78)*(PI()*POWER(D_contcleaning,2)/4))/(POWER(Temp,0.4)*POWER(D_contcleaning,0.11)*POWER(POWER(Temp,0.5)-5.87,2/3)),(0.0000000824*POWER(MW_12DCA,0.835)*F_12DCA*VP_12DCA*POWER((1/29)+(1/MW_12DCA),0.25)*POWER(Air_speed,0.5)*(PI()*POWER(D_contcleaning,2)/4))/(POWER(Temp,0.05)*POWER(D_contcleaning,0.5)*POWER(Pressure_Torr,0.5)))","v":{"$error":"#NAME?"}},"g/s"]
{"$rows_left_out":12}
{"sheet":"Exposure Results","index":6,"n_rows":50,"n_cols":7,"rows_kept":50,"cut":false,"hidden":false,"merged":[[30,1,30,3],[4,0,4,1],[0,0,0,1],[8,1,8,3],[8,5,8,6],[9,5,9,6],[18,1,18,2],[18,5,18,6],[19,5,19,6]]}
["What-If Scenario"]
["Production Volume Assessed (kg/yr)",{"$f":"ROUND(PV,0)","v":1134}]
["Number of Sites",{"$f":"Ns","v":1}]
[]
["Monte Carlo Simulation Parameters"]
["Number of Iterations",100000]
["Sampling Method","Latin Hypercube"]
[]
[null,"Daily Concentrations",null,null,null,"Exposure Days per Year & Number of Import Containers"]
["Daily Concentrations (mg/m3)","Average Daily Concentration (ADC)","Lifetime Average Daily Concentration (LADC)","Subchronic Average Daily Concentration (ADCsubchronic)",null,"EFyearly (days/yr)"]
["Maximum",{"$f":"_xll.RiskMax(ADC_chronic)","v":{"$error":"#NAME?"}},{"$f":"_xll.RiskMax(LADC)","v":{"$error":"#NAME?"}},{"$f":"_xll.RiskMax(ADC_subchronic)","v":{"$error":"#NAME?"}},null,"Maximum",{"$f":"_xll.RiskMax(EF_yearly)","v":{"$error":"#NAME?"}}]
["99th Percentile",{"$f":"_xll.RiskPercentile(ADC_chronic,0.99)","v":{"$error":"#NAME?"}},{"$f":"_xll.RiskPercentile(LADC,0.99)","v":{"$error":"#NAME?"}},{"$f":"_xll.RiskPercentile(ADC_subchronic,0.99)","v":{"$error":"#NAME?"}},null,"99th Percentile",{"$f":"_xll.RiskPercentile(EF_yearly,0.99)","v":{"$error":"#NAME?"}}]
["95th Percentile",{"$f":"_xll.RiskPercentile(ADC_chronic,0.95)","v":{"$error":"#NAME?"}},{"$f":"_xll.RiskPercentile(LADC,0.95)","v":{"$error":"#NAME?"}},{"$f":"_xll.RiskPercentile(ADC_subchronic,0.95)","v":{"$error":"#NAME?"}},null,"95th Percentile",{"$f":"_xll.RiskPercentile(EF_yearly,0.95)","v":{"$error":"#NAME?"}}]
["50th Percentile",{"$f":"_xll.RiskPercentile(ADC_chronic,0.5)","v":{"$error":"#NAME?"}},{"$f":"_xll.RiskPercentile(LADC,0.5)","v":{"$error":"#NAME?"}},{"$f":"_xll.RiskPercentile(ADC_subchronic,0.5)","v":{"$error":"#NAME?"}},null,"50th Percentile",{"$f":"_xll.RiskPercentile(EF_yearly,0.5)","v":{"$error":"#NAME?"}}]
["5th Percentile",{"$f":"_xll.RiskPercentile(ADC_chronic,0.05)","v":{"$error":"#NAME?"}},{"$f":"_xll.RiskPercentile(LADC,0.05)","v":{"$error":"#NAME?"}},{"$f":"_xll.RiskPercentile(ADC_subchronic,0.05)","v":{"$error":"#NAME?"}},null,"5th Percentile",{"$f":"_xll.RiskPercentile(EF_yearly,0.05)","v":{"$error":"#NAME?"}}]
{"$rows_left_out":36}
{"sheet":"Scenario 1_Static","index":7,"n_rows":50,"n_cols":7,"rows_kept":50,"cut":false,"hidden":false,"merged":[[19,5,19,6],[30,1,30,3],[0,0,0,1],[4,0,4,1],[8,1,8,3],[8,5,8,6],[9,5,9,6],[18,1,18,2],[18,5,18,6]]}
["What-If Scenario"]
["Production Volume Assessed (kg/yr)",1134]
["Number of Sites",1]
[]
["Monte Carlo Simulation Parameters"]
["Number of Iterations",100000]
["Sampling Method","Latin Hypercube"]
[]
[null,"Daily Concentrations",null,null,null,"Exposure Days per Year & Number of Import Containers"]
["Daily Concentrations (mg/m3)","Average Daily Concentration (ADC)","Lifetime Average Daily Concentration (LADC)","Subchronic Average Daily Concentration (ADCsubchronic)",null,"EFyearly (days/yr)"]
["Maximum",0.67117160721298996,0.30638954828129961,24.497763663274135,null,"Maximum",12]
["99th Percentile",0.12791467293470035,5.1603821490049107E-2,4.6688855621165626,null,"99th Percentile",10]
["95th Percentile",7.2977333276644907E-2,2.9100726596536047E-2,2.6636726645975393,null,"95th Percentile",8]
["50th Percentile",2.1244044578945784E-2,8.0400351200976602E-3,0.77540762713152112,null,"50th Percentile",5]
["5th Percentile",8.1336007878217223E-3,2.7337914551544959E-3,0.29687642875549286,null,"5th Percentile",3]
{"$rows_left_out":36}
{"sheet":"Scenario 2_Static","index":8,"n_rows":50,"n_cols":10,"rows_kept":50,"cut":false,"hidden":false,"merged":[[19,8,19,9],[30,1,30,3],[0,0,0,1],[4,0,4,1],[8,1,8,3],[8,8,8,9],[9,8,9,9],[18,1,18,2],[18,8,18,9],[8,4,8,6]]}
["What-If Scenario"]
["Production Volume Assessed (kg/yr)",11340]
["Number of Sites",1]
[]
["Monte Carlo Simulation Parameters"]
["Number of Iterations",100000]
["Sampling Method","Latin Hypercube"]
[]
[null,"Daily Concentrations (mg/m3)",null,null,"Daily Concentrations (ppm)",null,null,null,"Exposure Days per Year & Number of Import Containers"]
["Daily Concentrations","Average Daily Concentration (ADC)","Lifetime Average Daily Concentration (LADC)","Subchronic Average Daily Concentration (ADCsubchronic)","Average Daily Concentration (ADC)","Lifetime Average Daily Concentration (LADC)","Subchronic Average Daily Concentration (ADCsubchronic)",null,"EFyearly (days/yr)"]
["Maximum",6.5237530003713369,3.0601762632578358,147.22544385318798,{"$f":"B11*24.45/98.96","v":1.6118205422299836},{"$f":"C11*24.45/98.96","v":0.75607628978025554},36.374920192102323,null,"Maximum",119]
["99th Percentile",1.1597821835231459,0.4735416210379837,24.454394013323697,{"$f":"B12*24.45/98.96","v":0.28654683091290339},{"$f":"C12*24.45/98.96","v":0.11699770244925931},{"$f":"D12*24.45/98.96","v":6.0419354650946273},null,"99th Percentile",95]
["95th Percentile",0.66481699923554272,0.26416874407699698,13.446656150519596,0.16425601890975161,6.5268045601076963E-2,3.3222589215865415,null,"95th Percentile",75]
["50th Percentile",0.19219448739163539,7.281320511349669E-2,3.616976813754702,4.7485400330694073E-2,1.7989923858377062E-2,0.89364473621970963,null,"50th Percentile",42]
["5th Percentile",7.4489065239777372E-2,2.4810448847659181E-2,1.2147561423642499,1.8403977820458335E-2,6.1299057631898444E-3,0.30012922070337422,null,"5th Percentile",28]
{"$rows_left_out":35}