{"text_format":"1","workbook":"xlsx","n_sheets":24,"sheets":["Title Page","Index","INPUT","OUTPUT","Freundlich Reference","Critical Design Assumptions","O&M Assumptions","Indirect Assumptions","Vessel Constraints","Regen Backwash","pH Adjust","Pumps Pipe Structure","Instrumentation and Control","Residuals Management","O&M","HVAC","Indirect","Standard Inputs","AutoSize","Cost Equations","Cost Coefficients","Cost Data","Engineering Data","Lookup Tables"],"not_rendered":{"charts":0,"images":0,"macros":1,"external_links":0,"defined_names":1458,"comments":15,"pivot_tables":0},"unopened":[],"bounds":{"document_bytes":16777216,"sheet_cells":100000,"rows_first":2000,"rows_last":500,"rows_between":2000,"halvings":0,"cell_chars":16384,"cell_head_chars":4096},"cells_cut":0,"cells_raw":0,"read":"whole","date_system":"1900"}

{"sheet":"Title Page","index":0,"n_rows":15,"n_cols":1,"rows_kept":15,"cut":false,"hidden":false,"merged":[]}
["U.S. EPA Office of Ground Water and Drinking Water"]
["Work Breakdown Structure (WBS) Model for Anion Exchange Treatment"]
["Release Date: March 2023"]
["· The primary purpose of this model is to assist EPA in estimating national compliance costs."]
["· As such, the costs are intended to be representative of the central tendency of typical facilities."]
["· The default settings, however, do not account for all of the site-specific factors that could affect the cost of any given individual facility or project."]
["· Still, other uses of the model might be reasonable if sufficient care is taken by the user to account for site- or project-specific factors."]
["· The model results are point estimates shown to the nearest $1, but this precision is not meant to imply that the results are accurate to $1."]
{"$rows_left_out":8}
{"sheet":"Index","index":1,"n_rows":356,"n_cols":2,"rows_kept":356,"cut":false,"hidden":false,"merged":[]}
["INDEX"]
["This page provides an index to all user-adjustable inputs and assumptions.  Click on a variable name to go directly to the adjustable cells."]
[]
["User-adjustable Input or Assumption","Variable Name and Link"]
["1st Freundlich constant (Kf)","freund_1"]
["2nd Freundlich constant (n)","freund_2"]
["Access space per pump for custom designed systems","space_pumps_cust"]
["Access space per pump for pre-engineered packages","space_pumps_pre"]
{"$rows_left_out":349}
{"sheet":"INPUT","index":2,"n_rows":98,"n_cols":9,"rows_kept":98,"cut":false,"hidden":false,"merged":[[46,8,48,8],[25,8,26,8],[25,6,26,7],[7,7,8,7],[9,7,10,7],[11,7,12,7],[13,7,14,7],[15,7,16,7],[17,7,18,7],[19,7,20,7],[21,7,22,7]]}
["ANION EXCHANGE SYSTEM DESIGN AND COST INPUT"]
[]
[null,null,null,null,"STEP 1"]
[null,null,null,null,"Select Contaminant",null,null,{"$f":"IF(contam<>3,\"\",\"For other contaminants, the buttons shown in Step 2 will enter flows only, and clear all other inputs. Advanced users can change this behavior by entering inputs on the Standard Inputs sheet\")","v":""}]
[]
[null,null,null,null,"STEP 2:"]
[null,null,null,null,"Select one of the eight standard designs at right OR select \"CLEAR FOR MANUAL ENTRY\"",null,null,{"$f":"IF(OR('Standard Inputs'!AL9,'Standard Inputs'!AL17,'Standard Inputs'!AL25),\"<- Using this design\",IF(OR('Standard Inputs'!AM9,'Standard Inputs'!AM17,'Standard Inputs'!AM25),\"<- You modified this design\",\"\"))","v":"<- Using this design"},"The standard design buttons are for EPA's use in estimating national costs, but other users might find them useful as a starting point. See documentation for more information"]
[null,null,null,null,null,null,null,{"$f":"IF(OR('Standard Inputs'!AL10,'Standard Inputs'!AL18,'Standard Inputs'!AL26),\"<- Using this design\",IF(OR('Standard Inputs'!AM10,'Standard Inputs'!AM18,'Standard Inputs'!AM26),\"<- You modified this design\",\"\"))","v":""}]
{"$rows_left_out":91}
{"sheet":"OUTPUT","index":3,"n_rows":472,"n_cols":25,"rows_kept":472,"cut":false,"hidden":false,"merged":[[29,12,31,12],[29,13,29,21],[29,22,30,23],[30,13,30,15],[30,16,30,18],[30,19,30,21],[29,0,31,0],[29,1,31,1],[29,2,31,3],[29,4,31,5],[29,6,31,7],[5,3,5,4],[6,3,6,4],[394,8,394,11],[390,2,390,3],[29,8,31,8],[29,9,31,9],[29,10,31,10],[29,11,31,11]]}
["OUTPUT SUMMARY"]
[null,"Parameter","Value","Units"]
[null,"Technology","AX"]
[null,"Contaminant",{"$f":"VLOOKUP(contam,contam_table,2,FALSE)","v":"arsenic"}]
[null,"System Size Category",{"$f":"IF(design_flow<1,\"small\",\"large\")","v":"small"}]
[null,"Design Flow",{"$f":"design_flow","v":0.03},"MGD (excludes bypass flow)"]
[null,"Average Flow",{"$f":"average_flow","v":7.0000000000000001E-3},"MGD (excludes bypass flow)"]
[null,"# of treatment trains",{"$f":"num_treat_lines","v":2}]
{"$rows_left_out":465}
{"sheet":"Freundlich Reference","index":4,"n_rows":12,"n_cols":5,"rows_kept":12,"cut":false,"hidden":false,"merged":[]}
["Reference Data and Sources for Freundlich Isotherm Constants"]
["Data shown are for nitrate removal only; comparable data are not available for arsenic"]
[]
["Data source","Reported Kf (mg/g)","Reported n (dimensionless)","Resin selectivity","Resin used"]
["Song et al., 2012",31.01,3.22,"Nitrate-selective","NDP-2 (polystyrenic macroporous)"]
["Song et al., 2012",21.87,3.04,"Conventional","Purolite A300 (polystyrenic gel-type)"]
["Song et al., 2012",24.91,2.89,"Conventional","D201 (polystyrenic macroporous)"]
["Song et al., 2013",8.98,2.77,"Nitrate-selective","Purolite A520E (polystyrenic macroporous)"]
{"$rows_left_out":5}
{"sheet":"Critical Design Assumptions","index":5,"n_rows":298,"n_cols":7,"rows_kept":298,"cut":false,"hidden":false,"merged":[]}
["Default Critical Design Assumptions"]
["Users may change any of the cells in the Value column; cells in gold are most important and may vary based on contaminant treated and site-specific conditions"]
[]
["Assumption","Range Name","Value","Units","Guidance"]
["Cost estimating method","curve",1,"<-- enter 1 to use cost equations, leave blank to use lookup tables for component costs","Keeping this assumption with a value of 1 is strongly recommended; the cost equations method is more appropriate for national cost estimating and will be more accurate for nearly all user-specified designs"]
[]
["Vessel Design"]
["Number of redundant vessels for small systems with only one vessel","NRD_small_1",1,"units","If a design includes only one operating vessel, there should be at least one additional vessel"]
{"$rows_left_out":291}
{"sheet":"O&M Assumptions","index":6,"n_rows":65,"n_cols":5,"rows_kept":65,"cut":false,"hidden":false,"merged":[]}
["Default O&M Assumptions"]
["Users may change any of the cells in the Value column"]
[]
["Assumption","Range Name","Value","Units","Guidance"]
["Materials"]
["Cost for parts & maintenance for pumps","booster_pump_maintenance",0.01,"of capital cost","For calculating cost of actual maintenance materials; not to be confused with depreciation.  Initial proposed estimate of 5% seems high  (Richard E. Hubel, Peter Keenan, American Water Works Service Company, Inc)"]
[]
["Labor"]
{"$rows_left_out":58}
{"sheet":"Indirect Assumptions","index":7,"n_rows":127,"n_cols":5,"rows_kept":127,"cut":false,"hidden":false,"merged":[[105,0,106,0],[105,1,106,1],[105,2,105,4],[117,0,118,0],[117,1,118,1],[117,2,117,4]]}
["Default Assumptions for Indirect and Add-On Costs"]
["Users may change any of the cells in the Value column"]
[]
["Assumption","Range Name","Value","Units","Guidance"]
["Permits"]
["Include permit costs?","include_permits",1,"<--- enter 1 for yes, 0 for no"]
["Always include NEPA compliance costs?","include_NEPA",1,"<--- enter 1 for default, enter 2 for yes, 3 for no","Default of 1 means NEPA compliance is included only for systems that discharge to surface water. Selecting 2 means NEPA compliance will be included in all estimates. Selecting 3 means NEPA compliance will never be included."]
[]
{"$rows_left_out":120}
{"sheet":"Vessel Constraints","index":8,"n_rows":67,"n_cols":7,"rows_kept":67,"cut":false,"hidden":false,"merged":[]}
["Vessel Constraint Calculations"]
["This sheet performs calculations to confirm that the vessel design on the Input page meets engineering constraints"]
[]
["Calculation","Range Name","Value","Units","Guidance"]
["From Inputs"]
["Design Flow","design_flow",{"$f":"IF(df_units=\"gpm\",(1-bp_pct)*design_flow_I*24*60/1000000,(1-bp_pct)*design_flow_I)","v":0.03},"MGD","From Inputs, less bypass"]
["Average Flow","average_flow",{"$f":"(1-bp_pct)*IF(af_units=\"gpm\",average_flow_I*24*60/1000000,IF(af_units=\"fraction of design flow\",average_flow_I*design_flow,average_flow_I))","v":7.0000000000000001E-3},"MGD","From Inputs, less bypass"]
["Design Flow Rate","design_flow_rate",{"$f":"design_flow*1000000/(24*60)","v":20.833333333333332},"gpm","Design flow expressed in gpm"]
{"$rows_left_out":60}
{"sheet":"Regen Backwash","index":9,"n_rows":64,"n_cols":5,"rows_kept":64,"cut":false,"hidden":false,"merged":[]}
["Backwash and Regeneration Calculations"]
[]
["Calculation","Range Name","Value","Units","Guidance"]
["From Inputs"]
["No backwash pumps","no_backwash",{"$f":"IF(no_backwash_I=\"existing pumps\",1,IF(no_backwash_I=\"new pumps\",\"\",IF(ss_cat2=1,1,\"\")))","v":1},"<-- 1 = backwash using existing supply or treated water pumps, blank = include backwash pumps in costs"]
["No backwash tanks","no_back_tank",{"$f":"IF(no_back_tank_I=\"existing storage\",1,IF(no_back_tank_I=\"new storage\",\"\",IF(ss_cat2=2,\"\",1)))","v":1},"<-- 1 = backwash from existing storage or supply, blank = include backwash tanks in costs"]
[]
["Resin Regeneration"]
{"$rows_left_out":57}
{"sheet":"pH Adjust","index":10,"n_rows":87,"n_cols":5,"rows_kept":87,"cut":false,"hidden":false,"merged":[]}
["Calculations for adjusting pH of finished water"]
[]
["Calculation","Range Name","Value","Units","Guidance"]
["pH adjust","ph_adj",{"$f":"IF(pH_adj_I=\"yes\",1,0)","v":0},"<-- 1=yes 0=no","From Input"]
[]
["pH Adjustment Chemistry"]
["Ionic strength (I)","I_ion_str",{"$f":"TDS_I/40000","v":5.0000000000000001E-3},"mol/L","40,000 converts TDS to ionic strength, Equation 4, Trussell 1998"]
["Temperature variance from 25 degrees centigrade","t_minus25",{"$f":"t_I-25","v":-15},"degrees C","For use in Equation S14, Trussell 1998"]
{"$rows_left_out":80}
{"sheet":"Pumps Pipe Structure","index":11,"n_rows":93,"n_cols":5,"rows_kept":93,"cut":false,"hidden":false,"merged":[]}
["Pumps, Piping, and Structure Calculations"]
[]
["Calculation","Range Name","Value","Units","Guidance"]
["Pump Design"]
["Maximum pump size","max_pump_size",{"$f":"MAX(VLOOKUP(10^6,pump_cost_cl,1)-1,VLOOKUP(10^6,back_pump_cost_cl,1)-1)","v":10000},"gpm","The largest pump size for which costs are available.  Applies to booster pumps and backwash pumps.  "]
["Booster pump rating","pump_rating",{"$f":"IF(lines_pump_I=\"\",IF(ss_cat2=1,0,MIN(MAX(average_flow_rate+bp_flow_rate*average_flow_rate/design_flow_rate,(design_flow_rate+bp_flow_rate)/2)*(1+pump_safety_factor),max_pump_size)),IF(lines_pump_I=0,0,(design_flow_rate+bp_flow_rate)*(1+pump_safety_factor)/lines_pump_I))","v":0},"gpm","Includes safety factor"]
["Number of booster pumps","booster_pumps",{"$f":"IF(pump_rating=0,0,ROUNDUP((design_flow_rate+bp_flow_rate)*(1+pump_safety_factor)/pump_rating,0))","v":0},"units"]
["Total booster pumps","total_booster_pumps",{"$f":"IF(booster_pumps=0,0,booster_pumps+NRD_pumps)","v":0},"units"]
{"$rows_left_out":86}
{"sheet":"Instrumentation and Control","index":12,"n_rows":75,"n_cols":5,"rows_kept":75,"cut":false,"hidden":false,"merged":[]}
["Instrumentation and Control Calculations"]
[]
["Calculation","Range Name","Value","Units","Guidance"]
["From Inputs"]
["Component level","component_level",{"$f":"IF(component_level_I=\"high cost\",2,IF(component_level_I=\"mid cost\",1,\"\"))","v":""},"blank = low cost, 1 = mid cost, 2 = high cost"]
["Manual system controls","manual",{"$f":"IF(manual_I=\"manual\",1,IF(manual_I=\"semi-automated\",2,IF(manual_I=\"fully automated\",3,IF(component_level=\"\",1,IF(component_level=2,3,CHOOSE(ss_cat2,3,3,3))))))","v":3},"1 = fully manual system, 2 = semi-automated system, 3 = fully automated system.","Based on system size and component level (see cell comment), unless user overrides on input sheet"]
[]
["Control Valves and Instrumentation"]
{"$rows_left_out":68}
{"sheet":"Residuals Management","index":13,"n_rows":244,"n_cols":5,"rows_kept":244,"cut":false,"hidden":false,"merged":[]}
["Residuals Management Calculations"]
[]
["Calculation","Range Name","Value","Units","Guidance"]
["From Inputs"]
["Brine delivery method","brine_method",{"$f":"IF(brine_method_I=\"brine mixing tanks\",1,2)","v":1},"<-- 1 for brine mixing tanks, 2 for salt saturator"]
["Discharge option for spent brine","res_s2_opt",{"$f":"IF(res_s2_opt_I=\"surface water\",1,IF(res_s2_opt_I=\"POTW\",2,IF(res_s2_opt_I=\"evaporation pond\",3,IF(res_s2_opt_I=\"septic system\",4,5))))","v":2},"<-- 1 for direct discharge to surface water, 2 for discharge to POTW, 3 for evaporation pond, 4 for septic system. 5 for hazardous waste disposal"]
["Holding tank for spent brine","res_s1_opt",{"$f":"IF(OR(res_s2_opt=3,res_s2_opt=4),2,IF(res_s2_opt=5,1,IF(res_s1_opt_I=\"holding tank\",1,2)))","v":2},"<-- 1 for holding tank, 2 for no holding tank"]
["Characteristics of spent resin","media_haz",{"$f":"IF(media_haz_I=\"\",\"\",IF(media_haz_I=\"hazardous\",2,IF(media_haz_I=\"radioactive\",3,IF(media_haz_I=\"radioactive hazardous\",4,1))))","v":1},"<-- 1 for non-hazardous, 2 for hazardous, 3 for radioactive, 4 for radioactive hazardous"]
{"$rows_left_out":237}
{"sheet":"O&M","index":14,"n_rows":80,"n_cols":5,"rows_kept":80,"cut":false,"hidden":false,"merged":[]}
["Operation and Maintenance Calculations"]
[]
["Calculation","Range Name","Value","Units","Guidance"]
["Materials"]
["Booster pump materials","pump_mtl",{"$f":"IF(total_booster_pumps=0,0,OUTPUT!J194*booster_pump_maintenance)","v":0},"/yr"]
["Backwash pump materials","back_pump_mtl",{"$f":"IF(regen_yr>=52,IF(ISNUMBER(OUTPUT!J195),booster_pump_maintenance*OUTPUT!J195,0),0)","v":0},"/yr"]
[]
["Chemicals and Resin"]
{"$rows_left_out":73}
{"sheet":"HVAC","index":15,"n_rows":135,"n_cols":12,"rows_kept":135,"cut":false,"hidden":false,"merged":[[80,1,80,4],[89,1,89,4]]}
["Building Heating, Ventilating, and Air Conditioning Calculations"]
[]
["Calculation","Range Name","Value","Units","Guidance"]
["General information",null,null,null,"ss_cat2 is used to select ventilation requirements and building type"]
["System size","ss_cat2",{"$f":"IF(design_flow<1,1,IF(design_flow<10,2,3))","v":1},"1 indicates small system, 2 indicates medium, 3 indicates large"]
["Building height","Building_height",{"$f":"IF(tank_geom=1,comm_height_length,comm_diam)+Top_bottom_Vessel_space","v":10.5},"ft"]
["Buiding 1 length and width","build1_side",{"$f":"build1_fp^0.5","v":5.4772255750516612},"ft"]
["Building 2 length and width","build2_side",{"$f":"build2_fp^0.5","v":0},"ft"]
{"$rows_left_out":128}
{"sheet":"Indirect","index":16,"n_rows":97,"n_cols":5,"rows_kept":97,"cut":false,"hidden":false,"merged":[]}
["Indirect and Add-on Cost Calculations"]
[]
["Calculation","Range Name","Value","Units","Guidance"]
["Buildings and Land"]
["Include buildings?","include_buildings",{"$f":"IF(include_buildings_I=\"no\",0,1)","v":1},"1 = yes, 0 = no"]
["Include land?","include_land",{"$f":"IF(include_land_I=\"no\",0,1)","v":1},"1 = yes, 0 = no"]
[]
["Standby Power"]
{"$rows_left_out":90}
{"sheet":"Standard Inputs","index":17,"n_rows":38,"n_cols":41,"rows_kept":38,"cut":false,"hidden":false,"merged":[[6,37,6,40],[5,0,5,1],[5,2,5,5],[5,6,5,13],[5,21,5,25],[5,26,5,35],[5,14,5,20]]}
["Standard Designs"]
["Default inputs represent typical options used to generate national average compliance costs."]
[]
[]
[]
["Design Indices",null,"System Size",null,null,null,"Regeneration?",null,null,null,null,null,null,null,"System Configuration and Vessel Design",null,null,null,null,null,null,"Residuals",null,null,null,null,"Optional"]
["Contaminant Select","Design #","Design flow (mgd)","Design Flow Units","Average Flow","Average flow units","Resin type","Influent concentration","Bed life calculation method","Sulfate concentration","1st Freundlich constant (Kf)","2nd Freundlich constant (n)","Breakthrough concentration","Number of bed volumes","Number of vessels in series","EBCT","Autosize Standard Designs","Bed depth","Vessel geometry","Height or Length","Diameter","Brine delivery method","Discharge option for spent brine","Holding tank for spent brine","Characteristics of spent resin","Characteristics of evaporation pond or holding tank solids","Number of booster pumps","Number of redundant vessels","pH adjustment?","Backwash pumping","Backwash storage","Component level","System Automation","Include buildings?","Include HVAC?","Include land?",null,"Internal Use"]
[null,null,"design_flow_I","df_units","average_flow_I","af_units","resin_type_I","C_0","regen_calc_type","SO4_in","Freund_1","Freund_2","C_b","BV_regen_I","num_tanks_I","EBCT_I","use_autosize","bed_depth","tank_geom_I","comm_height_length","comm_diam","brine_method_I","res_s2_opt_I","res_s1_opt_I","media_haz_I","solids_haz_I","lines_pump_I","NRD_I","pH_adj_I","no_backwash_I","no_back_tank_I","component_level_I","manual_I","include_buildings_I","include_HVAC_I","include_land_I",null,"All match","Flow match","if use_autosize","if not use_autosize"]
{"$rows_left_out":31}
{"sheet":"AutoSize","index":18,"n_rows":126,"n_cols":10,"rows_kept":126,"cut":false,"hidden":false,"merged":[]}
["Autosize"]
["This sheet is used internally by the Auto Size macro to iteratively select the lowest capital cost design meeting engineering constraints. "]
["This sheet is used only if the Auto Size button is clicked.  Advanced users may adjust the automated sizing procedure following the guidance below."]
["Bold blue cells are copied to the input sheet"]
["Bold gold cells are inputs to the sizing procedure"]
[]
["Input Parameters"]
["design flow rate",null,{"$f":"design_flow_rate","v":20.833333333333332},"gpm"]
{"$rows_left_out":119}
{"sheet":"Cost Equations","index":19,"n_rows":262,"n_cols":17,"rows_kept":262,"cut":false,"hidden":false,"merged":[]}
["Cost Equations"]
["This sheet is used internally to calculate component costs using the cost equations method; see model documentation for more details on the development of cost equations"]
[]
["Component",null,"Result","Variable",null,2,3,4,5,6,7,8,9,10,11,16,17]
["Pressure Vessels"]
["Stainless Steel","ss_pv_eq",{"$f":"IF(OR(D6>P6,D6<Q6),\"contact vendor\",F6*D6^G6+H6*LN(D6)+I6+J6*EXP(K6*D6)+L6*D6^3+M6*D6^2+N6*D6+O6)","v":30243.101971403856},{"$f":"comm_vol_gal","v":59.482129904905747},"ss_pv_eq",{"$f":"VLOOKUP($E6,eq_table_cl,F$4,FALSE)","v":0},0,0,0,0,0,4.0000000000000001E-8,-1.6522430000000001E-3,26.487093706,28673.43064482,27101,0]
["Carbon Steel - Stainless Internals","cs_pv_eq",{"$f":"IF(OR(D7>P7,D7<Q7),\"contact vendor\",F7*D7^G7+H7*LN(D7)+I7+J7*EXP(K7*D7)+L7*D7^3+M7*D7^2+N7*D7+O7)","v":10435.029498971922},{"$f":"comm_vol_gal","v":59.482129904905747},"cs_pv_eq",1596.499332614,0.45949680900000001,0,0,0,0,0,0,0,0,27101,0]
["Carbon Steel - Plastic Internals","csp_pv_eq",{"$f":"IF(OR(D8>P8,D8<Q8),\"contact vendor\",F8*D8^G8+H8*LN(D8)+I8+J8*EXP(K8*D8)+L8*D8^3+M8*D8^2+N8*D8+O8)","v":10131.703411796074},{"$f":"comm_vol_gal","v":59.482129904905747},"csp_pv_eq",1798.6988144679999,0.42308934100000001,0,0,0,0,0,0,0,0,27101,0]
{"$rows_left_out":255}
{"sheet":"Cost Coefficients","index":20,"n_rows":64,"n_cols":17,"rows_kept":64,"cut":false,"hidden":false,"merged":[]}
["Coefficients for Component Cost Equations"]
["This sheet is used internally to calculate component costs using the cost equations method; see model documentation for more details on the development of cost equations"]
[]
[null,"Power: C1*x^C2",null,"Logarithmic: C3*Ln(x) + C4",null,"Exponential: C5*e^(C6*x)",null,"Polynomial: C7*x^3 + C8*x^2 + C9*x + C10",null,null,null,"NOTES"]
["Equation Lookup Name","C1","C2","C3","C4","C5","C6","C7","C8","C9","C10","Pct deviation of fit equation","Modified by","Last modified","Rsq of fit equation","max size used to gen curve","min size for which curve fits are valid"]
["back_pump_eq",0,0,0,0,0,0,0,-6.7002999999999995E-4,14.809014980000001,4093.494684836,0.16787720556525074,null," 1/17/2023 11:37:54 AM",0.95812431183124169,10001,0]
["bldg_hi_eq",378.41221851,-0.13671524199999999,0,0,0,0,0,0,0,0,4.0372546378012256E-2,null," 1/25/2023 5:11:07 PM",0.95319947666108407,200000.1,0]
["bldg_lo_eq",163.72087260199999,-9.5204622000000003E-2,0,0,0,0,0,0,0,0,2.4871309850656418E-2,null," 1/25/2023 5:10:26 PM",0.96700830313985342,200000.1,0]
{"$rows_left_out":57}
{"sheet":"Cost Data","index":21,"n_rows":1735,"n_cols":7,"rows_kept":1735,"cut":false,"hidden":false,"merged":[]}
["Cost Data"]
["This sheet is used internally and contains component cost data extracted from the central cost database"]
["To maintain vendor confidentiality, the central cost database itself is not provided here"]
[]
["bls118","Alarms (High/Low Pressure Alarms, Level Switch/Alarms, Low Alarms)"]
[43,null,null,"Unit Cost","Useful Life (large)","Useful Life (small)"]
["alarm_cost_cl",0,0,600.18707669670891,15,14]
[]
{"$rows_left_out":1728}
{"sheet":"Engineering Data","index":22,"n_rows":286,"n_cols":5,"rows_kept":286,"cut":false,"hidden":false,"merged":[]}
["Engineering Data"]
["This sheet is used internally and contains engineering reference and indirect cost data extracted from the central cost database"]
[]
["Architectural Fee"]
["Building cost lookup","Corresponds to the range","Architectural fee"]
[0,"<$250,000",0.09]
[250000,"$250,000 to $500,000",0.08]
[500000,"$500,000 to $1,000,000",7.0000000000000007E-2]
{"$rows_left_out":279}
{"sheet":"Lookup Tables","index":23,"n_rows":75,"n_cols":7,"rows_kept":75,"cut":false,"hidden":false,"merged":[]}
["Lookup Tables and Input Validation"]
["This sheet is used internally to perform certain reference calculations and support input sheet data validation"]
[]
["Temperature Dependence Coefficients for Calculating Equilibrium Constants"]
["From Table 2, Trussell 1998"]
["Range names are of the form \"ax_Kx\" (e.g., a1_Kw for first temperature coefficent for the equilbrium constant for water)"]
["Reaction","Constant","a1","a2","a3","a4","a5"]
["H2O <-> OH- + H+","Kw",-6.0880000000000001,4471,null,1.7059999999999999E-2]
{"$rows_left_out":67}