{"text_format":"1","workbook":"xlsx","n_sheets":22,"sheets":["Title Page","Index","INPUT","OUTPUT","Critical Design Assumptions","O&M Assumptions","Indirect Assumptions","Offgas Assumptions","Basin Constraints","CO2 Removal","Offgas","Pumps Pipe Structure","Instrumentation and Control","O&M","HVAC","Indirect","Standard Inputs","Cost Equations","Cost Coefficients","Cost Data","Engineering Data","Lookup Tables"],"not_rendered":{"charts":0,"images":0,"macros":1,"external_links":0,"defined_names":792,"comments":17,"pivot_tables":0},"unopened":[],"bounds":{"document_bytes":16777216,"sheet_cells":100000,"rows_first":2000,"rows_last":500,"rows_between":2000,"halvings":0,"cell_chars":16384,"cell_head_chars":4096},"cells_cut":0,"cells_raw":0,"read":"whole","date_system":"1900"}

{"sheet":"Title Page","index":0,"n_rows":15,"n_cols":1,"rows_kept":15,"cut":false,"hidden":false,"merged":[]}
["U.S. EPA Office of Ground Water and Drinking Water"]
["Work Breakdown Structure (WBS) Model for MULTI-STAGE BUBBLE AERATION Treatment"]
["Release Date: March 2023"]
["· The primary purpose of this model is to assist EPA in estimating national compliance costs."]
["· As such, the costs are intended to be representative of the central tendency of typical facilities."]
["· The default settings, however, do not account for all of the site-specific factors that could affect the cost of any given individual facility or project."]
["· Still, other uses of the model might be reasonable if sufficient care is taken by the user to account for site- or project-specific factors."]
["· The model results are point estimates shown to the nearest $1, but this precision is not meant to imply that the results are accurate to $1."]
{"$rows_left_out":8}
{"sheet":"Index","index":1,"n_rows":205,"n_cols":2,"rows_kept":205,"cut":false,"hidden":false,"merged":[]}
["INDEX"]
["This page provides an index to all user-adjustable inputs and assumptions.  Click on a variable name to go directly to the adjustable cells."]
[]
["User-adjustable Input or Assumption","Variable Name and Link"]
["Access space per pump/blower for custom designed systems","space_pumps_cust"]
["Access space per pump/blower for pre-engineered packages","space_pumps_pre"]
["Additional blower head above water depth","add_blow_head"]
["Additional building after…","add_2nd_building"]
{"$rows_left_out":198}
{"sheet":"INPUT","index":2,"n_rows":92,"n_cols":9,"rows_kept":92,"cut":false,"hidden":false,"merged":[[16,6,17,7],[27,8,27,11],[13,7,14,7]]}
["MULTI-STAGE BUBBLE AERATION SYSTEM DESIGN AND COST INPUT"]
[]
[null,null,null,null,"STEP 1"]
[null,null,null,null,"Select Contaminant",null,null,{"$f":"IF(AND(contam>2,contam<16),\"For VOCs, standard designs are available up to 1 MGD only, because information on using MSBA for these contaminants in larger systems is limited\",IF(contam=16,\"For other contaminants, the buttons shown in Step 2 will enter flows only, and clear all other inputs. Advanced users can change this behavior by entering inputs on the Standard Inputs sheet\",\"\"))","v":"For VOCs, standard designs are available up to 1 MGD only, because information on using MSBA for these contaminants in larger systems is limited"}]
[]
[null,null,null,null,"STEP 2:",null,null,{"$f":"IF(OR('Standard Inputs'!AK9,'Standard Inputs'!AK17,'Standard Inputs'!AK25,'Standard Inputs'!AK33,'Standard Inputs'!AK41,'Standard Inputs'!AK49,'Standard Inputs'!AK57,'Standard Inputs'!AK65,'Standard Inputs'!AK73,'Standard Inputs'!AK81,'Standard Inputs'!AK89,'Standard Inputs'!AK97,'Standard Inputs'!AK105,'Standard Inputs'!AK113,'Standard Inputs'!AK121,'Standard Inputs'!AK129),\"<- Using this design\",IF(OR('Standard Inputs'!AL9,'Standard Inputs'!AL17,'Standard Inputs'!AL25,'Standard Inputs'!AL33,'Standard Inputs'!AL41,'Standard Inputs'!AL49,'Standard Inputs'!AL57,'Standard Inputs'!AL65,'Standard Inputs'!AL73,'Standard Inputs'!AL81,'Standard Inputs'!AL89,'Standard Inputs'!AL105,'Standard Inputs'!AL113,'Standard Inputs'!AL121,'Standard Inputs'!AL129),\"<- You modified this design\",\"\"))","v":"<- Using this design"},"The standard design buttons are for EPA's use in estimating national costs, but other users might find them useful as a starting point. See documentation for more information"]
[null,null,null,null,"Select one of the eight standard designs at right OR select \"CLEAR FOR MANUAL ENTRY\"",null,null,{"$f":"IF(OR('Standard Inputs'!AK10,'Standard Inputs'!AK18,'Standard Inputs'!AK26,'Standard Inputs'!AK34,'Standard Inputs'!AK42,'Standard Inputs'!AK50,'Standard Inputs'!AK58,'Standard Inputs'!AK66,'Standard Inputs'!AK74,'Standard Inputs'!AK82,'Standard Inputs'!AK90,'Standard Inputs'!AK98,'Standard Inputs'!AK106,'Standard Inputs'!AK114,'Standard Inputs'!AK122,'Standard Inputs'!AK130),\"<- Using this design\",IF(OR('Standard Inputs'!AL10,'Standard Inputs'!AL18,'Standard Inputs'!AL26,'Standard Inputs'!AL34,'Standard Inputs'!AL42,'Standard Inputs'!AL50,'Standard Inputs'!AL58,'Standard Inputs'!AL66,'Standard Inputs'!AL74,'Standard Inputs'!AL82,'Standard Inputs'!AL90,'Standard Inputs'!AL106,'Standard Inputs'!AL114,'Standard Inputs'!AL122,'Standard Inputs'!AL130),\"<- You modified this design\",\"\"))","v":""}]
[null,null,null,null,null,null,null,{"$f":"IF(OR('Standard Inputs'!AK11,'Standard Inputs'!AK19,'Standard Inputs'!AK27,'Standard Inputs'!AK35,'Standard Inputs'!AK43,'Standard Inputs'!AK51,'Standard Inputs'!AK59,'Standard Inputs'!AK67,'Standard Inputs'!AK75,'Standard Inputs'!AK83,'Standard Inputs'!AK91,'Standard Inputs'!AK99,'Standard Inputs'!AK107,'Standard Inputs'!AK115,'Standard Inputs'!AK123,'Standard Inputs'!AK131),\"<- Using this design\",IF(OR('Standard Inputs'!AL11,'Standard Inputs'!AL19,'Standard Inputs'!AL27,'Standard Inputs'!AL35,'Standard Inputs'!AL43,'Standard Inputs'!AL51,'Standard Inputs'!AL59,'Standard Inputs'!AL67,'Standard Inputs'!AL75,'Standard Inputs'!AL83,'Standard Inputs'!AL91,'Standard Inputs'!AL107,'Standard Inputs'!AL115,'Standard Inputs'!AL123,'Standard Inputs'!AL131),\"<- You modified this design\",\"\"))","v":""}]
{"$rows_left_out":85}
{"sheet":"OUTPUT","index":3,"n_rows":308,"n_cols":25,"rows_kept":308,"cut":false,"hidden":false,"merged":[[30,22,31,23],[235,4,235,5],[30,12,32,12],[30,13,30,21],[31,13,31,15],[31,16,31,18],[31,19,31,21],[30,0,32,0],[30,1,32,1],[239,8,239,11],[235,2,235,3],[30,11,32,11],[30,2,32,3],[30,4,32,5],[30,6,32,7],[30,8,32,8],[30,9,32,9],[30,10,32,10]]}
["OUTPUT SUMMARY"]
[null,"Parameter","Value","Units"]
[null,"Technology","MSBA"]
[null,"Contaminant",{"$f":"VLOOKUP(contam,contaminant_lookup,2,FALSE)","v":"TCE"}]
[null,"System Size Category",{"$f":"IF(design_flow<1,\"small\",\"large\")","v":"small"}]
[null,"Design Flow",{"$f":"design_flow","v":0.03},"MGD (excludes bypass flow)"]
[null,"Average Flow",{"$f":"average_flow","v":7.0000000000000001E-3},"MGD (excludes bypass flow)"]
[null,"Number of Basins ",{"$f":"num_tanks","v":1},"units"]
{"$rows_left_out":301}
{"sheet":"Critical Design Assumptions","index":4,"n_rows":121,"n_cols":7,"rows_kept":121,"cut":false,"hidden":false,"merged":[]}
["Default Critical Design Assumptions"]
["Users may change any of the cells in the Value column; cells in gold are most important and may vary based on contaminant treated and site-specific conditions"]
[]
["Assumption","Range Name","Value","Units","Guidance"]
["Use curve fit for costs","curve",1,"<-- enter 1 to use cost equations, leave blank to use lookup tables for component costs","Keeping this assumption with a value of 1 is strongly recommended; the cost equations method is more appropriate for national cost estimating and will be more accurate for nearly all user-specified designs"]
[]
["Bypass Flow"]
["Percent of Total Flow that is Bypassed","bp_pct",0,null,"Typically, bypass flow ranges between 0% and 50% of inflow. Enter zero to remove bypass piping and components. 0% is default consistent with the type of cost curves that EPA will need for its national cost simulation model."]
{"$rows_left_out":114}
{"sheet":"O&M Assumptions","index":5,"n_rows":58,"n_cols":5,"rows_kept":58,"cut":false,"hidden":false,"merged":[]}
["Default O&M Assumptions"]
["Users may change any of the cells in the Value column"]
[]
["Assumption","Range Name","Value","Units","Guidance"]
["Pump head","pump_head",75,"psi","Consistent with pumping to distribution at 60-90 psi (Lowry Peer Review Comments)"]
["Efficiency of pumps","pump_effcy",0.75]
["Additional blower head above water depth","add_blow_head",10,"inches"]
["Blower efficiency","blower_effcy",0.7]
{"$rows_left_out":51}
{"sheet":"Indirect Assumptions","index":6,"n_rows":130,"n_cols":5,"rows_kept":130,"cut":false,"hidden":false,"merged":[[108,0,109,0],[108,1,109,1],[108,2,108,4],[120,0,121,0],[120,1,121,1],[120,2,120,4]]}
["Default Assumptions for Indirect and Add-On Costs"]
["Users may change any of the cells in the Value column"]
[]
["Assumption","Range Name","Value","Units","Guidance"]
["Permits"]
["Include permit costs?","include_permits",1,"<--- enter 1 for yes, 0 for no"]
["Always include NEPA compliance costs?","include_NEPA",1,"<--- enter 1 for default, enter 2 for yes, 3 for no","Default of 1 means NEPA compliance is included only for systems that discharge to surface water. Selecting 2 means NEPA compliance will be included in all estimates. Selecting 3 means NEPA compliance will never be included."]
[]
{"$rows_left_out":123}
{"sheet":"Offgas Assumptions","index":7,"n_rows":45,"n_cols":7,"rows_kept":45,"cut":false,"hidden":false,"merged":[[27,0,28,0],[27,1,28,1]]}
["Default Offgas Assumptions"]
["Users may change any of the cells in the Value column"]
[]
["Assumption","Range Name","Value","Units","Guidance"]
["Specific heat of air","cpa",1.01,"kJ/kg-deg C","Rough assumption to account for high temperature and relative humidity in this application"]
["Density of air","PA",1.2470000000000001,"kg/m3","Conservatively using value for 10 deg C"]
["Default operating temperature","T_default",283,"degrees Kelvin","Assumption used for equilibrium operating temperature when user leaves optional input blank. 283 degrees K (10 degrees C) is typical of groundwater. "]
[]
{"$rows_left_out":38}
{"sheet":"Basin Constraints","index":8,"n_rows":54,"n_cols":5,"rows_kept":54,"cut":false,"hidden":false,"merged":[]}
["Basin Constraint Calculations"]
[]
["Calculation","Range Name","Value","Units","Guidance"]
["From Inputs"]
["Design Production Flow","design_flow",{"$f":"IF(df_units=\"gpm\",(1-bp_pct)*design_flow_I*24*60/1000000,(1-bp_pct)*design_flow_I)","v":0.03},"MGD","From input, less bypass"]
["Average Production Flow","average_flow",{"$f":" (1-bp_pct)*IF(af_units=\"gpm\",average_flow_I*24*60/1000000,IF(af_units=\"fraction of design flow\",average_flow_I*design_flow,average_flow_I))","v":7.0000000000000001E-3},"MGD","From input, less bypass"]
["Design Production Flow Rate","design_flow_rate",{"$f":"design_flow*1000000/(24*60)","v":20.833333333333332},"gpm","Design flow expressed in gpm"]
["Average Production Flow Rate","average_flow_rate",{"$f":"average_flow*1000000/(24*60)","v":4.8611111111111107},"gpm","Average flow expressed in gpm"]
{"$rows_left_out":47}
{"sheet":"CO2 Removal","index":9,"n_rows":10,"n_cols":5,"rows_kept":10,"cut":false,"hidden":false,"merged":[]}
["Carbon Dioxide Removal Calculations"]
["This sheet is used when the design targets carbon dioxide removal for pH adjustment"]
[]
["Calculation","Range Name","Value","Units","Guidance"]
["Equilibrium constant for carbonic acid dissociation","log_K1",{"$f":"VLOOKUP(T-273,log_K1_lookup,3)","v":-6.46},null,"Relationship 11, Table 3, Lytle et al., 1998"]
["Maximum initial dissolved CO2 concentration","CO2_max",{"$f":"IF(Units_rem<>3,\"NA\",44010*(alk_I/50045)/(10^(pH_i+log_K1)))","v":"NA"},"mg/L","Equation 5, Table 3, Lytle et al., 1998"]
["Target treated water CO2","CO2_f",{"$f":"IF(contam<>2,\"NA\",IF(Units_rem=1,influent_conc*(1-P_REM_I),IF(Units_rem=2,P_REM_I,10^(pH_i-pH_f)*influent_conc)))","v":"NA"},"mg/L","Based on Equation 1 in text and Equation 3 in Table 3, Lytle et al., 1998"]
["Minimum CO2 achievable at equilibrium","CO2_min",{"$f":"VLOOKUP(T-273,min_CO2_lookup,3)","v":0.71},"mg/L","Relationship 10, Table 3, Lytle et al., 1998"]
{"$rows_left_out":3}
{"sheet":"Offgas","index":10,"n_rows":74,"n_cols":5,"rows_kept":74,"cut":false,"hidden":false,"merged":[]}
["Offgas Calculations"]
[]
["Calculation","Range Name","Value","Units","Guidance"]
["From Inputs"]
["Off-gas Pollution Control Technology","Offgas_Tech",{"$f":"IF(OR(Offgas_Tech_I=\"none\",Offgas_Tech_I=\"\"),0,IF(Offgas_Tech_I=\"GAC\",1,IF(Offgas_Tech_I=\"thermal oxidation\",2,3)))","v":0},"<--- 0 for none, 1 for GAC, 2 for Thermal Oxidation, 3 for Catalytic Oxidation"]
["Heat recovery type","og_opt1",{"$f":"IF(OR(Offgas_Tech=2,Offgas_Tech=3),IF(og_opt1_I=\"none\",0,IF(og_opt1_I=\"recuperative\",1,2)),\"\")","v":""},"<--- 0 for none, 1 for recuperative, 2 for regenerative"]
["Spent GAC regeneration","og_opt2",{"$f":"IF(Offgas_Tech=1,IF(og_opt2_I=\"throwaway\",0,1),\"\")","v":""},"<--- 0 for throwaway (no regeneration), 1 for off-site regeneration"]
["Percent removal","p_rem_og",{"$f":"IF(p_rem=\"NA\",\"NA\",p_rem)","v":0.90067189560958161}]
{"$rows_left_out":67}
{"sheet":"Pumps Pipe Structure","index":11,"n_rows":49,"n_cols":5,"rows_kept":49,"cut":false,"hidden":false,"merged":[]}
["Pumps, Piping, and Structure Calculations"]
[]
["Calculation","Range Name","Value","Units","Guidance"]
["Influent Pumping"]
["Flow of each pump","pump_rating",{"$f":"IF(num_pumps_I=\"\",MIN(MAX(average_flow_rate+bp_flow_rate*average_flow_rate/design_flow_rate,(design_flow_rate+bp_flow_rate)/2)*(1+pump_safety_factor),max_pump_size),IF(num_pumps_I=0,0,(design_flow_rate+bp_flow_rate)*(1+pump_safety_factor)/num_pumps_I))","v":13.020833333333332},"gpm","Includes safety factor"]
["Operating pumps","num_pumps",{"$f":"IF(pump_rating=0,0,ROUNDUP((design_flow_rate+bp_flow_rate)*(1+pump_safety_factor)/pump_rating,0))","v":2},"units"]
["Total pumps","total_pumps",{"$f":"IF(pump_rating=0,0,num_pumps+NRD_pumps)","v":2},"units"]
["Maximum pump size","max_pump_size",{"$f":"MAX(VLOOKUP(10^6,pump_cost_cl,1)-1,VLOOKUP(10^6,back_pump_cost_cl,1)-1)","v":10000},"gpm","The largest pump size for which costs are available.  Applies to booster pumps."]
{"$rows_left_out":42}
{"sheet":"Instrumentation and Control","index":12,"n_rows":50,"n_cols":5,"rows_kept":50,"cut":false,"hidden":false,"merged":[]}
["Instrumentation and Control Calculations"]
[]
["Calculation","Range Name","Value","Units","Guidance"]
["From Inputs"]
["Component level","component_level",{"$f":"IF(component_level_I=\"high cost\",2,IF(component_level_I=\"mid cost\",1,\"\"))","v":""},"blank = low cost, 1 = mid cost, 2 = high cost"]
["Manual system controls","manual",{"$f":"IF(manual_I=\"manual\",1,IF(manual_I=\"semi-automated\",2,IF(manual_I=\"fully automated\",3,IF(component_level=\"\",1,IF(component_level=2,3,CHOOSE(ss_cat2,3,3,3))))))","v":3},"1 = fully manual system, 2 = semi-automated system, 3 = fully automated system.","Based on system size and component level (see cell comment), unless user overrides on input sheet"]
[]
["Valves and Instrumentation"]
{"$rows_left_out":43}
{"sheet":"O&M","index":13,"n_rows":66,"n_cols":5,"rows_kept":66,"cut":false,"hidden":false,"merged":[]}
["Operation and Maintenance Calculations"]
[]
["Calculation","Range Name","Value","Units","Guidance"]
["Materials"]
["Maintenance Materials"]
["Pumps","pump_materials",{"$f":"IF(OUTPUT!J48=\"--\",0,pump_maint_rate*OUTPUT!J48)","v":89.982991457733789},"/yr"]
["Blowers","blower_materials",{"$f":"IF(num_blowers=0,0,pump_maint_rate*SUMPRODUCT(OUTPUT!J50:J51,OUTPUT!L50:L51))","v":47.134409511484058},"/yr"]
[]
{"$rows_left_out":59}
{"sheet":"HVAC","index":14,"n_rows":134,"n_cols":12,"rows_kept":134,"cut":false,"hidden":false,"merged":[[79,1,79,4],[88,1,88,4]]}
["Building Heating, Ventilating, and Air Conditioning Calculations"]
[]
["Calculation","Range Name","Value","Units","Guidance"]
["General information"]
["System size","ss_cat2",{"$f":"IF(design_flow<1,1,IF(design_flow<10,2,3))","v":1},"1 indicates small system, 2 indicates medium, 3 indicates large","ss_cat2 is used to select ventilation requirements and building type"]
["Buiding 1 length and width","build1_side",{"$f":"build1_fp^0.5","v":8.3666002653407556},"ft"]
["Building 2 length and width","build2_side",{"$f":"build2_fp^0.5","v":0},"ft"]
["Include HVAC?","include_HVAC",{"$f":"IF(include_HVAC_I=\"no\",0,IF(include_HVAC_I=\"yes\",1,2))","v":2}," 0 = always exclude, 1 = always include, 2 = use model default"]
{"$rows_left_out":127}
{"sheet":"Indirect","index":15,"n_rows":97,"n_cols":5,"rows_kept":97,"cut":false,"hidden":false,"merged":[]}
["Indirect and Add-on Cost Calculations"]
[]
["Calculation","Range Name","Value","Units","Guidance"]
["Buildings and Land"]
["Include buildings?","include_buildings",{"$f":"IF(include_buildings_I=\"no\",0,1)","v":1},"1 = yes, 0 = no"]
["Include land?","include_land",{"$f":"IF(include_land_I=\"no\",0,1)","v":1},"1 = yes, 0 = no"]
[]
["Standby Power"]
{"$rows_left_out":90}
{"sheet":"Standard Inputs","index":16,"n_rows":142,"n_cols":40,"rows_kept":142,"cut":false,"hidden":false,"merged":[[6,36,6,39],[5,0,5,1],[5,2,5,5],[5,27,5,34],[5,22,5,26],[5,16,5,21],[5,6,5,15]]}
["Standard Designs"]
["Default inputs represent typical options used to generate national average compliance costs."]
[]
[]
[]
["Design Indices",null,"System Size",null,null,null,"Optional Removal Inputs",null,null,null,null,null,null,null,null,null,"System Configuration",null,null,null,null,null,"Off-gas",null,null,null,null,"Optional"]
["Contaminant Selection","Design #","Design flow (mgd)","Design Flow Units","Average Flow","Average flow units","Influent water concentration","Contaminant removal input type","Percent removal or treated water concentration","Influent pH","Desired treated water pH","Influent water alkalinity","Operating temperature","Temperature Units","Pilot rate constant (Kla)","Pilot air intensity (AI)","Design Type","Optimize Standard Inputs","Number of Operating Basins","Air to Water Ratio","Maximum Water Depth","# of Stages","VOC Release Limit (lbs/day)","Off-gas Pollution Control Technology","Heat Recovery Type","GAC Regeneration","GAC Bed Life","Number of Pumps","Number of Blowers","Number of Redundant Basins","Component level","System Automation","Include buildings?","Include HVAC?","Include land?","Contaminant Name","Internal Use"]
[null,null,"design_flow_I","df_units","average_flow_I","af_units","influent_conc_I","Units_rem_I","P_REM_I","pH_i","pH_f","alk_I","T_I","T_units","pilot_k","pilot_phi","design_type_I","use_autosize","num_op_tanks","air_water_ratio","max_h2odepth","stages","max_VOC_release","Offgas_tech_I","og_opt1_I","og_opt2_I","og_opt3","num_pumps_I","num_blowers_I","NRD_I","component_level_I","manual_I","include_buildings_I","include_HVAC_I","include_land_I",null,"All match","Flow match","if use_autosize","if not use_autosize"]
{"$rows_left_out":135}
{"sheet":"Cost Equations","index":17,"n_rows":130,"n_cols":17,"rows_kept":130,"cut":false,"hidden":false,"merged":[]}
["Cost Equations"]
["This sheet is used internally to calculate component costs using the cost equations method; see model documentation for more details on the development of cost equations"]
[]
["Component",null,"Result","Variable",null,2,3,4,5,6,7,8,9,10,11,16,17]
["Aeration Basins"]
["Custom Designed"]
["Concrete, excavation and backfill, cover","no equation"]
["Baffles","baffle_eq",{"$f":"IF(OR(D8>P8,D8<Q8),\"contact vendor\",F8*D8^G8+H8*LN(D8)+I8+J8*EXP(K8*D8)+L8*D8^3+M8*D8^2+N8*D8+O8)","v":134.24079014999998},{"$f":"baffle_area","v":12.5},"baffle_eq",{"$f":"VLOOKUP($E8,eq_table_cl,F$4,FALSE)","v":0},0,0,0,0,0,0,0,10.739263211999999,0,10000.1,0]
{"$rows_left_out":123}
{"sheet":"Cost Coefficients","index":18,"n_rows":54,"n_cols":17,"rows_kept":54,"cut":false,"hidden":false,"merged":[]}
["Coefficients for Component Cost Equations"]
["This sheet is used internally to calculate component costs using the cost equations method; see model documentation for more details on the development of cost equations"]
[]
[null,"Power: C1*x^C2",null,"Logarithmic: C3*Ln(x) + C4",null,"Exponential: C5*e^(C6*x)",null,"Polynomial: C7*x^3 + C8*x^2 + C9*x + C10",null,null,null,"NOTES"]
["Equation Lookup Name","C1","C2","C3","C4","C5","C6","C7","C8","C9","C10","Pct deviation of fit equation","Modified by","Last modified","Rsq of fit equation","max size used to gen curve","min size for which curve fits are valid"]
["baffle_eq",0,0,0,0,0,0,0,0,10.739263211999999,0,0,null," 1/25/2023 11:17:44 AM",1,10000.1,0]
["bldg_hi_eq",378.41221851,-0.13671524199999999,0,0,0,0,0,0,0,0,4.0372546378012256E-2,null," 1/25/2023 5:11:07 PM",0.95319947666108407,200000.1,0]
["bldg_lo_eq",163.72087260199999,-9.5204622000000003E-2,0,0,0,0,0,0,0,0,2.4871309850656418E-2,null," 1/25/2023 5:10:26 PM",0.96700830313985342,200000.1,0]
{"$rows_left_out":47}
{"sheet":"Cost Data","index":19,"n_rows":1157,"n_cols":7,"rows_kept":1157,"cut":false,"hidden":false,"merged":[]}
["Cost Data"]
["This sheet is used internally and contains component cost data extracted from the central cost database"]
["To maintain vendor confidentiality, the central cost database itself is not provided here"]
[]
["bls118","Alarms (High/Low Pressure Alarms, Level Switch/Alarms, Low Alarms)"]
[43,null,null,"Unit Cost","Useful Life (large)","Useful Life (small)"]
["alarm_cost_cl",0,0,600.18707669670891,15,14]
[]
{"$rows_left_out":1150}
{"sheet":"Engineering Data","index":20,"n_rows":206,"n_cols":8,"rows_kept":206,"cut":false,"hidden":false,"merged":[]}
["Engineering Data"]
["This sheet is used internally and contains engineering reference and indirect cost data extracted from the central cost database"]
[]
["Architectural Fee"]
["Building cost lookup","Corresponds to the range","Architectural fee"]
[0,"<$250,000",0.09]
[250000,"$250,000 to $500,000",0.08]
[500000,"$500,000 to $1,000,000",7.0000000000000007E-2]
{"$rows_left_out":199}
{"sheet":"Lookup Tables","index":21,"n_rows":71,"n_cols":3,"rows_kept":71,"cut":false,"hidden":false,"merged":[]}
["Lookup Tables and Input Validation"]
["This sheet is used internally to perform certain reference calculations and support input sheet data validation"]
[]
["Carbon Dioxide in Equilibrium with the Atmosphere"]
["Relationship 10, Table 3, Lytle et al., 1998"]
["min_CO2_lookup"]
["Temperature Selected (degrees C)","Temperature Used (degrees C)","Minimum CO2 (mg/L)"]
[0,5,0.85]
{"$rows_left_out":63}