{"text_format":"1","workbook":"xlsx","n_sheets":10,"sheets":["Revision List","CoverLetter","Summary","CFR Constants","Fleet std calculation","Fleet ave calculation","Adv Tech std calcs","Adv Tech Fleet ave calcs","HFC Emissions","ADCO2 Calcs"],"not_rendered":{"charts":0,"images":3,"macros":1,"external_links":0,"defined_names":2,"comments":9,"pivot_tables":0},"unopened":[],"bounds":{"document_bytes":16777216,"sheet_cells":100000,"rows_first":2000,"rows_last":500,"rows_between":2000,"halvings":0,"cell_chars":16384,"cell_head_chars":4096},"cells_cut":0,"cells_raw":0,"read":"whole","date_system":"1900"}

{"sheet":"Revision List","index":0,"n_rows":7,"n_cols":5,"rows_kept":7,"cut":false,"hidden":false,"merged":[[3,0,3,4]]}
[]
["ABC HD 2b/3 Truck Company - 2022 CAFC/GHG Model Year Report"]
[]
["Revision List"]
[]
[]
["Revision Date",null,"Spread sheet name",null,"Description of Revision"]

{"sheet":"CoverLetter","index":1,"n_rows":0,"n_cols":0,"rows_kept":0,"cut":false,"hidden":false,"merged":[]}

{"sheet":"Summary","index":2,"n_rows":27,"n_cols":14,"rows_kept":27,"cut":false,"hidden":false,"merged":[[25,4,25,5],[26,4,26,5],[0,0,0,13],[1,0,1,13],[22,4,22,5],[23,4,23,5],[24,4,24,5]]}
["Purpose and Scope of this Guidance Document   "]
["         This document was prepared by EPA's Office of Transportation and Air Quality (OTAQ).  It is intended to aid regulated parties in reporting fleet average Greenhouse Gas (GHG), Corporate Average Fuel Consumption (CAFC) values and calculating AB&T fleet average credits for heavy-duty class 2b and 3 vehicles, ref. 40 CFR 86.1819-14 and 49 CFR 535.5(a), 535.6(a), 535.7.  It contains EPA's recommended format for manufacturers to report to EPA their end-of-year GHG and CAFC calculations, credits and other information with respect to the implementation of the Phase 2 Greenhouse Gas Emissions and Fuel Efficiency Standards for Heavy-Duty Class 2b and 3 Pickup Trucks and Vans, ref. 81 FR 73478, October 25, 2016, including any subsequent revisions to those requirements. The use of this document is purely optional.\n       This document does not in any way alter or waive the requirements in EPA regulations.  Although the calculations and formulas provided in this document are intended to assist manufacturers in the implementation of EPA regulations, this document does not establish or change the legal rights or obligations of manufacturers or others in complying with EPA regulations, including 40 CFR 86.1865-12. If an error or other discrepancy is found in this document, including the calculation formulas, please contact your EPA certification team member.  The regulations take precedence."]
[]
[null,"Example Final Model Year HD 2b/3 Pickup & Van CAFC/GHG Credit Summary Report"]
[null,"Manufacturer: ____ABC HD 2b/3 Truck Company______"]
[null,"CO2 Credit Summary:"]
[null,"Fleet","Model Year","Target CO2 Standard (g/mile)","Manufacturer CO2 \n(g/mile)","U.S. Production Volume\n(units)","2021-2027MY Advanced Technology Credit Multiplier","CO2 150K Credit (Deficit) \n(Mg)","CO2 Credits Required for N2O Compliance \n(Mg)","CO2 Credits Required for CH4 Compliance \n(Mg)","CO2 Innovative Technology Credits \n(Mg)","Total CO2 Credits \n(Mg)","Date Credits Were Earned","Comments"]
[null,"Conventional",2022,{"$f":"'Fleet std calculation'!D12","v":470},{"$f":"'Fleet ave calculation'!D9","v":456},{"$f":"'Fleet std calculation'!C12","v":79920},1,{"$f":"ASTM((D8-E8)*F8*G8*150000/1000000,0)","v":167832},{"$f":"'Fleet ave calculation'!AE14","v":0},{"$f":"'Fleet ave calculation'!AF14","v":0},{"$f":"'Fleet ave calculation'!AH14","v":0},{"$f":"SUM(H8:K8)","v":167832},"2022-12-31"]
[null,"Advanced Technology -EV",2022,{"$f":"'Adv Tech std calcs'!E12","v":431},{"$f":"'Adv Tech Fleet ave calcs'!E9","v":0},{"$f":"'Adv Tech std calcs'!D12","v":46944},{"$f":"IF(C9>2027,1,4.5)","v":4.5},{"$f":"ASTM((D9-E9)*F9*G9*150000/1000000,0)","v":13657183},{"$f":"'Adv Tech Fleet ave calcs'!AG16","v":0},{"$f":"'Adv Tech Fleet ave calcs'!AH16","v":0},{"$f":"'Adv Tech Fleet ave calcs'!AJ16","v":0},{"$f":"SUM(H9:K9)","v":13657183},"2022-12-31"]
[null,"Advanced Technology - PHEV",2022,{"$f":"'Adv Tech std calcs'!E13","v":483},{"$f":"'Adv Tech Fleet ave calcs'!E10","v":51},{"$f":"'Adv Tech std calcs'!D13","v":29432},{"$f":"IF(C10>2027,1,3.5)","v":3.5},{"$f":"ASTM((D10-E10)*F10*G10*150000/1000000,0)","v":6675178},{"$f":"'Adv Tech Fleet ave calcs'!AG17","v":0},{"$f":"'Adv Tech Fleet ave calcs'!AH17","v":0},{"$f":"'Adv Tech Fleet ave calcs'!AJ17","v":0},{"$f":"SUM(H10:K10)","v":6675178},"2022-12-31"]
{"$rows_left_out":18}
{"sheet":"CFR Constants","index":3,"n_rows":39,"n_cols":5,"rows_kept":39,"cut":false,"hidden":true,"merged":[[1,1,1,2],[1,3,1,4],[0,1,0,4]]}
[null,"Table 3 of § 86.1819-14"]
[null,"CO2 Constants",null,"FC Constants"]
[null,"A","B","C","D"]
["2021_Spark Ignition",4.2900000000000001E-2,331,4.8270000000000002E-4,3.7250000000000001]
["2022_Spark Ignition",4.1799999999999997E-2,322,4.7029999999999999E-4,3.6230000000000002]
["2023_Spark Ignition",4.0800000000000003E-2,314,4.5909999999999999E-4,3.5329999999999999]
["2024_Spark Ignition",3.9800000000000002E-2,306,4.4779999999999999E-4,3.4430000000000001]
["2025_Spark Ignition",3.8800000000000001E-2,299,4.3659999999999999E-4,3.3639999999999999]
["2026_Spark Ignition",3.78E-2,291,4.2529999999999998E-4,3.274]
["2027_Spark Ignition",3.6900000000000002E-2,284,4.1520000000000001E-4,3.1960000000000002]
{"$rows_left_out":30}
{"sheet":"Fleet std calculation","index":4,"n_rows":43,"n_cols":31,"rows_kept":43,"cut":false,"hidden":false,"merged":[[13,1,13,9],[14,21,15,21],[14,1,15,1],[14,5,15,5],[14,6,15,6],[14,7,15,7],[14,10,15,10],[0,1,0,30],[1,8,1,27],[14,11,15,11],[14,25,15,25],[14,18,15,18],[14,8,15,8],[14,9,15,9],[14,22,15,22],[14,27,15,27],[14,26,15,26],[14,19,15,19],[14,16,15,16],[14,17,15,17],[13,30,15,30],[13,12,13,24],[13,25,13,27]]}
[null,"Purpose and Scope of this Guidance Document   "]
[null,null,null,null,null,null,null,null,"         This document was prepared by EPA's Office of Transportation and Air Quality (OTAQ).  It is intended to aid regulated parties in reporting fleet average Greenhouse Gas (GHG), Corporate Average Fuel Consumption (CAFC) values and calculating AB&T fleet average credits for heavy-duty class 2b and 3 vehicles, ref. 40 CFR 86.1819-14 and 49 CFR 535.5(a), 535.6(a), 535.7.  It contains EPA's recommended format for manufacturers to report to EPA their end-of-year GHG and CAFC calculations, credits and other information with respect to the implementation of the Phase 2 Greenhouse Gas Emissions and Fuel Efficiency Standards for Heavy-Duty Class 2b and 3 Pickup Trucks and Vans, ref. 81 FR 73478, October 25, 2016, including any subsequent revisions to those requirements. The use of this document is purely optional.\n       This document does not in any way alter or waive the requirements in EPA regulations.  Although the calculations and formulas provided in this document are intended to assist manufacturers in the implementation of EPA regulations, this document does not establish or change the legal rights or obligations of manufacturers or others in complying with EPA regulations, including 40 CFR 86.1865-12. If an error or other discrepancy is found in this document, including the calculation formulas, please contact your EPA certification team member.  The regulations take precedence."]
[]
[null,"Final HD Class 2b/3 CAFC/GHG Model Year Report  - CO2 and FC Fleet Average Standards Calculations"]
[null,"Manufacturer: ","ABC HD 2b/3 Truck Co."]
[null,"Model Year: ",2022,{"$f":"IF(C6='Fleet ave calculation'!C6,\"\",\"ERROR--Model Year of Conventional vehicle Fleet Standard calculation tab doesn't match the Model Year of the Conventional Vehicle Fleet Average Calculation tab;\")","v":""}]
[null,"Report: ","HD 2b/3 Conventional Fleet Final Model Year Report"]
[null,"EPA Phase 2 GHG Standards: ","ref. 40 CFR 86.1819-14(a)(2) or 86.1819-14(k)(4)(iii) Table 3;"]
[null,"NHTSA Phase 2 FC Standards: ","ref. 49 CFR 535.5(a)(2)(ii) Table 6"]
[]
{"$rows_left_out":34}
{"sheet":"Fleet ave calculation","index":5,"n_rows":33,"n_cols":44,"rows_kept":33,"cut":false,"hidden":false,"merged":[[24,16,25,16],[24,1,25,1],[24,22,25,22],[24,20,25,20],[24,15,25,15],[24,14,25,14],[24,13,25,13],[24,12,25,12],[24,11,25,11],[24,19,25,19],[24,18,25,18],[24,6,25,6],[24,17,25,17],[24,7,25,7],[24,21,25,21],[24,36,25,36],[24,34,25,34],[24,32,25,32],[24,24,25,24],[24,23,25,23],[11,38,11,39],[10,42,12,42],[10,43,12,43],[11,1,12,1],[11,5,12,5],[11,6,12,6],[11,7,12,7],[11,8,12,8],[11,17,12,17],[11,18,12,18],[11,21,12,21],[11,34,11,35],[11,11,12,11],[11,13,12,13],[11,15,12,15],[11,16,12,16],[0,1,0,43],[1,12,1,29],[10,34,10,35],[11,40,11,41],[11,23,12,23],[11,24,12,24],[11,25,12,25],[11,32,11,33],[11,9,12,9],[11,10,12,10],[10,1,10,9],[10,15,10,18],[10,28,10,29],[10,30,10,33],[10,19,10,27],[10,36,10,41]]}
[null,"Purpose and Scope of this Guidance Document   "]
[null,null,null,null,null,null,null,null,null,null,null,null,"This document was prepared by EPA's Office of Transportation and Air Quality (OTAQ).  It is intended to aid regulated parties in reporting fleet average Greenhouse Gas (GHG), Corporate Average Fuel Consumption (CAFC) values and calculating AB&T fleet average credits for heavy-duty class 2b and 3 vehicles, ref. 40 CFR 86.1819-14 and 49 CFR 535.5(a), 535.6(a), 535.7.  It contains EPA's recommended format for manufacturers to report to EPA their end-of-year GHG and CAFC calculations, credits and other information with respect to the implementation of the Phase 2 Greenhouse Gas Emissions and Fuel Efficiency Standards for Heavy-Duty Class 2b and 3 Pickup Trucks and Vans, ref. 81 FR 73478, October 25, 2016, including any subsequent revisions to those requirements. The use of this document is purely optional.\n       This document does not in any way alter or waive the requirements in EPA regulations.  Although the calculations and formulas provided in this document are intended to assist manufacturers in the implementation of EPA regulations, this document does not establish or change the legal rights or obligations of manufacturers or others in complying with EPA regulations, including 40 CFR 86.1865-12. If an error or other discrepancy is found in this document, including the calculation formulas, please contact your EPA certification team member.  The regulations take precedence."]
[]
[null,"Final HD Class 2b/3 CAFC/GHG Model Year Report  - CO2 and FC Fleet Average Performance Calculations"]
[null,"Manufacturer","ABC HD 2b/3 Truck Co"]
[null,"Model Year ",2022,{"$f":"IF(C6='Fleet std calculation'!C6,\"\",\"ERROR--Model Year of Conventional vehicle Fleet Standard calculation tab doesn't match the Model Year of the Conventional Vehicle Fleet Average Calculation tab;\")","v":""}]
[]
[null,null,"AA. Total production volume","BB. Fleet average CO2 (gpm)","EE. Fleet average FC \n(gal/100 mile)","Number of Subconfigurations","Number of vehicles\nActually tested","Rate of production volume represented by test data\n(%)"]
[null,null,{"$f":"IF($C$6>2023, SUM(P14:Q14), SUM(P14:R14))","v":79920},{"$f":"ASTM(Z14/C9,0)","v":456},{"$f":"ASTM(AD14/C9,3)","v":5.1159999999999997},{"$f":" COUNT(G15:G302)","v":17},{"$f":"AK32","v":13},1,{"$f":"IF(C9='Fleet std calculation'!C12,\"\",\"ERROR--Total production volume of Fleet std calculation tab doesn't match the Total production volume of the Fleet ave Calculation tab;\")","v":""}]
[]
{"$rows_left_out":24}
{"sheet":"Adv Tech std calcs","index":6,"n_rows":44,"n_cols":33,"rows_kept":44,"cut":false,"hidden":false,"merged":[[16,29,17,29],[16,2,17,2],[16,12,17,12],[16,13,17,13],[16,18,17,18],[16,19,17,19],[16,21,17,21],[16,20,17,20],[16,10,17,10],[0,1,0,32],[1,6,1,27],[15,32,17,32],[16,1,17,1],[16,6,17,6],[16,7,17,7],[16,8,17,8],[16,27,17,27],[16,11,17,11],[16,9,17,9],[15,1,15,10],[15,14,15,26],[16,23,17,23],[16,24,17,24],[15,27,15,29],[16,28,17,28]]}
[null,"Purpose and Scope of this Guidance Document   "]
[null,null,null,null,null,null,"This document was prepared by EPA's Office of Transportation and Air Quality (OTAQ).  It is intended to aid regulated parties in reporting fleet average Greenhouse Gas (GHG), Corporate Average Fuel Consumption (CAFC) values and calculating AB&T fleet average credits for heavy-duty class 2b and 3 vehicles, ref. 40 CFR 86.1819-14 and 49 CFR 535.5(a), 535.6(a), 535.7.  It contains EPA's recommended format for manufacturers to report to EPA their end-of-year GHG and CAFC calculations, credits and other information with respect to the implementation of the Phase 2 Greenhouse Gas Emissions and Fuel Efficiency Standards for Heavy-Duty Class 2b and 3 Pickup Trucks and Vans, ref. 81 FR 73478, October 25, 2016, including any subsequent revisions to those requirements. The use of this document is purely optional.\n       This document does not in any way alter or waive the requirements in EPA regulations.  Although the calculations and formulas provided in this document are intended to assist manufacturers in the implementation of EPA regulations, this document does not establish or change the legal rights or obligations of manufacturers or others in complying with EPA regulations, including 40 CFR 86.1865-12. If an error or other discrepancy is found in this document, including the calculation formulas, please contact your EPA certification team member.  The regulations take precedence."]
[]
[null,"Final HD Class 2b/3 CAFC/GHG Model Year Report  - CO2 and FC Fleet Average Standards Calculations for Advanced Technology Vehicles (EVs, PHEVs, Fuel Cell Vehicles)"]
[null,null,"Manufacturer: ","ABC HD 2b/3 Truck Co."]
[null,null,"Model Year: ",2022,{"$f":"IF(D6='Adv Tech Fleet ave calcs'!D6,\"\",\"ERROR--Model Year of Advanced Technology Standard calculation tab doesn't match the Model Year of the Advanced Technology Vehicle Fleet ave Calculation tab;\")","v":""}]
[null,null,"Report: ","HD 2b/3 Conventional Fleet Final Model Year Report"]
[null,null,"EPA Phase 2 GHG Standards: ","ref. 40 CFR 86.1819-14(a)(2) or 86.1819-14(k)(4)(iii) Table 3;"]
[null,null,"NHTSA Phase 2 FC Standards: ","ref. 49 CFR 535.5(a)(2)(ii) Table 6"]
[]
{"$rows_left_out":35}
{"sheet":"Adv Tech Fleet ave calcs","index":7,"n_rows":31,"n_cols":46,"rows_kept":31,"cut":false,"hidden":false,"merged":[[13,6,14,6],[13,7,14,7],[13,8,14,8],[13,9,14,9],[13,26,14,26],[13,11,14,11],[13,20,14,20],[12,45,14,45],[13,34,13,35],[13,36,13,37],[13,40,13,41],[13,42,13,43],[13,27,14,27],[13,17,14,17],[13,18,14,18],[13,19,14,19],[13,25,14,25],[0,1,0,45],[1,14,1,31],[12,2,12,10],[12,17,12,20],[12,21,12,29],[12,30,12,31],[12,32,12,35],[12,36,12,37],[12,38,12,43],[12,44,14,44],[13,10,14,10],[13,12,14,12],[13,13,14,13],[13,15,14,15],[13,2,14,2],[13,1,14,1]]}
[null,"Purpose and Scope of this Guidance Document   "]
[null,null,null,null,null,null,null,null,null,null,null,null,null,null,"This document was prepared by EPA's Office of Transportation and Air Quality (OTAQ).  It is intended to aid regulated parties in reporting fleet average Greenhouse Gas (GHG), Corporate Average Fuel Consumption (CAFC) values and calculating AB&T fleet average credits for heavy-duty class 2b and 3 vehicles, ref. 40 CFR 86.1819-14 and 49 CFR 535.5(a), 535.6(a), 535.7.  It contains EPA's recommended format for manufacturers to report to EPA their end-of-year GHG and CAFC calculations, credits and other information with respect to the implementation of the Phase 2 Greenhouse Gas Emissions and Fuel Efficiency Standards for Heavy-Duty Class 2b and 3 Pickup Trucks and Vans, ref. 81 FR 73478, October 25, 2016, including any subsequent revisions to those requirements. The use of this document is purely optional.\n       This document does not in any way alter or waive the requirements in EPA regulations.  Although the calculations and formulas provided in this document are intended to assist manufacturers in the implementation of EPA regulations, this document does not establish or change the legal rights or obligations of manufacturers or others in complying with EPA regulations, including 40 CFR 86.1865-12. If an error or other discrepancy is found in this document, including the calculation formulas, please contact your EPA certification team member.  The regulations take precedence."]
[]
[null,null,"Final HD Class 2b/3 CAFC/GHG Model Year Report  - CO2 and FC Fleet Average Performance Calculations for Advanced Technology Vehicles (EVs, PHEVs, Fuel Cell Vehicles)"]
[null,null,"Manufacturer","ABC HD 2b/3 Truck Co"]
[null,null,"Model Year ",2022,{"$f":"IF(D6='Adv Tech std calcs'!D6,\"\",\"ERROR--Model Year of Advanced Technology Standard calculation tab doesn't match the Model Year of the Advanced Technology Vehicle Fleet ave Calculation tab;\")","v":""}]
[]
[null,null,null,"AA. Total production volume","BB. Fleet average CO2 (gpm)","EE. Fleet average FC \n(gal/100 mile)","Number of Subconfigurations","Number of vehicles\nActually tested","Rate of production volume represented by test data\n(%)"]
[null,null,"EVs:  ",{"$f":"SUM(R16:S16)","v":46944},{"$f":"ASTM(AB16/D9,0)","v":0},{"$f":"ASTM(AF16/D9,3)","v":0},{"$f":" COUNT(H19:H21)","v":3},0,1,{"$f":"IF(D9='Adv Tech std calcs'!D12,\"\",\"ERROR--Total EV production volume of the Advanced Technology Fleet std calculation tab doesn't match the Total EV production volume of the Advanced Technology Fleet ave Calculation tab;\")","v":""}]
[null,null,"PHEVs:  ",{"$f":"SUM(R17:S17)","v":29432},{"$f":"ASTM(AB17/D10,0)","v":51},{"$f":"ASTM(AF17/D10,3)","v":0.57399999999999995},{"$f":" COUNT(H22:H25)","v":4},1,1,{"$f":"IF(D10='Adv Tech std calcs'!D13,\"\",\"ERROR--Total PHEV production volume of the Advanced Technology Fleet std calculation tab doesn't match the Total PHEV production volume of the Advanced Technology Fleet ave Calculation tab;\")","v":""}]
{"$rows_left_out":22}
{"sheet":"HFC Emissions","index":8,"n_rows":25,"n_cols":12,"rows_kept":25,"cut":false,"hidden":false,"merged":[[11,5,12,5],[11,6,12,6],[14,5,15,5],[14,6,15,6],[14,7,15,7],[11,7,12,7],[11,9,12,9],[11,10,12,10],[4,8,6,8],[11,11,12,11],[14,11,15,11],[14,9,15,9],[14,10,15,10],[14,8,15,8],[11,8,12,8],[0,1,0,11],[1,1,1,15],[9,1,10,1],[9,2,10,2],[9,3,10,3],[9,4,10,4],[9,5,9,9],[9,10,9,11]]}
[null,"Purpose and Scope of this Guidance Document   "]
[null,"This document was prepared by EPA's Office of Transportation and Air Quality (OTAQ).  It is intended to aid regulated parties in reporting fleet average Greenhouse Gas (GHG), Corporate Average Fuel Consumption (CAFC) values and calculating AB&T fleet average credits for heavy-duty class 2b and 3 vehicles, ref. 40 CFR 86.1819-14 and 49 CFR 535.5(a), 535.6(a), 535.7.  It contains EPA's recommended format for manufacturers to report to EPA their end-of-year GHG and CAFC calculations, credits and other information with respect to the implementation of the Phase 2 Greenhouse Gas Emissions and Fuel Efficiency Standards for Heavy-Duty Class 2b and 3 Pickup Trucks and Vans, ref. 81 FR 73478, October 25, 2016, including any subsequent revisions to those requirements. The use of this document is purely optional.\n       This document does not in any way alter or waive the requirements in EPA regulations.  Although the calculations and formulas provided in this document are intended to assist manufacturers in the implementation of EPA regulations, this document does not establish or change the legal rights or obligations of manufacturers or others in complying with EPA regulations, including 40 CFR 86.1865-12. If an error or other discrepancy is found in this document, including the calculation formulas, please contact your EPA certification team member.  The regulations take precedence."]
[]
[null,"  End-Model Year Report HFC LEAKAGE SCORE TABLE (Heavy-Duty Class 2b/3 Vehicles including EVs, PHEVs, and Fuel Cell Vehicles)"]
[null,"Manufacturer","ABC HD 2b/3 Truck Co.",null,null,null,null,null,"Total Production Volume"]
[null,"Model Year ",2022]
[]
[null,null,null,null,null,null,null,null,{"$f":"SUM(I12:I22)","v":158368}]
[]
[null,"TEST GROUP\n NAME","ENGINE CODE","DIVISION\nNAME","CARLINE","A/C System Information",null,null,null,null,"A/C Leakage Rate"]
{"$rows_left_out":16}
{"sheet":"ADCO2 Calcs","index":9,"n_rows":12,"n_cols":36,"rows_kept":12,"cut":false,"hidden":false,"merged":[[5,20,5,21],[5,22,5,24],[5,9,6,9],[5,10,6,10],[5,11,6,11],[5,12,6,12],[5,15,6,15],[5,16,6,16],[0,1,0,35],[1,10,1,23],[4,2,4,10],[4,14,4,16],[4,19,4,29],[4,35,6,35],[5,1,7,1],[5,2,6,2],[5,5,6,5],[5,6,6,6],[5,7,6,7],[5,8,6,8]]}
[null,"Purpose and Scope of this Guidance Document   "]
[null,null,null,null,null,null,null,null,null,null,"This document was prepared by EPA's Office of Transportation and Air Quality (OTAQ).  It is intended to aid regulated parties in reporting fleet average Greenhouse Gas (GHG), Corporate Average Fuel Consumption (CAFC) values and calculating AB&T fleet average credits for heavy-duty class 2b and 3 vehicles, ref. 40 CFR 86.1819-14 and 49 CFR 535.5(a), 535.6(a), 535.7.  It contains EPA's recommended format for manufacturers to report to EPA their end-of-year GHG and CAFC calculations, credits and other information with respect to the implementation of the Phase 2 Greenhouse Gas Emissions and Fuel Efficiency Standards for Heavy-Duty Class 2b and 3 Pickup Trucks and Vans, ref. 81 FR 73478, October 25, 2016, including any subsequent revisions to those requirements. The use of this document is purely optional.\n       This document does not in any way alter or waive the requirements in EPA regulations.  Although the calculations and formulas provided in this document are intended to assist manufacturers in the implementation of EPA regulations, this document does not establish or change the legal rights or obligations of manufacturers or others in complying with EPA regulations, including 40 CFR 86.1865-12. If an error or other discrepancy is found in this document, including the calculation formulas, please contact your EPA certification team member.  The regulations take precedence."]
[]
[null,"2018MY HD  GHG ADCO2 Calculation sheet"]
[null,null,"Subconfiguration Information",null,null,null,null,null,null,null,null,null,null,null,"GHG Compliance Level+T9 (see instructions)",null,null,null,null,"ADCO2 Baseline test vehicle",null,null,null,null,null,null,null,null,null,null,"New vehicle ",null,null,null,null,"Calculation\nresults\n\nADCO2"]
[null,"Spread sheets\n\"Fleet ave calculation\"\nCell no.\nADO2","A1.\nTruck Line Name and Description","Test Group","Engine Code","Base\nlevel\n(test group/ transmission type)","Config.\nGroup","A2.\nSub-\nconfig. Group Name","B.\n2 or 4 Wheel Drive","C.\nEngine","D.\nTrans Class","E.\nFinal Drive Ratio","F.\nRoad Load HP","J.\nETW","W. \nRLC\nCO2 emissions","X. \nCO2 Value based on ADC?","Y. \nIf ADC derived, Test vehicle ID and Conf. that is source of CO2base","No. of RLC\ncovered by\natual test",null,"Test Vehicle ID/Config.","Test Number",null,"Test Result (CO2)",null,null,"F0","F1","F2","If","ETW","F0","F1","F2","If","ETW"]
[null,null,null,null,null,null,null,null,null,null,null,null,null,"lbs.","gpm",null,null,null,null,null,"CITY","HWY","CITY","HWY","COMB."]
[]
[null,"T20","2500 Pickup-Trim Level A  Short Cab","NXXXD03.6YYY","AA2",2,3,8,"2wd","3.6L","L8",3.3570000000000002,21.2,7000,439,"Yes","B022/00","ADC",null,"B022/00","LXXX10039452","LXXX10039453",549,304,{"$f":"ASTM(0.55*W9+0.45*X9,1)","v":438.8},63.3,0.26769999999999999,3.3480000000000003E-2,3.3570000000000002,7500,58.21,0.25,3.5209999999999998E-2,3.3570000000000002,7000,{"$f":"ASTM(Y9+2.18*(AE9-Z9)+37.4*(AF9-AA9)+2257*(AG9-AB9)+189*(AH9-AC9)+0.0222*(AI9-AD9),0)","v":420}]
[null,"T21","2500 Pickup-Trim Level A  4-door Cab",null,null,null,null,9,"2wd","3.6L","L8",3.3570000000000002,20.7,7500,439,"Yes","B022/00","ADC",null,"B022/00","LXXX10039452","LXXX10039453",549,304,{"$f":"ASTM(0.55*W10+0.45*X10,1)","v":438.8},63.3,0.26769999999999999,3.3480000000000003E-2,3.3570000000000002,7500,61.32,0.25929999999999997,3.2419999999999997E-2,3.3570000000000002,7500,{"$f":"ASTM(Y10+2.18*(AE10-Z10)+37.4*(AF10-AA10)+2257*(AG10-AB10)+189*(AH10-AC10)+0.0222*(AI10-AD10),0)","v":432}]
{"$rows_left_out":2}