{"text_format":"1","workbook":"xlsx","n_sheets":9,"sheets":["Intro","Getting Started","NMC","SystChar","Alternatives","Implementation","Rev. Sum.","O. Items","Lists"],"not_rendered":{"charts":0,"images":2,"macros":1,"external_links":0,"defined_names":8,"comments":0,"pivot_tables":0},"unopened":[],"bounds":{"document_bytes":16777216,"sheet_cells":100000,"rows_first":2000,"rows_last":500,"rows_between":2000,"halvings":0,"cell_chars":16384,"cell_head_chars":4096},"cells_cut":0,"cells_raw":0,"read":"whole","date_system":"1900"}

{"sheet":"Intro","index":0,"n_rows":12,"n_cols":4,"rows_kept":12,"cut":false,"hidden":false,"merged":[[4,3,4,10],[6,3,6,10],[1,2,2,11],[7,2,7,11],[11,3,11,10]]}
[]
[null,null,"Long-Term Control Plan (LTCP) Review Checklist "]
[null,"Color_B_Intro_GetStarted"]
[]
[null,null,null,"Welcome to the long-term control plan (LTCP) review checklist! EPA created this checklist to support combined sewer overflow (CSO) LTCP development and review. The checklist is based on existing EPA guidance such as the Combined Sewer Overflows Guidance for Long-Term Control Plan and Guidance for Nine Minimum Controls. EPA designed the checklist to help CSO permittees and National Pollutant Discharge Elimination System (NPDES) authorities determine if the LTCPs meet the requirements of the CSO Control Policy and conform with EPA guidance on developing LTCPs. The checklist also provides a list of recommendations that can be used to improve LTCPs. Due to the site-specific nature of CSOs and LTCPs, the checklist includes additional fields for the user to fully document their specific situation."]
[]
[null,null,null,"Click on the \"Get Started\" button below to begin:"]
[null,null,"(If prompted by Microsoft Excel (there may be a yellow ribbon at the top of your screen) click the button to \"Enable Content\" or \"Enable Macros.\")"]
[]
[]
[]
[null,null,null,"Disclaimer: The statements in this document are intended solely as suggestions. This document is not intended, nor can it be relied on, to create any rights enforceable by any party in litigation with the United States. Long-term CSO control plans are site-specific in nature. EPA, state officials, and CSO permittees may decide to follow a suggestion provided in this document, or to act at variance with the suggestion, based on an analysis of site-specific circumstances."]

{"sheet":"Getting Started","index":1,"n_rows":34,"n_cols":5,"rows_kept":34,"cut":false,"hidden":false,"merged":[[1,2,2,8],[9,2,9,3],[10,2,10,8],[11,2,11,8],[22,3,22,5],[18,2,18,8],[20,3,20,5],[21,3,21,5],[12,2,12,8],[13,2,13,8],[14,2,14,8],[17,2,17,8],[16,2,16,8],[15,2,15,8],[24,3,24,5],[19,2,19,3],[23,3,23,5]]}
["Welcome to the Getting Started page. On this page are instructions for how to use the checklist, as well as a navigation menu that can be used to navigate to other pages of the checklist at any time. The same navigation menu is available on all pages. Use the tab key to move through the page and the enter key to go to other pages when that page's button is selected."]
["Instructions:\n1. Fill out the User Information section that follows these instructions.\n2. After entering you User Information, select either the Small System or Large System option depending on the size of your system. Small systems serve less than 75,000 people, while large systems serve greater than 75,000 people. Selecting either option will bring you to the applicable review questions.\n3. Enter required information throughout the checklist where prompted. Note any relevant supporting documentation in the space provided after each question. Be sure to include details like title, date and version where applicable.\n4. Navigate to different pages using the tab key to toggle across navigation buttons.\n5. In many cases, helpful resources are identified for specific questions after data input cells. Click the links or use the description of the resource document and specific page number to access these helpful resources, which include sections from EPA's Combined Sewer Overflow Guidance for Long-Term Control Plan or Guidance for Nine Minimum Controls.\n6. Use the Additional Considerations cell at the bottom of each page to provide additional details specific to the LTCP under review.\n7. Once you answer all questions, go to the 5. Addressed Items page to see a summary of the documents reviewed as part of the LTCP review.\n8. Finally, go to the 6. Recommendations page to see a list of suggested improvements for the LTCP.\n9. To clear all information and start over, click Control + r to reset the entire form or click individual page reset buttons that are at the end of each page.",null,"Long-Term Control Plan (LTCP) Review Checklist "]
[null,"Nav_AddressedItems"]
["Button: Go to the 1. Nine Minimum Controls page"]
["Button: Go to the 2. System Characterization page"]
["Button: Go to the 3. Alternatives Evaluation page"]
["Button: Go to the 4. LTCP Implementation page"]
["Button: Go to the 5. Addressed Items page"]
["Button: Go to the 6. Recommendations page"]
["Button: Full Reset",null,"Instructions:"]
["Button: Go back to the Introduction page",null,"1. Fill out the \"User Information\" section below."]
["a\na",null,"2. Click the appropriate button under \"Select your role!\"."]
["a\na",null,"3. Enter required information in red cells throughout this checklist. Note the specific supporting documentation (include title, date, version)."]
["a\na",null,"4. Navigate to a different section using the tabs at the top of each page or the \"Next\" or \"Previous\" buttons at the bottom of each page."]
[null,null,"5. Click the i button to the right of each question to access helpful resources, including EPA's Combined Sewer Overflows Guidance for Long-Term Control Plan or Guidance for Nine Minimum Controls. Where applicable, a specific page is noted to point to a relevant section of the suggested guidance document."]
[null,null,"6. Use the “Additional Considerations” box at the bottom on each page to provide additional details specific to the LTCP under review."]
[null,null,"7. Once you answer all questions, go the \"5. Addressed Items\" page to see a summary of the documents reviewed as part of the LTCP review."]
[null,null,"8. Finally, go to the \"6. Recommendations\" page to see a list of suggested improvements for the LTCP."]
[null,null,"9. To clear all information and start over, click the \"Full Reset\" button in the top right corner or \"Reset All Entries\" button in the bottom of the of each page. "]
[null,null,"User Information:"]
{"$rows_left_out":15}
{"sheet":"NMC","index":2,"n_rows":26,"n_cols":7,"rows_kept":26,"cut":false,"hidden":false,"merged":[[22,2,22,6],[1,2,1,6],[21,2,21,7],[9,5,9,6],[10,2,10,6],[20,2,20,6]]}
["1. Nine Minimum Controls. This page includes questions about the permittee's implementation of the nine minimum controls. Use the tab key to move through the page and the enter key to go to other pages when that page's button is selected."]
[null,null,"Long-Term Control Plan (LTCP) Review Checklist"]
["Button: Go to the Getting Started page"]
[]
["Button: Go to the 2. System Characterization page"]
["Button: Go to the 3. Alternatives Evaluation page"]
["Button: Go to the 4. LTCP Implementation page"]
["Button: Go to the 5. Addressed Items page"]
["Button: Go to the 6. Recommendations page"]
[null,null,"Has the permittee implemented the following nine minimum controls (NMC)?","Yes or No?","If Yes, note the specific document that was used to support this answer, including title, date, and version, as applicable. If No, what still needs to be done?","Helpful\nResources"]
[null,null,"NMC"]
["a\na",1,"1. Proper operation and regular maintenance programs for the sewer system and CSO outfalls",null,null,"i\nPage 18","i"]
["a\na",{"$f":"B12+1","v":2},"2. Maximum use of the collection system for storage",null,null,"i\nPage 24","i"]
["a\na",{"$f":"B13+1","v":3},"3. Review and modification of pretreatment requirements to ensure that CSO impacts are minimized",null,null,"i\nPage 28","i"]
["a\na",4,"4. Maximization of flow to the POTW",null,null,"i\nPage 32","i"]
["a\na",5,"5. Elimination of CSOs during dry weather",null,null,"i\nPage 35","i"]
["a\na",6,"6. Control of solid and floatable materials in CSOs",null,null,"i\nPage 40","i"]
["a\na",7,"7. Pollution prevention programs to reduce containments in CSOs",null,null,"i\nPage 54","i"]
["a\na",8,"8. Public notification to ensure that the public receives adequate notification of CSO occurrences and CSO impacts",null,null,"i\nPage 60","i"]
["a\na",9,"9. Monitoring to effectively characterize CSO impacts and the efficacy of CSO controls",null,null,"i\nPage 63","i"]
{"$rows_left_out":7}
{"sheet":"SystChar","index":3,"n_rows":75,"n_cols":7,"rows_kept":75,"cut":false,"hidden":false,"merged":[[70,2,70,7],[71,2,71,6],[1,2,1,6],[10,2,10,6],[40,2,40,6],[56,2,56,6],[69,2,69,6],[9,5,9,6]]}
["2. System Characterization. This page includes questions about the System Characterization performed by the permittee. Use the tab key to move through the page and the enter key to go to other pages when that page's button is selected."]
[null,null,"Long-Term Control Plan (LTCP) Review Checklist"]
["Button: Go to the Getting Started page"]
["Button: Go to the 1. Nine Minimum Controls page"]
[]
["Button: Go to the 3. Alternatives Evaluation page"]
["Button: Go to the 4. LTCP Implementation page"]
["Button: Go to the 5. Addressed Items page"]
["Button: Go to the 6. Recommendations page"]
[null,null,"Answer the following questions regarding system characterization.","Yes or No?","If Yes, note the specific document that was used to support this answer, including title, date, and version, as applicable. If No, what still needs to be done?","Helpful\nResources"]
["sm",null,"General System Characterization"]
["sm\nall","MC1","Major Question: Has the permittee collected and presented existing information and data on the CSS and receiving waters in a format that is understandable and consistent with the CSO Control Policy and guidance? If no, briefly describe what the permittee can do to improve the quality of their submittal.",null,null,"i\nPage 34"]
["sm",null,"Combined Sewer System"]
["sm\nall",{"$f":"NMC!B20+1","v":10},"Is the location provided for the major interceptors and each CSO outfall (latitude/longitude or street address) and identified on a map?"]
["sm\nall",{"$f":"B14+1","v":11},"Are the identified CSO outfalls consistent with the existing permit?"]
["a\na",{"$f":"B15+1","v":12},"Have the CSS area and its sewersheds been delineated?",null,null,"i\nPage 40"]
["a\na",13,"Have land use and estimated impervious cover been provided for each sewershed? If only land use or impervious cover is missing, please provide additional detail in the notes column to the right.",null,null,"i\nPage 40"]
["sm\nall",14,"Are the principal hydraulic control structures identified on a map (e.g., interceptors; regulators; pump stations; storage and controls facilities; POTW)?  If no, indicate which items are missing in the notes column to the right.",null,null,"i\nPage 42"]
["a\na",15,"Are POTW capacities (e.g., primary and secondary; average and peak) specified?",null,null,"i\nPage 42","i\nPage 33"]
["sm\nall",16,"Are dry weather sanitary flow (baseflow) estimates or patterns presented?",null,null,"i\nPage 42","i\nPage 33"]
{"$rows_left_out":56}
{"sheet":"Alternatives","index":4,"n_rows":56,"n_cols":7,"rows_kept":56,"cut":false,"hidden":false,"merged":[[52,2,52,6],[51,2,51,7],[10,2,10,6],[1,2,1,6],[9,5,9,6],[44,2,44,6],[50,2,50,6]]}
["3. Alternatives Evaluation. This page includes questions about the Alternatives Evaluation performed by the permittee. Use the tab key to move through the page and the enter key to go to other pages when that page's button is selected."]
[null,null,"Long-Term Control Plan (LTCP) Review Checklist"]
["Button: Go to the Getting Started page"]
["Button: Go to the 1. Nine Minimum Controls page"]
["Button: Go to the 2. System Characterization page"]
[]
["Button: Go to the 4. LTCP Implementation page"]
["Button: Go to the 5. Addressed Items page"]
["Button: Go to the 6. Recommendations page"]
[null,null,"Answer the following questions regarding alternatives evaluation. ","Yes or No?","If Yes, note the specific document that was used to support this answer, including title, date, and version, as applicable. If No, what still needs to be done?","Helpful\nResources"]
["sm",null,"Development and Evaluation of CSO Control Alternatives"]
["sm\nall","MC4","Major Question: Has the permittee evaluated CSO control alternatives to select a cost-effective CSO control plan to meet water quality standards and protect designated uses?",null,null,"i\nPage 98"]
["sm",null,"Long-Term Control Plan Approach"]
["sm\nall",{"$f":"SystChar!B69+1","v":56},"Has the permittee organized the evaluation of controls in a technical framework and approach that is understandable and consistent with the CSO Control Policy and EPA guidance? If no, list any specific recommendations for improvement in the notes column to the right.",null,null,"i\nPage 100"]
["sm\nall",{"$f":"B14+1","v":57},"Has the permittee identified whether the presumption approach, the demonstration approach or some combination of the two is being used? ",null,null,"i\nPage 100"]
["sm",null,"Development of CSO Control Alternatives"]
["sm\nall",{"$f":"B15+1","v":58},"Has the permittee considered a range of control technology within the general categories of source controls, collection system controls, storage technologies and treatment technologies? If only a partial range has been considered, note any suggested improvements in the notes column to the right.",null,null,"i\nPage 126"]
["sm\nall",{"$f":"B17+1","v":59},"Has the permittee evaluated a full range of potential controls with respect to meeting water quality standards and protecting designated uses? (A full range should include zero overflow events per year, and averages of 1 to 3, 4 to 7, and 8 to 12 overflow events per year)",null,null,"i\nPage 115"]
["sm\nall",{"$f":"B18+1","v":60},"Does the LTCP describe the process by which the CSO control and alternatives combinations were developed?",null,null,"i\nPage 115"]
["sm\nall",61,"Does the LTCP describe the approach used to screen and narrow the list of CSO control technologies, and list the screening criteria?",null,null,"i\nPage 115"]
{"$rows_left_out":37}
{"sheet":"Implementation","index":5,"n_rows":39,"n_cols":7,"rows_kept":39,"cut":false,"hidden":false,"merged":[[35,2,35,6],[34,2,34,7],[1,2,1,6],[9,5,9,6],[10,2,10,6],[33,2,33,6]]}
["4. LTCP Implementation. This page includes questions about the LTCP implementation. Use the tab key to move through the page and the enter key to go to other pages when that page's button is selected."]
[null,null,"Long-Term Control Plan (LTCP) Review Checklist"]
["Button: Go to the Getting Started page"]
["Button: Go to the 1. Nine Minimum Controls page"]
["Button: Go to the 2. System Characterization page"]
["Button: Go to the 3. Alternatives Evaluation page"]
[]
["Button: Go to the 5. Addressed Items page"]
["Button: Go to the 6. Recommendations page"]
[null,null,"Answer the following questions regarding LTCP implementation.","Yes or No?","If Yes, note the specific document that was used to support this answer, including title, date, and version, as applicable. If No, what still needs to be done?","Helpful\nResources"]
["sm",null,"Selection of Controls and Implementation"]
["a\na","MC6","Major Question: Does the LTCP document a reasonable process for evaluating a range of controls and selecting a suite of CSO controls sufficient to meet water quality standards and designated and existing uses?",null,null,"i\nPage 98"]
["sm",null,"Long-Term Control Plan Approach"]
["sm\nall",{"$f":"Alternatives!B50+1","v":85},"Does the LTCP document benefits derived from implementation of the NMC?",null,null,"i\nPage 116"]
[null,null,"Selection and Development of Recommended Plan"]
["a\na",{"$f":"B14+1","v":86},"Does the LTCP document the controls selected for implementation, including detailed descriptions, preliminary engineering analysis, and cost estimates? If specific items are missing, list them in the notes section to the right.",null,null,"i\nPage 180"]
["a\na",{"$f":"B16+1","v":87},"Has the selected alternative been shown to be adequate, or reasonable to presume adequate, to provide for the attainment of applicable water quality standards and the protection of existing and designated uses?",null,null,"i\nPage 180"]
[null,null,"Financing Plan"]
["a\na",{"$f":"B17+1","v":88},"Does the LTCP recommend a financing approach demonstrating how the permittee will finance the alternative selected; identifying a specific capital and annual cost funding approach?",null,null,"i\nPage 182"]
["a\na",{"$f":"B19+1","v":89},"Did the permittee evaluate funding through increased sewer user fees and rate structures for residential, commercial and industrial  users?",null,null,"i\nPage 182"]
{"$rows_left_out":20}
{"sheet":"Rev. Sum.","index":6,"n_rows":135,"n_cols":8,"rows_kept":135,"cut":false,"hidden":false,"merged":[[66,2,66,6],[79,2,79,6],[77,2,77,6],[132,2,132,5],[12,4,12,6],[1,2,1,6],[131,2,131,6],[13,2,13,6],[113,2,113,5],[24,2,24,5],[78,2,78,5],[23,2,23,6],[107,2,107,6],[114,2,114,6],[112,2,112,6],[25,2,25,6],[52,2,52,6]]}
["5. Addressed Items. This page provides a summary of all items that were addressed within the LTCP, as well as the specific documentation that was used to support each item. Use the tab key to move through the page and the enter key to go to other pages when that page's button is selected. When prompted, press enter to see addressed items. This action will filter the full list of questions down to only those for which the reviewer answered \"yes\"."]
[null,null,"Long-Term Control Plan (LTCP) Review Checklist"]
["Button: Go to the Getting Started page"]
["Button: Go to the 1. Nine Minimum Controls page"]
["Button: Go to the 2. System Characterization page"]
["Button: Go to the 3. Alternatives Evaluation page"]
["Button: Go to the 4. LTCP Implementation page"]
[]
["Button: Go to the 6. Recommendations page"]
["Button: Press enter to see Addressed Items"]
[]
[]
[null,null,"Items identified by the reviewer as addressed and documented (i.e., questions were answered with a \"Yes\").","Documentation used to support the items to the left.","Helpful\nResources"]
["Yes",null,"Nine Minimum Controls"]
[{"$f":"VLOOKUP(B15,NMC!$B$12:$D$20,3,FALSE)","v":0},1,"1. Proper operation and regular maintenance programs for the sewer system and CSO outfalls",{"$f":"IF(ISBLANK(VLOOKUP(B15,NMC!B:E,4,FALSE)),\"\",VLOOKUP(B15,NMC!B:E,4,FALSE))","v":""},"i\nPage 18","i",null,"a\na"]
[{"$f":"VLOOKUP(B16,NMC!$B$12:$D$20,3,FALSE)","v":0},2,"2. Maximum use of the collection system for storage",{"$f":"IF(ISBLANK(VLOOKUP(B16,NMC!B:E,4,FALSE)),\"\",VLOOKUP(B16,NMC!B:E,4,FALSE))","v":""},"i\nPage 24","i",null,"a\na"]
[{"$f":"VLOOKUP(B17,NMC!$B$12:$D$20,3,FALSE)","v":0},3,"3. Review and modification of pretreatment requirements to ensure that CSO impacts are minimized",{"$f":"IF(ISBLANK(VLOOKUP(B17,NMC!B:E,4,FALSE)),\"\",VLOOKUP(B17,NMC!B:E,4,FALSE))","v":""},"i\nPage 28","i",null,"a\na"]
[{"$f":"VLOOKUP(B18,NMC!$B$12:$D$20,3,FALSE)","v":0},4,"4. Maximization of flow to the POTW",{"$f":"IF(ISBLANK(VLOOKUP(B18,NMC!B:E,4,FALSE)),\"\",VLOOKUP(B18,NMC!B:E,4,FALSE))","v":""},"i\nPage 32","i",null,"a\na"]
[{"$f":"VLOOKUP(B19,NMC!$B$12:$D$20,3,FALSE)","v":0},5,"5. Elimination of CSOs during dry weather",{"$f":"IF(ISBLANK(VLOOKUP(B19,NMC!B:E,4,FALSE)),\"\",VLOOKUP(B19,NMC!B:E,4,FALSE))","v":""},"i\nPage 35","i",null,"a\na"]
[{"$f":"VLOOKUP(B20,NMC!$B$12:$D$20,3,FALSE)","v":0},6,"6. Control of solid and floatable materials in CSOs",{"$f":"IF(ISBLANK(VLOOKUP(B20,NMC!B:E,4,FALSE)),\"\",VLOOKUP(B20,NMC!B:E,4,FALSE))","v":""},"i\nPage 40","i",null,"a\na"]
{"$rows_left_out":116}
{"sheet":"O. Items","index":7,"n_rows":134,"n_cols":8,"rows_kept":134,"cut":false,"hidden":false,"merged":[[51,2,51,6],[76,2,76,6],[111,2,111,6],[131,2,131,5],[12,4,12,6],[1,2,1,6],[130,2,130,6],[24,2,24,5],[77,2,77,5],[112,2,112,5],[23,2,23,6],[25,2,25,6],[13,2,13,6],[113,2,113,6],[106,2,106,6],[78,2,78,6],[65,2,65,6]]}
["6. Recommendations. This page includes a summary of all items that are missing or could be improved within the LTCP. Use the tab key to move through the page and the enter key to go to other pages when that page's button is selected. When prompted, press enter to see the recommendations. This action will filter the full list of questions down to only those for which the reviewer answered \"no\"."]
[null,null,"Long-Term Control Plan (LTCP) Review Checklist"]
["Button: Go to the Getting Started page"]
["Button: Go to the 1. Nine Minimum Controls page"]
["Button: Go to the 2. System Characterization page"]
["Button: Go to the 3. Alternatives Evaluation page"]
["Button: Go to the 4. LTCP Implementation page"]
["Button: Go to the 5. Addressed Items page"]
[]
["Button: Press enter to see Recommendations"]
[]
[]
[null,null,"List of recommendations to improve the LTCP. The recommendations are generated based on questions responded to with a \"No.\"","Additional notes provided here.","Helpful\nResources"]
["No",null,"Nine Minimum Controls",null,null,null,null,0]
[{"$f":"VLOOKUP(B15,NMC!$B$12:$D$20,3,FALSE)","v":0},1,"Document implementation of NMC 1: Proper operation and regular maintenance programs for the sewer system and CSO outfalls",{"$f":"IF(ISBLANK(VLOOKUP(B15,NMC!B:E,4,FALSE)),\"\",VLOOKUP(B15,NMC!B:E,4,FALSE))","v":""},"i\nPage 18","i",null,"a\na"]
[{"$f":"VLOOKUP(B16,NMC!$B$12:$D$20,3,FALSE)","v":0},2,"Document implementation of NMC 2: Maximum use of the collection system for storage",{"$f":"IF(ISBLANK(VLOOKUP(B16,NMC!B:E,4,FALSE)),\"\",VLOOKUP(B16,NMC!B:E,4,FALSE))","v":""},"i\nPage 24","i",null,"a\na"]
[{"$f":"VLOOKUP(B17,NMC!$B$12:$D$20,3,FALSE)","v":0},3,"Document implementation of NMC 3: Review and modification of pretreatment requirements to ensure that CSO impacts are minimized",{"$f":"IF(ISBLANK(VLOOKUP(B17,NMC!B:E,4,FALSE)),\"\",VLOOKUP(B17,NMC!B:E,4,FALSE))","v":""},"i\nPage 28","i",null,"a\na"]
[{"$f":"VLOOKUP(B18,NMC!$B$12:$D$20,3,FALSE)","v":0},4,"Document implementation of NMC 4: Maximization of flow to the POTW",{"$f":"IF(ISBLANK(VLOOKUP(B18,NMC!B:E,4,FALSE)),\"\",VLOOKUP(B18,NMC!B:E,4,FALSE))","v":""},"i\nPage 32","i",null,"a\na"]
[{"$f":"VLOOKUP(B19,NMC!$B$12:$D$20,3,FALSE)","v":0},5,"Document implementation of NMC 5: Elimination of CSOs during dry weather",{"$f":"IF(ISBLANK(VLOOKUP(B19,NMC!B:E,4,FALSE)),\"\",VLOOKUP(B19,NMC!B:E,4,FALSE))","v":""},"i\nPage 35","i",null,"a\na"]
[{"$f":"VLOOKUP(B20,NMC!$B$12:$D$20,3,FALSE)","v":0},6,"Document implementation of NMC 6: Control of solid and floatable materials in CSOs",{"$f":"IF(ISBLANK(VLOOKUP(B20,NMC!B:E,4,FALSE)),\"\",VLOOKUP(B20,NMC!B:E,4,FALSE))","v":""},"i\nPage 40","i",null,"a\na"]
{"$rows_left_out":115}
{"sheet":"Lists","index":8,"n_rows":50,"n_cols":10,"rows_kept":50,"cut":false,"hidden":true,"merged":[]}
[]
[]
[null,"blank, yes, no",null,null,null,null,"Who are you?"]
[]
[null,"Yes",null,null,null,null,"Small System Permittee or NPDES Authority"]
[null,"No",null,null,null,null,"Large System Permittee or NPDES Authority"]
[null,"NA"]
[]
[]
[]
[]
[null,null,null,null,null,null,null,"a","a","a"]
[null,null,null,null,null,null,null,"b","b","b"]
[null,null,null,null,null,null,null,"c","c","c"]
[null,null,null,null,null,null,null,"d","d","d"]
[null,null,null,null,null,null,null,"e","e","e"]
[null,null,null,null,null,null,null,"f","f","f"]
[null,null,null,null,null,null,null,"g","g","g"]
[null,null,null,null,null,null,null,"h","h","h"]
[null,null,null,null,null,null,null,"i","i","i"]
{"$rows_left_out":30}