{"text_format":"1","workbook":"xlsx","n_sheets":7,"sheets":["Introduction","Instructions","Develop PCCM","PCCM","Rev. Sum.","Recs","Lists"],"not_rendered":{"charts":0,"images":2,"macros":1,"external_links":0,"defined_names":14,"comments":0,"pivot_tables":0},"unopened":[],"bounds":{"document_bytes":16777216,"sheet_cells":100000,"rows_first":2000,"rows_last":500,"rows_between":2000,"halvings":0,"cell_chars":16384,"cell_head_chars":4096},"cells_cut":0,"cells_raw":0,"read":"whole","date_system":"1900"}

{"sheet":"Introduction","index":0,"n_rows":13,"n_cols":3,"rows_kept":13,"cut":false,"hidden":false,"merged":[[12,2,13,3],[7,2,7,5],[8,2,8,5],[10,2,10,5],[1,2,2,7],[4,2,4,5]]}
["Welcome to the post-construction compliance monitoring (PCCM) checklist! Use the tab key to navigate the checklist and the enter key to toggle navigation buttons. Stay here to listen to a description of the checklist.\n\nEPA created this checklist to help combined sewer overflow (CSO) permittees and National Pollutant Discharge Elimination System (NPDES) authorities develop and evaluate PCCM programs to meet the requirements of the CSO Control Policy. The checklist is based on existing EPA guidance such as the Post-Construction Compliance Monitoring Guidance. The checklist also provides a list of recommendations that can be used to improve the PCCM portion of a long-term control plan (LTCP). Due to the site-specific nature of CSOs and LTCPs, the checklist includes additional fields for the user to fully document their specific situation.\n\nClick the Microsoft Excel buttons or options to \"Enable Content\" or \"Enable Macros\" if prompted to, as the checklist uses macros to function. Press tab to continue.\n\n"]
[null,null,"Post-Construction Compliance Monitoring (PCCM) Checklist"]
["Disclaimer: The statements in this document are intended solely as suggestion. This document is not intended, nor can it be relied on, to create any rights enforceable by any party in litigation with the United States. Long-term CSO control plans are site-specific in nature. EPA, state officials and CSO permittees may decide to follow the suggestion provided in this document, or to act at variance with the suggestion, based on an analysis of site-specific circumstances."]
["Button: Get Started"]
[null,null,"Welcome to the post-construction compliance monitoring (PCCM) checklist! EPA created this checklist to help combined sewer overflow (CSO) permittees and National Pollutant Discharge Elimination System (NPDES) authorities develop and evaluate PCCM programs to meet the requirements of the CSO Control Policy. The checklist is based on existing EPA guidance such as the Post-Construction Compliance Monitoring Guidance. The checklist also provides a list of recommendations that can be used to improve the PCCM portion of long-term control plans (LTCPs). Due to the site-specific nature of CSOs and LTCPs, the checklist includes additional fields for the user to fully document their specific situation."]
[]
[]
[null,null,"Click on the \"Get Started\" button below to begin:"]
[null,null,"(If prompted by Microsoft Excel (there may be a yellow ribbon at the top of your screen) click the button to \"Enable Content\" or \"Enable Macros.\")"]
[]
[null,null,"Disclaimer: The statements in this document are intended solely as suggestions. This document is not intended, nor can it be relied on, to create any rights enforceable by any party in litigation with the United States. Long-term CSO control plans are site-specific in nature. EPA, state officials, and CSO permittees may decide to follow a suggestion provided in this document, or to act at variance with the suggestion, based on an analysis of site-specific circumstances."]
[]
[null,null,"https://www.epa.gov/npdes/contact-us-combined-sewer-overflows-csos "]

{"sheet":"Instructions","index":1,"n_rows":40,"n_cols":3,"rows_kept":40,"cut":false,"hidden":false,"merged":[[12,2,12,3],[13,2,13,8],[14,2,14,8],[15,2,15,8],[1,2,2,7],[17,2,17,8],[18,2,18,8],[19,2,19,8],[20,2,20,8],[21,2,21,8],[22,2,22,8],[35,2,35,4],[24,2,24,3],[31,2,31,6],[25,3,25,6],[26,3,26,6],[27,3,27,6],[28,3,28,6],[29,3,29,6]]}
["Welcome to the Getting Started page. On this page are instructions for how to use the checklist, as well as a navigation menu that can be used to navigate to other pages of the checklist at any time. The same navigation menu is available on all pages. Use the tab key to move through the page and the enter key to go to other pages when that page's button is selected."]
["Instructions:\n1. Fill out the User Information section that follows these instructions.\n2. After entering you User Information, toggle through the user options to select the approach that was used for the LTCP. Options include presumption approaches one through three, demonstration approach, separation approach or other. Selecting a specific option will bring you to a specific set of questions designed for that approach.\n3. If you are pursuing different approaches in different parts of your sewershed, use a separate copy of the checklist for each approach.\n4. Enter required information throughout the checklist where prompted. Note any relevant supporting documentation in the space provided after each question. Be sure to include details like title, date and version where applicable.\n5. Navigate to different pages using the tab key to toggle across navigation buttons.\n6. In many cases, helpful resources are identified for specific questions after data input cells. Click the links or use the description of the resource document and specific page number to access these helpful resources, which include sections from EPA's CSO Post-Construction Compliance Monitoring Guidance.\n7. Use the Additional Considerations cell at the bottom of each page to provide additional details specific to the PCCM under review.\n8. Once you answer all questions, go to the 3. Addressed Items page to see a summary of the documents reviewed as part of the PCCM review.\n9. Finally, go to the 4. Recommendations page to see a list of suggested improvements for the PCCM program.\n10. To clear all information and start over, click Control + r to reset the entire form or click individual page reset buttons that are at the end of each page.",null,"Post-Construction Compliance Monitoring (PCCM) Checklist"]
[]
["Button: Go to the 1. Developing a PCCM Plan page"]
["Button: Go to the 2. PCCM Implementation page"]
["Button: Go to the 3. Addressed Items page"]
["Button: Go to the 4. Recommendations page"]
["Button: Full Reset"]
["Button: Go back to the Introduction page"]
[]
[]
[]
[null,null,"Instructions:"]
[null,null,"1. Fill out the \"User Information\" section below."]
[null,null,"2. Click the appropriate button under \"Select your LTCP approach!\""]
[null,null,"3. If you are pursuing different approaches in different parts of your sewershed, use a separate copy of the checklist for each approach."]
[null,null,"4. Enter the required information in red cells throughout the checklist. Note the specific supporting documentation (include title, date, version)."]
[null,null,"5. Navigate to a different section using the tabs at the top of each page or the \"Next\" or \"Previous\" buttons at the bottom of each page."]
[null,null,"6. Click the i button to the right of each question to access helpful resources, including EPA's CSO Post-Construction Compliance Monitoring Guidance. Where applicable, a specific page is noted to point to a relevant section of the suggested guidance document."]
[null,null,"7. Use the \"Additional Considerations\" box at the bottom on each page to provide additional details specific to the PCCM program under review."]
{"$rows_left_out":21}
{"sheet":"Develop PCCM","index":2,"n_rows":85,"n_cols":9,"rows_kept":85,"cut":false,"hidden":false,"merged":[[81,2,81,6],[80,2,80,7],[1,2,1,7],[9,5,9,6],[10,2,10,6],[11,2,11,6],[79,2,79,6]]}
["1. Developing a PCCM Plan. This page includes questions about PCCM plan development. Use the tab key to move through the page and the enter key to go to other pages when that page's button is selected."]
[null,null,"Post-Construction Compliance Monitoring (PCCM) Checklist"]
["Button: Go to the Getting Started page"]
[]
["Button: Go to the 2. PCCM Implementation page"]
["Button: Go to the 3. Addressed Items page"]
["Button: Go to the 4. Recommendations page"]
[]
[]
["applies to","number","Answer the following questions regarding PCCM plan development.","Yes or No?","If Yes, note the specific document that was used to support this answer, including title, date, and version, as applicable. If No, what still needs to be done?","Helpful Resources",null,"Predication","Filter"]
["all",null,"Developing a PCCM Plan"]
["P, D, O",null,"General"]
["P, D, O",21,"Did the permittee monitor receiving water(s) to assess impacts under different CSO loads and conditions, discern background conditions and other sources, and demonstrate water quality standards attainment or the need for a total maximum daily load or a use attainability analysis?",null,null,"i\nChapter 8"]
["P, D, O",22,"Has the permittee developed quality assurance project plans that clearly describe, e.g., environmental data collection, quality objectives and key project personnel?",null,null,"i\nPage 29"]
["P, D, O",23,"Has the permittee developed plans for assessing the effectiveness of CSO controls as part of the PCCM plan?",null,null,"i\nPage 31"]
["P, D, O",24,"Has the permittee developed field sampling plans as part of the PCCM plan?",null,null,"i\nPage 35"]
["P, D, O","24b","Has the permittee developed a pre-construction sampling plan?"]
["P, D, O",25,"Did the permittee develop the PCCM field sampling plan based on the pre-construction sampling plan?",null,null,null,null,12]
["P, D, O",26,"Does the permittee use the same field sampling locations identified during pre-construction monitoring and modeling?",null,null,null,null,13]
["P, D, O",27,"Does the permittee address the sensitive areas identified during pre-construction monitoring and modeling?",null,null,null,null,"15h"]
{"$rows_left_out":66}
{"sheet":"PCCM","index":3,"n_rows":90,"n_cols":9,"rows_kept":90,"cut":false,"hidden":false,"merged":[[85,2,85,8],[1,2,1,7],[9,5,9,6],[84,2,84,6],[86,2,86,6],[10,2,10,6]]}
["2. PCCM Implementation. This page includes questions about PCCM Implementation. Use the tab key to move through the page and the enter key to go to other pages when that page's button is selected."]
[null,null,"Post-Construction Compliance Monitoring (PCCM) Checklist"]
["Button: Go to the Getting Started page"]
["Button: Go to the 1. Developing a PCCM Plan page"]
[]
["Button: Go to the 3. Addressed Items page"]
["Button: Go to the 4. Recommendations page"]
[]
[]
["applies to","number","Answer the following questions regarding PCCM implementation.","Yes or No?","If Yes, note the specific document that was used to support this answer, including title, date, and version, as applicable. If No, what still needs to be done?","Helpful Resources",null,"Predication","Filter"]
["all",null,"PCCM Implementation"]
["all",null,"Monitoring to Verify the Effectiveness of CSO Controls (4.1)",null,null,"i"]
["PC1",67,"Are the overflow data presented so that they can be evaluated on an average annual basis?",null,null,"i\nPage 43"]
["PC1",68,"Does the permittee provide data on the number of overflows from the CSS that meet the overflow definition provided in the CSO Control Policy?",null,null,"i\nPage 43"]
["PC1",69,"Has the permittee developed a plan that summarizes:"]
["PC1","69a","What method or combination of methods they will use to determine if CSO discharges have occurred in the CSS?",null,null,"i\nPage 44"]
["PC1","69b","Which CSOs they will monitor within the system?",null,null,"i\nPage 44"]
["PC1","69c","When and how often they will monitor them?",null,null,"i\nPage 44"]
["PC1","69d","What type of data they will collect from an event?",null,null,"i\nPage 44"]
["PC1","69e","How that data should be used to determine if a CSO event has occurred?",null,null,"i\nPage 44"]
{"$rows_left_out":71}
{"sheet":"Rev. Sum.","index":4,"n_rows":150,"n_cols":9,"rows_kept":150,"cut":false,"hidden":false,"merged":[[146,2,146,5],[147,2,147,5],[76,2,76,5],[1,2,1,6],[11,4,11,5],[12,2,12,5],[75,2,75,5],[77,2,77,5]]}
["a"]
[null,null,"Post-Construction Compliance Monitoring (PCCM) Checklist"]
["Button: Go to the Getting Started page"]
["Button: Go to the 1. Developing a PCCM Plan page"]
["Button: Go to the 2. PCCM Implementation page"]
[]
["Button: Go to the 6. Recommendations page"]
["Button: Press enter to see Addressed Items"]
[]
[]
[]
["addressed?",null,"Items identified by the reviewer as addressed and documented (i.e., questions were answered with a \"Yes\").","Documentation used to support the items to the left.","Helpful Resources",null,"dependency","scenario filter","question filter"]
["Yes",null,"Developing a PCCM Plan"]
[{"$f":"VLOOKUP(B14,'Develop PCCM'!B:I,3,FALSE)","v":0},21,"Did the permittee monitor receiving water(s) to assess impacts under different CSO loads and conditions, discern background conditions and other sources, and demonstrate water quality standards attainment or the need for a total maximum daily load or a use attainability analysis?",{"$f":"IF(ISBLANK(VLOOKUP(B14,'Develop PCCM'!B:H,4,FALSE)),\"\",VLOOKUP(B14,'Develop PCCM'!B:H,4,FALSE))","v":""},"i\nChapter 8",null,null,{"$f":"_xlfn.XLOOKUP(B14,'Develop PCCM'!$B$11:$B$79,'Develop PCCM'!$A$11:$A$79)","v":"P, D, O"}]
[{"$f":"VLOOKUP(B15,'Develop PCCM'!B:I,3,FALSE)","v":0},22,"Has the permittee developed quality assurance project plans as part of the PCCM plan?",{"$f":"IF(ISBLANK(VLOOKUP(B15,'Develop PCCM'!B:H,4,FALSE)),\"\",VLOOKUP(B15,'Develop PCCM'!B:H,4,FALSE))","v":""},"i\nPage 29",null,null,{"$f":"_xlfn.XLOOKUP(B15,'Develop PCCM'!$B$11:$B$79,'Develop PCCM'!$A$11:$A$79)","v":"P, D, O"}]
[{"$f":"VLOOKUP(B16,'Develop PCCM'!B:I,3,FALSE)","v":0},23,"Has the permittee developed plans for assessing the effectiveness of CSO controls as part of the PCCM plan?",{"$f":"IF(ISBLANK(VLOOKUP(B16,'Develop PCCM'!B:H,4,FALSE)),\"\",VLOOKUP(B16,'Develop PCCM'!B:H,4,FALSE))","v":""},"i\nPage 31",null,null,{"$f":"_xlfn.XLOOKUP(B16,'Develop PCCM'!$B$11:$B$79,'Develop PCCM'!$A$11:$A$79)","v":"P, D, O"}]
[{"$f":"VLOOKUP(B17,'Develop PCCM'!B:I,3,FALSE)","v":0},24,"Has the permittee developed field sampling plans as part of the PCCM plan?",{"$f":"IF(ISBLANK(VLOOKUP(B17,'Develop PCCM'!B:H,4,FALSE)),\"\",VLOOKUP(B17,'Develop PCCM'!B:H,4,FALSE))","v":""},"i\nPage 35",null,null,{"$f":"_xlfn.XLOOKUP(B17,'Develop PCCM'!$B$11:$B$79,'Develop PCCM'!$A$11:$A$79)","v":"P, D, O"}]
[{"$f":"VLOOKUP(B18,'Develop PCCM'!B:I,3,FALSE)","v":0},"24b","Has the permittee developed a pre-construction sampling plan?",{"$f":"IF(ISBLANK(VLOOKUP(B18,'Develop PCCM'!B:H,4,FALSE)),\"\",VLOOKUP(B18,'Develop PCCM'!B:H,4,FALSE))","v":""},null,null,null,{"$f":"_xlfn.XLOOKUP(B18,'Develop PCCM'!$B$11:$B$79,'Develop PCCM'!$A$11:$A$79)","v":"P, D, O"}]
[{"$f":"VLOOKUP(B19,'Develop PCCM'!B:I,3,FALSE)","v":0},25,"Did the permittee develop the PCCM field sampling plan based on the pre-construction sampling plan?",{"$f":"IF(ISBLANK(VLOOKUP(B19,'Develop PCCM'!B:H,4,FALSE)),\"\",VLOOKUP(B19,'Develop PCCM'!B:H,4,FALSE))","v":""},null,null,null,{"$f":"_xlfn.XLOOKUP(B19,'Develop PCCM'!$B$11:$B$79,'Develop PCCM'!$A$11:$A$79)","v":"P, D, O"}]
[{"$f":"VLOOKUP(B20,'Develop PCCM'!B:I,3,FALSE)","v":0},26,"Does the permittee use the same field sampling locations identified during pre-construction monitoring and modeling?",{"$f":"IF(ISBLANK(VLOOKUP(B20,'Develop PCCM'!B:H,4,FALSE)),\"\",VLOOKUP(B20,'Develop PCCM'!B:H,4,FALSE))","v":""},null,null,null,{"$f":"_xlfn.XLOOKUP(B20,'Develop PCCM'!$B$11:$B$79,'Develop PCCM'!$A$11:$A$79)","v":"P, D, O"}]
{"$rows_left_out":131}
{"sheet":"Recs","index":5,"n_rows":142,"n_cols":9,"rows_kept":142,"cut":false,"hidden":false,"merged":[[1,2,1,6],[11,4,11,5],[12,2,12,5],[139,2,139,5],[140,2,140,5],[73,2,73,5],[72,2,72,5],[74,2,74,5]]}
["4. Recommendations. This page includes a summary of all items that are missing or could be improved within the LTCP. Use the tab key to move through the page and the enter key to go to other pages when that page's button is selected. When prompted, press enter to see the recommendations. This action will filter the full list of questions down to only those for which the reviewer answered \"no\"."]
[null,null,"Post-Construction Compliance Monitoring (PCCM) Checklist"]
["Button: Go to the Getting Started page"]
["Button: Go to the 1. Developing a PCCM Plan page"]
["Button: Go to the 2. PCCM Implementation page"]
["Button: Go to the 3. Addressed Items page"]
[]
["Button: Press enter to see Recommendations"]
[]
[]
[]
["addressed?",null,"List of recommendations to improve PCCM. The recommendations are generated based on questions responded to with a \"No.\"","Additional notes provided here.","Helpful Resources",null,"dependency","scenario filter","question filter"]
["No",null,"Developing a PCCM Plan"]
[{"$f":"VLOOKUP(B14,'Develop PCCM'!B:H,3,FALSE)","v":0},21,"Monitor receiving water(s) to assess impacts under different CSO loads and conditions, discern background conditions and other sources, and demonstrate water quality standards attainment or the need for a total maximum daily load or use attainability analysis.",{"$f":"IF(ISBLANK(VLOOKUP(B14,'Develop PCCM'!B:H,4,FALSE)),\"\",VLOOKUP(B14,'Develop PCCM'!B:H,4,FALSE))","v":""},"i\nChapter 8",null,null,{"$f":"_xlfn.XLOOKUP(B14,'Develop PCCM'!$B$11:$B$79,'Develop PCCM'!$A$11:$A$79)","v":"P, D, O"}]
[{"$f":"VLOOKUP(B15,'Develop PCCM'!B:H,3,FALSE)","v":0},22,"Use EPA's Quality Assurance Project Plan guidance and all applicable state or local guidance to develop a Quality Assurance Project Plan for PCCM. ",{"$f":"IF(ISBLANK(VLOOKUP(B15,'Develop PCCM'!B:H,4,FALSE)),\"\",VLOOKUP(B15,'Develop PCCM'!B:H,4,FALSE))","v":""},"i\nPage 29",null,null,{"$f":"_xlfn.XLOOKUP(B15,'Develop PCCM'!$B$11:$B$79,'Develop PCCM'!$A$11:$A$79)","v":"P, D, O"}]
[{"$f":"VLOOKUP(B16,'Develop PCCM'!B:H,3,FALSE)","v":0},23,"Develop a CSO control assessment plan that includes a discussion of the basic approach selected by the permittee in the LTCP to verify the effectiveness of CSO controls. In addition, the CSO control assessment plan should be submitted to the NPDES authority for review and approval before implementation.",{"$f":"IF(ISBLANK(VLOOKUP(B16,'Develop PCCM'!B:H,4,FALSE)),\"\",VLOOKUP(B16,'Develop PCCM'!B:H,4,FALSE))","v":""},"i\nPage 31",null,null,{"$f":"_xlfn.XLOOKUP(B16,'Develop PCCM'!$B$11:$B$79,'Develop PCCM'!$A$11:$A$79)","v":"P, D, O"}]
[{"$f":"VLOOKUP(B17,'Develop PCCM'!B:H,3,FALSE)","v":0},24,"Develop a field sampling plan that documents duration of monitoring program, monitoring locations, frequency of sampling, number of event samples, parameters analyzed, sampling protocols, equipment used, and analytical methods.",{"$f":"IF(ISBLANK(VLOOKUP(B17,'Develop PCCM'!B:H,4,FALSE)),\"\",VLOOKUP(B17,'Develop PCCM'!B:H,4,FALSE))","v":""},"i\nPage 35",null,null,{"$f":"_xlfn.XLOOKUP(B17,'Develop PCCM'!$B$11:$B$79,'Develop PCCM'!$A$11:$A$79)","v":"P, D, O"}]
[{"$f":"VLOOKUP(B18,'Develop PCCM'!B:H,3,FALSE)","v":0},"24b","Consider developing a pre-construction sampling plan.",{"$f":"IF(ISBLANK(VLOOKUP(B18,'Develop PCCM'!B:H,4,FALSE)),\"\",VLOOKUP(B18,'Develop PCCM'!B:H,4,FALSE))","v":""},null,null,null,{"$f":"_xlfn.XLOOKUP(B18,'Develop PCCM'!$B$11:$B$79,'Develop PCCM'!$A$11:$A$79)","v":"P, D, O"}]
[{"$f":"VLOOKUP(B19,'Develop PCCM'!B:H,3,FALSE)","v":0},25,"Consider developing the PCCM sampling plan based on the pre-construction sampling plan. ",{"$f":"IF(ISBLANK(VLOOKUP(B19,'Develop PCCM'!B:H,4,FALSE)),\"\",VLOOKUP(B19,'Develop PCCM'!B:H,4,FALSE))","v":""},null,null,12,{"$f":"_xlfn.XLOOKUP(B19,'Develop PCCM'!$B$11:$B$79,'Develop PCCM'!$A$11:$A$79)","v":"P, D, O"}]
[{"$f":"VLOOKUP(B20,'Develop PCCM'!B:H,3,FALSE)","v":0},26,"Use the same field sampling locations identified during pre-construction monitoring and modeling.",{"$f":"IF(ISBLANK(VLOOKUP(B20,'Develop PCCM'!B:H,4,FALSE)),\"\",VLOOKUP(B20,'Develop PCCM'!B:H,4,FALSE))","v":""},null,null,13,{"$f":"_xlfn.XLOOKUP(B20,'Develop PCCM'!$B$11:$B$79,'Develop PCCM'!$A$11:$A$79)","v":"P, D, O"}]
{"$rows_left_out":123}
{"sheet":"Lists","index":6,"n_rows":50,"n_cols":10,"rows_kept":50,"cut":false,"hidden":true,"merged":[]}
[]
[]
[null,"blank, yes, no"]
[]
[null,"Yes"]
[null,"No"]
[]
[]
[]
[]
[]
[null,null,null,null,null,null,null,"a","a","a"]
[null,null,null,null,null,null,null,"b","b","b"]
[null,null,null,null,null,null,null,"c","c","c"]
[null,null,null,null,null,null,null,"d","d","d"]
[null,null,null,null,null,null,null,"e","e","e"]
[null,null,null,null,null,null,null,"f","f","f"]
[null,null,null,null,null,null,null,"g","g","g"]
[null,null,null,null,null,null,null,"h","h","h"]
[null,null,null,null,null,null,null,"i","i","i"]
{"$rows_left_out":30}