{"text_format":"1","workbook":"xlsx","n_sheets":19,"sheets":["Title Page","Index","Standard Inputs","INPUT","OUTPUT","Critical Design Assumptions","O&M Assumptions","Indirect Assumptions","Chemical Use","Pumps Pipe Structure","Instrumentation and Control","O&M","HVAC","Indirect","Cost Equations","Cost Coefficients","Cost Data","Engineering Data","Lookup Tables"],"not_rendered":{"charts":0,"images":0,"macros":1,"external_links":4,"defined_names":515,"comments":10,"pivot_tables":0},"unopened":[],"bounds":{"document_bytes":16777216,"sheet_cells":100000,"rows_first":2000,"rows_last":500,"rows_between":2000,"halvings":0,"cell_chars":16384,"cell_head_chars":4096},"cells_cut":0,"cells_raw":0,"read":"whole","date_system":"1900"}

{"sheet":"Title Page","index":0,"n_rows":15,"n_cols":1,"rows_kept":15,"cut":false,"hidden":false,"merged":[]}
["U.S. EPA Office of Ground Water and Drinking Water"]
["Work Breakdown Structure (WBS) Model for Caustic Feed Treatment"]
["Release Date: March 2023"]
["· The primary purpose of this model is to assist EPA in estimating national compliance costs."]
["· As such, the costs are intended to be representative of the central tendency of typical facilities."]
["· The default settings, however, do not account for all of the site-specific factors that could affect the cost of any given individual facility or project."]
["· Still, other uses of the model might be reasonable if sufficient care is taken by the user to account for site- or project-specific factors."]
["· The model results are point estimates shown to the nearest $1, but this precision is not meant to imply that the results are accurate to $1."]
["· Instead, users should review all documentation, modify inputs/assumptions as appropriate to their specific purpose, and form their own informed opinions about the accuracy and suitability of the results."]
["· Use of this model requires Excel 2007 or later."]
{"$rows_left_out":6}
{"sheet":"Index","index":1,"n_rows":121,"n_cols":2,"rows_kept":121,"cut":false,"hidden":false,"merged":[]}
["INDEX"]
["This page provides an index to all user-adjustable inputs and assumptions.  Click on a variable name to go directly to the adjustable cells."]
[]
["User-adjustable Input or Assumption","Variable Name and Link"]
["Access space for containerized storage","space_containers"]
["Additional freeboard","sec_cont_freeboard"]
["Air conditioner","cooling"]
["Amount of sodium hydroxide","naoh_yr"]
["Annual Administrative LOE","Clerical_LOE"]
["Annual Manager LOE","Manager_LOE"]
{"$rows_left_out":112}
{"sheet":"Standard Inputs","index":2,"n_rows":51,"n_cols":26,"rows_kept":51,"cut":false,"hidden":false,"merged":[[5,2,5,5],[5,18,5,22],[5,0,5,1],[5,6,5,14],[5,15,5,17]]}
["Standard Designs"]
["Default inputs represent typical options used to generate national average compliance costs."]
[]
[]
[]
["Design Index",null,"System Size",null,null,null,"Dosage",null,null,null,null,null,null,null,null,"Equipment",null,null,"Optional"]
["Scenario","Design #","Design flow","Design Flow Units","Average Flow","Average flow units","Calculation method","Sodium hydroxide dose","Influent water pH","Desired treated water pH","Influent alkalinity","Influent TDS","Influent Temperature","Sodium hydroxide weight percent","Unit price of sodium hydroxide (optional)","Chemical storage configuration","Include heat tracing and insulation","Include inline static mixer?","Component level","System Automation","Include Buildings?","Include HVAC?","Include Land?",null,"Match?","Flow match?"]
[null,null,"design_flow_I","df_units","average_flow_I","af_units","calc_type","dose_I","pH_I","pH_f","alk_I","TDS_I","t_I","NaOH_pct","NaOH_price_override","storage_type","include_insul","include_mixer","component_level_I","manual_I","include_buildings_I","Include_HVAC_I","Include_Land_I"]
[1,1,0.03,"MGD",7.0000000000000001E-3,"MGD","calculate based on pH",null,6.5,7.5,20,200,10,0.25,null,"55 gallon drums",null,"yes",null,"fully automated",null,"no",null,null,{"$f":"AND(C9:W9=inp_used,A9=inp_used_usersel)","v":true},{"$f":"AND(C9:F9=inp_used_minimal,A9=inp_used_usersel)","v":true}]
[1,2,0.124,"MGD",3.5000000000000003E-2,"MGD","calculate based on pH",null,6.5,7.5,20,200,10,0.25,null,"55 gallon drums",null,"yes",null,"fully automated",null,"no",null,null,{"$f":"AND(C10:W10=inp_used,A10=inp_used_usersel)","v":false},{"$f":"AND(C10:F10=inp_used_minimal,A10=inp_used_usersel)","v":false}]
{"$rows_left_out":42}
{"sheet":"INPUT","index":3,"n_rows":61,"n_cols":9,"rows_kept":61,"cut":false,"hidden":false,"merged":[[15,6,16,7]]}
["SODIUM HYDROXIDE FEED SYSTEM DESIGN AND COST INPUT"]
[]
[null,null,null,null,"STEP 1"]
[null,null,null,null,"Select Scenario",null,null,null,{"$f":"IF(scenario<>5,\"The scenarios are for EPA's use in estimating national costs, but other users might find them useful as a starting point. See documentation for more information\",\"Under the user-defined scenario, the buttons shown in Step 2 will enter flows only, and clear all other inputs. Advanced users can change this behavior by entering inputs on the Standard Inputs sheet\")","v":"The scenarios are for EPA's use in estimating national costs, but other users might find them useful as a starting point. See documentation for more information"}]
[]
[null,null,null,null,"STEP 2:",null,null,{"$f":"IF(OR('Standard Inputs'!Y9,'Standard Inputs'!Y17,'Standard Inputs'!Y25,'Standard Inputs'!Y33,'Standard Inputs'!Y41),\"<- Using this design\",IF(OR('Standard Inputs'!Z9,'Standard Inputs'!Z17,'Standard Inputs'!Z25,'Standard Inputs'!Z33,'Standard Inputs'!Z41),\"<- You modified this design\",\"\"))","v":"<- Using this design"},"The standard design buttons are for EPA's use in estimating national costs, but other users might find them useful as a starting point. See documentation for more information"]
[null,null,null,null,"Select one of the eight standard designs at right OR select \"CLEAR FOR MANUAL ENTRY\"",null,null,{"$f":"IF(OR('Standard Inputs'!Y10,'Standard Inputs'!Y18,'Standard Inputs'!Y26,'Standard Inputs'!Y34,'Standard Inputs'!Y42),\"<- Using this design\",IF(OR('Standard Inputs'!Z10,'Standard Inputs'!Z18,'Standard Inputs'!Z26,'Standard Inputs'!Z34,'Standard Inputs'!Z42),\"<- You modified this design\",\"\"))","v":""}]
[null,null,null,null,null,null,null,{"$f":"IF(OR('Standard Inputs'!Y11,'Standard Inputs'!Y19,'Standard Inputs'!Y27,'Standard Inputs'!Y35,'Standard Inputs'!Y43),\"<- Using this design\",IF(OR('Standard Inputs'!Z11,'Standard Inputs'!Z19,'Standard Inputs'!Z27,'Standard Inputs'!Z35,'Standard Inputs'!Z43),\"<- You modified this design\",\"\"))","v":""}]
[null,null,null,null,null,null,null,{"$f":"IF(OR('Standard Inputs'!Y12,'Standard Inputs'!Y20,'Standard Inputs'!Y28,'Standard Inputs'!Y36,'Standard Inputs'!Y44),\"<- Using this design\",IF(OR('Standard Inputs'!Z12,'Standard Inputs'!Z20,'Standard Inputs'!Z28,'Standard Inputs'!Z36,'Standard Inputs'!Z44),\"<- You modified this design\",\"\"))","v":""}]
[null,null,null,null,null,null,null,{"$f":"IF(OR('Standard Inputs'!Y13,'Standard Inputs'!Y21,'Standard Inputs'!Y29,'Standard Inputs'!Y37,'Standard Inputs'!Y45),\"<- Using this design\",IF(OR('Standard Inputs'!Z13,'Standard Inputs'!Z21,'Standard Inputs'!Z29,'Standard Inputs'!Z37,'Standard Inputs'!Z45),\"<- You modified this design\",\"\"))","v":""}]
{"$rows_left_out":52}
{"sheet":"OUTPUT","index":4,"n_rows":223,"n_cols":25,"rows_kept":223,"cut":false,"hidden":false,"merged":[[24,12,26,12],[24,13,24,21],[24,22,25,23],[25,13,25,15],[25,16,25,18],[25,19,25,21],[159,2,159,3],[24,0,26,0],[24,1,26,1],[24,2,26,3],[24,4,26,5],[24,6,26,7],[163,8,163,11],[24,11,26,11],[24,8,26,8],[24,9,26,9],[24,10,26,10]]}
["OUTPUT SUMMARY"]
[null,"Parameter","Value","Units"]
[null,"Technology","Caustic Feed"]
[null,"System Size Category",{"$f":"IF(design_flow<1,\"small\",\"large\")","v":"small"}]
[null,"Design Flow",{"$f":"design_flow_I","v":0.03},{"$f":"df_units","v":"MGD"}]
[null,"Average Flow",{"$f":"average_flow_I","v":7.0000000000000001E-3},{"$f":"af_units","v":"MGD"}]
[null,{"$f":"IF(calc_type=\"manual entry\",\"\",\"Treated water pH\")","v":"Treated water pH"},{"$f":"IF(calc_type=\"manual entry\",\"\",pH_i)","v":6.5},{"$f":"IF(calc_type=\"manual entry\",\"\",\"SU\")","v":"SU"}]
[null,{"$f":"IF(calc_type=\"manual entry\",\"\",\"Desired treated water pH\")","v":"Desired treated water pH"},{"$f":"IF(calc_type=\"manual entry\",\"\",pH_f)","v":7.5},{"$f":"IF(calc_type=\"manual entry\",\"\",\"SU\")","v":"SU"}]
[null,{"$f":"IF(calc_type=\"manual entry\",\"\",\"Influent water alkalinity\")","v":"Influent water alkalinity"},{"$f":"IF(calc_type=\"manual entry\",\"\",alk_I)","v":20},"mg/L as CaCO3"]
[null,"Sodium hydroxide dose",{"$f":"NaOH_tot","v":11.707444517276793},"mg/L"]
{"$rows_left_out":214}
{"sheet":"Critical Design Assumptions","index":5,"n_rows":84,"n_cols":7,"rows_kept":84,"cut":false,"hidden":false,"merged":[]}
["Default Critical Design Assumptions"]
["Users may change any of the cells in the Value column; cells in gold are most important and may vary based on contaminant treated and site-specific conditions"]
[]
["Assumption","Range Name","Value","Units","Guidance"]
["Cost estimating method","curve",1,"<-- enter 1 to use cost equations, leave blank to use lookup tables for component costs","Keeping this assumption with a value of 1 is strongly recommended; the cost equations method is more appropriate for national cost estimating and will be more accurate for nearly all user-specified designs"]
["Minimum average flow as percentage of design","min_avg_flow",0.1,null,"The minimum ratio of average flow to design flow. If the ratio falls below this value, it will trigger a warning on the INPUT sheet. If this value is zero, no minimum is enforced."]
[]
["Pumping"]
["Safety factor for pumps","pump_safety_factor",0.25]
["Redundant pumps for caustic metering","NRD_pump_chem_caustic",1,"pump"]
{"$rows_left_out":75}
{"sheet":"O&M Assumptions","index":6,"n_rows":48,"n_cols":5,"rows_kept":48,"cut":false,"hidden":false,"merged":[]}
["Default O&M Assumptions"]
["Users may change any of the cells in the Value column"]
[]
["Assumption","Range Name","Value","Units","Guidance"]
["Labor"]
["Managerial LOE as a percent of average technical labor ","Manager_percent",0.1,"fraction"]
["Administrative LOE as a percent of average technical labor ","Clerical_percent",0.1,"fraction"]
[]
["Operating LOE assumptions"]
["Minutes per instrument per day","uloe_inst",5,"min/day","For manual systems only"]
{"$rows_left_out":39}
{"sheet":"Indirect Assumptions","index":7,"n_rows":83,"n_cols":5,"rows_kept":83,"cut":false,"hidden":false,"merged":[[61,1,62,1],[61,0,62,0],[73,0,74,0],[73,1,74,1]]}
["Default Assumptions for Indirect and Add-On Costs"]
["Users may change any of the cells in the Value column"]
[]
["Assumption","Range Name","Value","Units","Guidance"]
["Permits"]
["Include permit costs?","include_permits",1,"<--- enter 1 for yes, 0 for no"]
[]
["Mobilization and Demobilization"]
["Mobilization percentage for small systems","mob_pct_small",0.05,"of direct capital cost","Typically 2-5% of the estimated construction cost.  Enter 0% to exclude."]
["Mobilization percentage for medium systems","mob_pct_medium",0.04,"of direct capital cost"]
{"$rows_left_out":74}
{"sheet":"Chemical Use","index":8,"n_rows":111,"n_cols":5,"rows_kept":111,"cut":false,"hidden":false,"merged":[]}
["Chemical Use Calculations"]
[]
["Calculation","Range Name","Value","Units","Guidance"]
["From Inputs"]
["Treatment Scenario","scenario",1]
["Design Flow","design_flow",{"$f":"IF(df_units=\"gpm\",design_flow_I*24*60/1000000,design_flow_I)","v":0.03},"MGD"]
["Average Flow","average_flow",{"$f":"IF(af_units=\"gpm\",average_flow_I*24*60/1000000,IF(af_units=\"fraction of design flow\",average_flow_I*design_flow,average_flow_I))","v":7.0000000000000001E-3},"MGD"]
["Design Flow Rate","design_flow_rate",{"$f":"design_flow*1000000/(24*60)","v":20.833333333333332},"gpm","Design flow expressed in gpm"]
["Average Flow Rate","average_flow_rate",{"$f":"average_flow*1000000/(24*60)","v":4.8611111111111107},"gpm","Average flow expressed in gpm"]
["Storage type (code number)","storage_type_num",{"$f":"VLOOKUP(storage_type,storage_type_table,2,FALSE)","v":1},"1 = drums, 2 = totes, 3 = storage tanks only, 4 = storage tanks and day tanks"]
{"$rows_left_out":102}
{"sheet":"Pumps Pipe Structure","index":9,"n_rows":44,"n_cols":5,"rows_kept":44,"cut":false,"hidden":false,"merged":[]}
["Pumps, Piping, and Structure Calculations"]
[]
["Calculation","Range Name","Value","Units","Guidance"]
["Pump Design"]
["Total caustic metering flow needed","cm_pump_flow_total",{"$f":"MAX(min_chem_flow,des_NaOH_flow*(1+pump_safety_factor))","v":0.13},"gph","Includes safety factor"]
["Maximum chemical metering pump size","max_cm_pump_size",{"$f":"MAX(VLOOKUP(10^6,ss_empump_cost_cl,1)-0.01,VLOOKUP(10^6,ss_mmpump_cost_cl,1)-0.01,VLOOKUP(10^6,pvc_empump_cost_cl,1)-0.01,VLOOKUP(10^6,pvc_mmpump_cost_cl,1)-0.01)","v":132},"gph","The largest size for which costs are available."]
["Number of caustic metering pumps","pump_chem_caustic",{"$f":"ROUNDUP(cm_pump_flow_total/max_cm_pump_size,0)+NRD_pump_chem_caustic","v":2},"pumps","Multiple pumps used if total flow is very high, includes redundant pumps"]
["Caustic metering pump rating","cm_pump_rating",{"$f":"cm_pump_flow_total/(pump_chem_caustic-NRD_pump_chem_caustic)","v":0.13},"gph"]
[]
["Total transfer pump flow needed","xfer_pump_flow_total",{"$f":"IF(OR(day_tanks=0,xfer_pump_approach=0),0,day_tank_vol/xfer_pump_time*(1+pump_safety_factor))","v":0},"gph","Includes safety factor"]
{"$rows_left_out":35}
{"sheet":"Instrumentation and Control","index":10,"n_rows":30,"n_cols":5,"rows_kept":30,"cut":false,"hidden":false,"merged":[]}
["Instrumentation and Control Calculations"]
[]
["Calculation","Range Name","Value","Units","Guidance"]
["From Inputs"]
["Component level","component_level",{"$f":"IF(component_level_I=\"high cost\",2,IF(component_level_I=\"mid cost\",1,\"\"))","v":""},"blank = low cost, 1 = mid cost, 2 = high cost"]
["Manual system controls","manual",{"$f":"IF(manual_I=\"manual\",1,IF(manual_I=\"semi-automated\",2,IF(manual_I=\"fully automated\",3,IF(component_level=\"\",1,IF(component_level=2,3,CHOOSE(ss_cat2,1,3,3))))))","v":3},"1 = fully manual system, 2 = semi-automated system, 3 = fully automated system.","Based on system size and component level (see cell comment), unless user overrides on input sheet"]
[]
["Valves and Instrumentation"]
["Size of valves for caustic pipe lines","caustic_valve_size",{"$f":"caustic_pipe_diam","v":0.5},"inches"]
[]
{"$rows_left_out":21}
{"sheet":"O&M","index":11,"n_rows":54,"n_cols":5,"rows_kept":54,"cut":false,"hidden":false,"merged":[]}
["Operation and Maintenance Calculations"]
[]
["Calculation","Range Name","Value","Units","Guidance"]
["Materials"]
["Chemicals "]
["Amount of sodium hydroxide","naoh_yr",{"$f":"NaOH_lbs/cstore_days*365","v":1046.3333333333333},"lb/yr"]
[]
["Labor"]
["General Labor"]
["Number of process instruments","tot_inst",{"$f":"pH_controls","v":2},null,"Instruments requiring daily observation"]
{"$rows_left_out":45}
{"sheet":"HVAC","index":12,"n_rows":80,"n_cols":12,"rows_kept":80,"cut":false,"hidden":false,"merged":[[52,1,52,4]]}
["Building Heating, Ventilating, and Air Conditioning Calculations"]
[]
["Calculation","Range Name","Value","Units","Guidance"]
["General information"]
["System size","ss_cat2",{"$f":"IF(design_flow<1,1,IF(design_flow<10,2,3))","v":1},"1 indicates small system, 2 indicates medium, 3 indicates large","ss_cat2 is used to select ventilation requirements and building type"]
["Building height","Building_height",{"$f":"MAX(min_building_height, (2* ct_diam) + ceiling_clearance)","v":10},"ft"]
["Buiding 1 length and width","build1_side",{"$f":"build1_fp^0.5","v":7.0710678118654755},"ft"]
["Include HVAC?","include_HVAC",{"$f":"IF(include_HVAC_I=\"no\",0,IF(include_HVAC_I=\"yes\",1,2))","v":0}," 0 = always exclude, 1 = always include, 2 = use model default"]
[]
["Ventilation"]
{"$rows_left_out":71}
{"sheet":"Indirect","index":13,"n_rows":26,"n_cols":5,"rows_kept":26,"cut":false,"hidden":false,"merged":[]}
["Indirect and Add-on Cost Calculations"]
[]
["Calculation","Range Name","Value","Units","Guidance"]
["Buildings and Land"]
["Include buildings?","include_buildings",{"$f":"IF(include_buildings_I=\"no\",0,1)","v":1},"1 = yes, 0 = no"]
["Include land?","include_land",{"$f":"IF(include_land_I=\"no\",0,1)","v":1},"1 = yes, 0 = no"]
[]
["Sitework"]
["Total technology footprint","tech_fp",{"$f":"total_fp","v":50},"square feet"]
["Total sitework cost","sitework_cost",{"$f":"tech_fp*sitework_sf_cl","v":759.56043956043948}]
{"$rows_left_out":17}
{"sheet":"Cost Equations","index":14,"n_rows":65,"n_cols":17,"rows_kept":65,"cut":false,"hidden":false,"merged":[]}
["Cost Equations"]
["This sheet is used internally to calculate component costs using the cost equations method; see model documentation for more details on the development of cost equations"]
[]
["Component","Equation Name","Result","Variable","Equation Lookup Name",2,3,4,5,6,7,8,9,10,11,16,17]
["Tanks"]
["Caustic Storage Tanks"]
["Plastic/XLPE","pl_cst_eq_naoh",{"$f":"IF(OR(D7>P7,D7<Q7),\"contact vendor\",F7*D7^G7+H7*LN(D7)+I7+J7*EXP(K7*D7)+L7*D7^3+M7*D7^2+N7*D7+O7)","v":{"$error":"#NUM!"}},{"$f":"caustic_tank_vol","v":0},"pl_cst_eq",{"$f":"VLOOKUP($E7,eq_table_cl,F$4,FALSE)","v":0},0,0,0,0,0,0,1.89841E-4,1.125069329,710.83996240299996,6601,0]
["Fiberglass","fg_cst_eq_naoh",{"$f":"IF(OR(D8>P8,D8<Q8),\"contact vendor\",F8*D8^G8+H8*LN(D8)+I8+J8*EXP(K8*D8)+L8*D8^3+M8*D8^2+N8*D8+O8)","v":{"$error":"#NUM!"}},{"$f":"caustic_tank_vol","v":0},"fg_cst_eq",259.35532937099998,0.55137656199999996,0,0,0,0,0,0,0,0,30001,0]
["Stainless Steel","ss_cst_eq_naoh",{"$f":"IF(OR(D9>P9,D9<Q9),\"contact vendor\",F9*D9^G9+H9*LN(D9)+I9+J9*EXP(K9*D9)+L9*D9^3+M9*D9^2+N9*D9+O9)","v":{"$error":"#NUM!"}},{"$f":"caustic_tank_vol","v":0},"ss_cst_eq",57.021589231,0.72932539100000005,0,0,0,0,0,0,0,0,30001,0]
["Heat Tracing","cst_heat_eq",{"$f":"IF(OR(D10>P10,D10<Q10),\"contact vendor\",F10*D10^G10+H10*LN(D10)+I10+J10*EXP(K10*D10)+L10*D10^3+M10*D10^2+N10*D10+O10)","v":{"$error":"#NUM!"}},{"$f":"caustic_tank_vol","v":0},"cst_heat_eq",0,0,0,0,0,0,0,2.0171999999999999E-5,0.19870423800000001,2163.4462942790001,30001,0]
{"$rows_left_out":56}
{"sheet":"Cost Coefficients","index":15,"n_rows":41,"n_cols":17,"rows_kept":41,"cut":false,"hidden":false,"merged":[]}
["Coefficients for Component Cost Equations"]
["This sheet is used internally to calculate component costs using the cost equations method; see model documentation for more details on the development of cost equations"]
[]
[null,"Power: C1*x^C2",null,"Logarithmic: C3*Ln(x) + C4",null,"Exponential: C5*e^(C6*x)",null,"Polynomial: C7*x^3 + C8*x^2 + C9*x + C10",null,null,null,"NOTES"]
["Equation Lookup Name","C1","C2","C3","C4","C5","C6","C7","C8","C9","C10","Pct deviation of fit equation","Modified by","Last modified","Rsq of fit equation","max size used to gen curve","min size for which curve fits are valid"]
["bldg_hi_eq",378.41221851,-0.13671524199999999,0,0,0,0,0,0,0,0,4.0372546378012256E-2,null," 1/25/2023 5:11:07 PM",0.95319947666108407,200000.1,0]
["bldg_lo_eq",163.72087260199999,-9.5204622000000003E-2,0,0,0,0,0,0,0,0,2.4871309850656418E-2,null," 1/25/2023 5:10:26 PM",0.96700830313985342,200000.1,0]
["bldg_mid_eq",198.02119383900001,-9.6244836E-2,0,0,0,0,0,0,0,0,2.5881342871107462E-2,null," 1/25/2023 5:10:48 PM",0.96588495619097448,200000.1,0]
["chem_pump_eq",0,0,0,0,0,0,6.9999999999999998E-9,-8.4886E-5,0.69704597199999996,250.089029947,0.14359948261272082,null," 1/17/2023 12:22:04 PM",0.96727662628593147,12180.01,0]
["cpvc_pipe_eq",0,0,0,0,0,0,6.5072480000000002E-3,0.74408816600000005,2.9106427579999998,0.95118725599999998,9.2730127969551934E-2,null," 1/13/2023 3:31:55 PM",0.97997834929612926,18.100000000000001,0]
{"$rows_left_out":32}
{"sheet":"Cost Data","index":16,"n_rows":865,"n_cols":7,"rows_kept":865,"cut":false,"hidden":false,"merged":[]}
["Cost Data"]
["This sheet is used internally and contains component cost data extracted from the central cost database"]
["To maintain vendor confidentiality, the central cost database itself is not provided here"]
[]
["bls118","Alarms (High/Low Pressure Alarms, Level Switch/Alarms, Low Alarms)"]
[43,null,null,"Unit Cost","Useful Life (large)","Useful Life (small)"]
["alarm_cost_cl",0,0,600.18707669670891,15,14]
[]
[]
["bls061","Chemical Costs"]
{"$rows_left_out":856}
{"sheet":"Engineering Data","index":17,"n_rows":183,"n_cols":5,"rows_kept":183,"cut":false,"hidden":false,"merged":[]}
["Engineering Data"]
["This sheet is used internally and contains engineering reference and indirect cost data extracted from the central cost database"]
[]
["Architectural Fee"]
["Building cost lookup","Corresponds to the range","Architectural fee"]
[0,"<$250,000",0.09]
[250000,"$250,000 to $500,000",0.08]
[500000,"$500,000 to $1,000,000",7.0000000000000007E-2]
[1000000,"$1,000,000 to $5,000,000",6.2E-2]
[5000000,"$5,000,000 to $10,000,000",5.2999999999999999E-2]
{"$rows_left_out":174}
{"sheet":"Lookup Tables","index":18,"n_rows":49,"n_cols":7,"rows_kept":49,"cut":false,"hidden":false,"merged":[]}
["Lookup Tables and Input Validation"]
["This sheet is used internally to perform certain reference calculations and support input sheet data validation"]
[]
["Temperature Dependence Coefficients for Calculating Equilibrium Constants"]
["From Table 2, Trussell 1998"]
["Range names are of the form \"ax_Kx\" (e.g., a1_Kw for first temperature coefficent for the equilbrium constant for water)"]
["Reaction","Constant","a1","a2","a3","a4","a5"]
["H2O <-> OH- + H+","Kw",-6.0880000000000001,4471,null,1.7059999999999999E-2]
["H2CO3 <-> HCO3- + H+","K1",356.30900000000003,-21834.400000000001,-126.834,6.0920000000000002E-2,1685915]
["HCO3- <-> CO32- + H+","K2",107.887,-5151.8,-38.926000000000002,3.2528000000000001E-2,563713.9]
{"$rows_left_out":39}