{"text_format":"1","workbook":"xlsx","n_sheets":9,"sheets":["Standard Inputs","INPUT","User Input","OUTPUT","Control","Price Tables","Capital Assumptions","Indirect Assumptions","O&M Assumptions"],"not_rendered":{"charts":0,"images":0,"macros":1,"external_links":0,"defined_names":226,"comments":4,"pivot_tables":0},"unopened":[],"bounds":{"document_bytes":16777216,"sheet_cells":100000,"rows_first":2000,"rows_last":500,"rows_between":2000,"halvings":0,"cell_chars":16384,"cell_head_chars":4096},"cells_cut":0,"cells_raw":0,"read":"whole","date_system":"1900"}

{"sheet":"Standard Inputs","index":0,"n_rows":12,"n_cols":9,"rows_kept":12,"cut":false,"hidden":true,"merged":[]}
[]
[]
["Design #","Standard system?","Design flow","Units","Average Flow","Units","Source","UV "]
[null,"user_I","design_flow","df_units_input","average_flow","af_units_input","source_select","uv_select","component_I"]
[1,"EPA Standard System",0.03,"MGD",7.0000000000000001E-3,"MGD","GW","no",1]
[2,"EPA Standard System",0.124,"MGD",3.5000000000000003E-2,"MGD","GW","no",1]
[3,"EPA Standard System",0.30499999999999999,"MGD",9.4E-2,"MGD","GW","no",1]
[4,"EPA Standard System",0.74,"MGD",0.251,"MGD","GW","no",1]
[5,"EPA Standard System",0.03,"MGD",8.9999999999999993E-3,"MGD","SW","no",1]
[6,"EPA Standard System",0.124,"MGD",3.9E-2,"MGD","SW","no",1]
[7,"EPA Standard System",0.30499999999999999,"MGD",0.1,"MGD","SW","no",1]
[8,"EPA Standard System",0.74,"MGD",0.251,"MGD","SW","no",1]

{"sheet":"INPUT","index":1,"n_rows":102,"n_cols":6,"rows_kept":102,"cut":false,"hidden":false,"merged":[[7,2,7,3],[9,2,9,3],[20,2,21,3],[4,4,4,5]]}
[{"$f":"\"Point-of-Use or Point-of-Entry System Design and Costs (results in \"&current_year&\" dollars)\"","v":"Point-of-Use or Point-of-Entry System Design and Costs (results in 2020 dollars)"}]
[]
[]
["Step 1:"]
["Select a User-Defined System to estimate costs for a single system using site-specific information. The EPA Standard System option is for EPA's use in estimating national costs, although other users might find the designs useful as a starting point.",null,"EPA Standard System",{"$f":"IF(user=1,\"click here -->\",\"\")","v":""},"To User-Defined System Input Page"]
[]
["Step 2:"]
["Choose a contaminant",null,"Arsenic"]
["Step 3:"]
["Choose a treatment technology",null,"POU Adsorptive Media NSF53"]
[]
["Step 4:"]
["Select one of the standard designs at right"]
[]
[]
{"$rows_left_out":88}
{"sheet":"User Input","index":2,"n_rows":123,"n_cols":5,"rows_kept":123,"cut":false,"hidden":false,"merged":[[11,2,11,3],[3,2,3,3],[6,2,6,3],[15,4,15,7]]}
["User Defined Point-of-Use or Point-of-Entry System"]
[]
["Step 2:"]
["Choose a contaminant",null,"SOCs"]
[null,null,"Status:",{"$f":"IF(COUNTIF(contaminant_list,contam_user)=0,IF(contam_user=\"\",\"Please select a target contaminant\",\"Warning: Target contaminant is not valid\"),\"Contaminant selection OK\")","v":"Contaminant selection OK"}]
["Step 3:"]
["Choose a treatment technology, and",null,"POU GAC"]
["indicate whether treatment includes UV disinfection.","user_UV","yes"]
[null,null,"Status:",{"$f":"IF(ISERROR(COUNTIF(INDIRECT(contam_user),\"\")),\"Warning: Invalid target contaminant; unable to evaluate validity of treatment technology\",IF(COUNTIF(INDIRECT(contam_user),user_treat)=0,IF(user_treat=\"\",\"Please select a certified treatment technology\",\"Warning: Treatment technology selected is not certified for target contaminant\"),\"Treatment technology OK\"))","v":"Treatment technology OK"}]
["Step 4:"]
["Choose a method for entering system size. Then enter the required information in the gold cell(s)."]
["a. Select method for system size input","user_design","average flow"]
["b. Enter average daily system flow in gallons per day, and","user_flow",8800,"gallons per day","For information:"]
["     select a water source.","user_source_select","surface water",null,{"$f":"\"approx. households: \"&Control!D33","v":"approx. households: 25"}]
["b. Enter number of household connections","user_pop",50]
{"$rows_left_out":109}
{"sheet":"OUTPUT","index":3,"n_rows":150,"n_cols":24,"rows_kept":150,"cut":false,"hidden":false,"merged":[[82,4,82,5],[20,10,21,10],[21,2,21,3],[21,4,21,5],[20,2,20,5],[20,6,21,7],[20,8,21,8],[20,9,21,9]]}
["OUTPUT SUMMARY"]
[null,"Parameter","Value"]
[null,"System Description",null,null,null,null,"column not used","column not used",null,null,null,null,"Valid inputs:",{"$f":"IF(contam_stand=\"\",FALSE,TRUE)","v":true},{"$f":"IF(treat=\"\",FALSE,TRUE)","v":true},{"$f":"IF(COUNTIF(contaminant_list,contam_stand)=0,IF(contam_stand=\"\",TRUE,FALSE),TRUE)","v":true},{"$f":"IF(ISERROR(COUNTIF(INDIRECT(contam_stand),TRUE)),FALSE,IF(COUNTIF(INDIRECT(contam_stand),treat)=0,IF(treat=\"\",TRUE,FALSE),TRUE))","v":true},{"$f":"IF(average_flow>design_flow,FALSE,TRUE)","v":true}]
[null,"Households Served",{"$f":"hh_select","v":115}]
[null,"Contaminant",{"$f":"contam","v":"Arsenic"}]
[null,"Treatment Technology",{"$f":"IF(user=1,user_treat,treat)","v":"POU Adsorptive Media NSF53"}]
[null,"Treatment Location",{"$f":"LEFT(IF(user=1,user_treat,treat),3)","v":"POU"}]
[null,"UV Treatment",{"$f":"IF(user=1,uv_user_select,uv_select)","v":"no"}]
[null,"System Size Category",{"$f":"IF(design_flow<1,1,IF(design_flow<10,2,3))","v":1},"1 indicates small system, 2 indicates medium, 3 indicates large"]
[null,{"$f":"\"Resulting Costs (in year \"&TEXT(current_year,0)&\" dollars)\"","v":"Resulting Costs (in year 2020 dollars)"}]
[null,"Direct Capital Cost",{"$f":"IF(input_status<>\"input complete\",\"Action required\",IF(ISERROR(direct_cost),\"Calculation error!\",direct_cost))","v":87136.740531252202},{"$f":"IF(input_status<>\"input complete\",\"Check INPUT sheet for errors\",\"\")","v":""}]
[null,"Add-on Cost",{"$f":"IF(input_status<>\"input complete\",\"Action required\",IF(ISERROR(addon_cost),\"Calculation error!\",addon_cost))","v":0}]
[null,"Indirect Capital Cost",{"$f":"IF(input_status<>\"input complete\",\"Action required\",IF(ISERROR(indirect_cost_add),\"Calculation error!\",indirect_cost_add))","v":27360.471296773947}]
[null,"Total Capital Cost",{"$f":"IF(input_status<>\"input complete\",\"Action required\",IF(ISERROR(system_cost),\"Calculation error!\",system_cost))","v":114497}]
[null,{"$f":"\"Annualized Capital Costs (per year over \"&discount_period&\" years at \"&discount_rate*100&\"%)\"","v":"Annualized Capital Costs (per year over 10 years at 7%)"},{"$f":"IF(input_status<>\"input complete\",\"Action required\",IF(ISERROR(annualized_capital_cost),\"Calculation error!\",annualized_capital_cost))","v":16301.82708932045}]
{"$rows_left_out":136}
{"sheet":"Control","index":4,"n_rows":64,"n_cols":25,"rows_kept":64,"cut":false,"hidden":false,"merged":[]}
[null,"To add new contaminants, insert into this table a column after the last column with data in it and before the yellow column. Then, highlight the list of treatment technologies and insert a range name using the contaminant's name."]
[null,"To add certified technologies for a contaminant, insert into this table a row between the last row with data in it and the yellow row, and copy a POU or POE technology name from Table 2. "]
[null,"This will preserve the range names used in the input sheet and validity checks."]
[null,"Table 1. Treatment Technologies Certified to Remove a Contaminant"]
[null,"Radium","Arsenic","SOCs","Nitrate","Barium","Cadmium","Chromium","Copper","Fluoride","Mercury","VOCs","Perchlorate","PFAS"]
[null,"POU Reverse Osmosis","POU Adsorptive Media NSF53","POU GAC","POU Reverse Osmosis","POU Reverse Osmosis","POU Reverse Osmosis","POU Reverse Osmosis","POU GAC","POU Reverse Osmosis","POU GAC","POU GAC","POU Reverse Osmosis","POU Reverse Osmosis"]
[null,"POU RO Rental","POU Reverse Osmosis",null,"POU RO Rental","POU RO Rental","POU RO Rental","POU RO Rental","POU Reverse Osmosis","POU RO Rental"]
[null,"POE Cation Exchange","POU RO Rental",null,null,"POE Cation Exchange",null,null,"POU RO Rental"]
[]
[]
[null,"Table 2. Range Name Control Table"]
[null,"Treatment Technology","Technology Number",null,"Equipment price range","Parts price range","Replacement frequency range"]
[null,"POU RO Rental",1,null,"pou_rorental_equipment","pou_rorental_parts","pou_rorental_replace"]
[null,"POU Adsorptive Media NSF53",2,null,"pou_ads_nsf53_equipment","pou_ads_nsf53_parts","pou_ads_nsf53_replace",null,null,null,null,null,null,null,null,null,null,null,null,null,null,1,{"$f":"(1388+V14*488.5)/V14","v":1876.5},{"$f":"(0.08558*V14^1.0584)/1000","v":8.5580000000000004E-5},{"$f":"PMT(7%,10,-(1388+V14*488.5))/(X14*1000*365)","v":8.5531244935572541}]
[null,"POU Anion Exchange",3,null,"pou_ax_equipment","pou_ax_parts","pou_ax_replace",null,null,null,null,null,null,null,null,null,null,null,null,null,null,2,{"$f":"(1388+V15*488.5)/V15","v":1182.5},{"$f":"(0.08558*V15^1.0584)/1000","v":1.7823066584313617E-4},{"$f":"PMT(7%,10,-(1388+V15*488.5))/(X15*1000*365)","v":5.1760352139135737}]
{"$rows_left_out":50}
{"sheet":"Price Tables","index":5,"n_rows":541,"n_cols":58,"rows_kept":541,"cut":false,"hidden":false,"merged":[]}
["Price Tables"]
["Instructions: Do not revise information in gray cells. Enter price data in yellow cells only. Copy formulas as needed."]
["POU and POE Device Prices"]
["Price Tables for NSF-approved devices. Mention of a vendor or product does not constitute an endorsement. "]
[null,"POU RO Rental Equipment"]
[null,"Number Households","Number Households","Avg. Unit Cost","Useful Life (large)","Useful Life (small)","Original Vendor Quote","Quote+Inst","Quote+Inst+Trans","Year of Original Quote","Adjusted Cost, including installation and transportation","Source","Installation Multiplier","Unit cost","Unit cost + Inst","Unit cost+Inst+Trans","Year","Adjusted Cost, including installation and transportation","Source","Installation Multiplier","Unit cost","Unit cost + Inst","Unit cost+Inst+Trans","Year","Adjusted Cost, including installation and transportation","Source","Installation Multiplier","Unit cost","Unit cost + Inst","Unit cost+Inst+Trans","Year","Adjusted Cost, including installation and transportation","Source","Installation Multiplier","Unit cost","Unit cost + Inst","Unit cost+Inst+Trans","Year","Adjusted Cost, including installation and transportation","Source","Installation multiplier","Unit cost","Unit cost + Inst","Unit cost+Inst+Trans","Year","Adjusted Cost, including installation and transportation","Source","Installation multiplier",null,null,null,null,"Vendor 1","Vendor 2","Vendor 3","Vendor 4","Vendor 5","Vendor 6"]
["pou_rorental_equipment",0,4,0,10,10,null,null,null,null,null,null,1,null,null,null,null,null,null,null,null,null,null,null,null,null,null,null,null,null,null,null,null,null,null,null,null,null,null,null,null,null,null,null,null,null,null,null,null,null,null,null,{"$f":"IF(L7=\"Source\",L7,IF(ISBLANK(L7),\"\",\"Vendor 1\"))","v":""},{"$f":"IF(S7=\"Source\",S7,IF(ISBLANK(S7),\"\",\"Vendor 2\"))","v":""},{"$f":"IF(Z7=\"Source\",Z7,IF(ISBLANK(Z7),\"\",\"Vendor 3\"))","v":""},{"$f":"IF(AG7=\"Source\",AG7,IF(ISBLANK(AG7),\"\",\"Vendor 4\"))","v":""},{"$f":"IF(AN7=\"Source\",AN7,IF(ISBLANK(AN7),\"\",\"Vendor 5\"))","v":""},{"$f":"IF(AU7=\"Source\",AU7,IF(ISBLANK(AU7),\"\",\"Vendor 6\"))","v":""}]
[null,5,15,0,10,10,null,null,null,null,null,null,1,null,null,null,null,null,null,null,null,null,null,null,null,null,null,null,null,null,null,null,null,null,null,null,null,null,null,null,null,null,null,null,null,null,null,null,null,null,null,null,{"$f":"IF(L8=\"Source\",L8,IF(ISBLANK(L8),\"\",\"Vendor 1\"))","v":""},{"$f":"IF(S8=\"Source\",S8,IF(ISBLANK(S8),\"\",\"Vendor 2\"))","v":""},{"$f":"IF(Z8=\"Source\",Z8,IF(ISBLANK(Z8),\"\",\"Vendor 3\"))","v":""},{"$f":"IF(AG8=\"Source\",AG8,IF(ISBLANK(AG8),\"\",\"Vendor 4\"))","v":""},{"$f":"IF(AN8=\"Source\",AN8,IF(ISBLANK(AN8),\"\",\"Vendor 5\"))","v":""},{"$f":"IF(AU8=\"Source\",AU8,IF(ISBLANK(AU8),\"\",\"Vendor 6\"))","v":""}]
[null,16,24,0,10,10,null,null,null,null,null,null,{"$f":"$M$67","v":1},null,null,null,null,null,null,null,null,null,null,null,null,null,null,null,null,null,null,null,null,null,null,null,null,null,null,null,null,null,null,null,null,null,null,null,null,null,null,null,"","","","","",""]
[null,25,50,0,10,10,null,null,null,null,null,null,{"$f":"$M$67","v":1},null,null,null,null,null,null,null,null,null,null,null,null,null,null,null,null,null,null,null,null,null,null,null,null,null,null,null,null,null,null,null,null,null,null,null,null,null,null,null,"","","","","",""]
[null,51,100,0,10,10,null,null,null,null,null,null,{"$f":"$M$67","v":1},null,null,null,null,null,null,null,null,null,null,null,null,null,null,null,null,null,null,null,null,null,null,null,null,null,null,null,null,null,null,null,null,null,null,null,null,null,null,null,"","","","","",""]
[null,101,500,0,10,10,null,null,null,null,null,null,{"$f":"$M$67","v":1},null,null,null,null,null,null,null,null,null,null,null,null,null,null,null,null,null,null,null,null,null,null,null,null,null,null,null,null,null,null,null,null,null,null,null,null,null,null,null,"","","","","",""]
[null,501,1000,0,10,10,null,null,null,null,null,null,{"$f":"$M$67","v":1},null,null,null,null,null,null,null,null,null,null,null,null,null,null,null,null,null,null,null,null,null,null,null,null,null,null,null,null,null,null,null,null,null,null,null,null,null,null,null,"","","","","",""]
[null,"POU RO Rental Annual O&M Expense",null,null,null,null,null,null,null,null,null,null,null,null,null,null,null,null,null,null,null,null,null,null,null,null,null,null,null,null,null,null,null,null,null,null,null,null,null,null,null,null,null,null,null,null,null,null,null,null,null,null,"","","","","",""]
["pou_rorental_parts","Annual Rental Cost",null,{"$f":"IF(AVERAGE(K15,R15,Y15,AF15,AM15,AT15)=0,\"contact vendor\",AVERAGE(K15,R15,Y15,AF15,AM15,AT15))","v":344.48456425964366},"N/A","N/A",{"$f":"24.95*12","v":299.39999999999998},{"$f":"G15*M15","v":299.39999999999998},{"$f":"H15","v":299.39999999999998},2011,{"$f":"I15*VLOOKUP(J15,cci_table,3,FALSE)","v":344.48456425964366},"Cost Less Water Systems, 4-stage RO system rental rate ($24.95/mo). Prices online; accessed 2-1-11 (www.costlesswater.com).",1,null,null,null,null,null,null,null,null,null,null,null,null,null,null,null,null,null,null,null,null,null,null,null,null,null,null,null,null,null,null,null,null,null,null,null,null,null,null,null,"Vendor 1","","","","",""]
{"$rows_left_out":527}
{"sheet":"Capital Assumptions","index":6,"n_rows":45,"n_cols":16,"rows_kept":45,"cut":false,"hidden":false,"merged":[]}
["Critical Design Assumptions"]
["Instructions: Do not revise information in gray cells."]
["Average Household Size","hh_size","people/household",2.5299999999999998]
["Average Per Capita Consumption (gal/day)","daily_use","gallons/person/day",100]
[null,null,"Units","POU RO Rental","POU Adsorptive Media NSF53","POU Anion Exchange","POU Cation Exchange","POU GAC","POU Reverse Osmosis","POE Adsorptive Media","POE Anion Exchange","POE Cation Exchange","POE Aeration","POE GAC with Auto-Backwash","POE GAC w/out Auto-Backwash","User-Defined System"]
["Equipment Installation"]
["POU/POE Installation","install_hours","hrs/household",0,2,2,2,2,2,2,2,2,2,2,2,{"$f":"IF(user_install=\"\",VLOOKUP(A7,install_hours,user_treat_select+3,FALSE),user_install)","v":2}]
["Scheduling Time","install_hours","hrs/household",0,0.5,0.5,0.5,0.5,0.5,0.5,0.5,0.5,0.5,0.5,0.5,{"$f":"IF(user_install_sched=\"\",VLOOKUP(A8,install_hours,user_treat_select+3,FALSE),user_install_sched)","v":0.5}]
["UV Installation","install_hours","hrs/household",0,0,1,1,1,1,2,2,2,2,2,2,{"$f":"IF(user_uv_install=\"\",VLOOKUP(A9,install_hours,user_treat_select+3,FALSE),user_uv_install)","v":1}]
[]
["Public Education Program"]
["Develop materials","tech_labor","hrs",10,10,10,10,10,10,10,10,10,10,10,10,{"$f":"IF(user_dev_tech=\"\",VLOOKUP(A12,tech_labor,user_treat_select+3,FALSE),user_dev_tech)","v":10}]
["Nitrate health effects","tech_labor","hrs",5,5,5,5,5,5,5,5,5,5,5,5,{"$f":"IF(user_dev_nit=\"\",VLOOKUP(A13,tech_labor,user_treat_select+3,FALSE),user_dev_nit)","v":5}]
["Meetings","tech_labor","hrs",2,2,2,2,2,2,2,2,2,2,2,2,{"$f":"IF(user_meet_tech=\"\",VLOOKUP(A14,tech_labor,user_treat_select+3,FALSE),user_meet_tech)","v":2}]
["Post-meeting","tech_labor","hrs",2,2,2,2,2,2,2,2,2,2,2,2,{"$f":"IF(user_post_tech=\"\",VLOOKUP(A15,tech_labor,user_treat_select+3,FALSE),user_post_tech)","v":2}]
{"$rows_left_out":31}
{"sheet":"Indirect Assumptions","index":7,"n_rows":3,"n_cols":5,"rows_kept":3,"cut":false,"hidden":true,"merged":[]}
["Assumptions for calculating indirect and add-on costs"]
["Contingency"]
["Technology complexity factor","complexity",{"$f":"VLOOKUP(B3,complexity_rng,treat_select+3,FALSE)","v":1},null,"Technology-specific factor.  See Appendices for details.  Low complexity = 0.5; Average complexity = 1.0; High complexity = 1.5; Very high complexity = 2.0."]

{"sheet":"O&M Assumptions","index":8,"n_rows":107,"n_cols":16,"rows_kept":107,"cut":false,"hidden":false,"merged":[]}
["Critical Design Assumptions for O&M"]
["Instructions: Do not revise information in gray cells."]
[null,null,"Units","POU RO Rental","POU Adsorptive Media NSF53","POU Anion Exchange","POU Cation Exchange","POU GAC","POU Reverse Osmosis","POE Adsorptive Media","POE Anion Exchange","POE Cation Exchange","POE Aeration","POE GAC with Auto-Backwash","POE GAC w/out Auto-Backwash","User-Defined System"]
["Equipment Maintenance"]
["POU/POE maintenance","maint_time","hrs/visit",0,0.5,0.5,0.5,0.5,0.5,0.5,0.5,0.5,0.5,0.5,0.5,{"$f":"IF(user_maint=\"\",INDEX(maint_time,user_treat_select),user_maint)","v":0.5}]
["POU/POE replacement frequency","maint_frequency","visits/hh/yr",0,1,1,1,1,1.3,1,1,1,1,1,1,{"$f":"IF(user_repl_freq=\"\",INDEX(maint_frequency,user_treat_select),user_repl_freq)","v":1}]
["UV maintenance","UV_maint_time","hrs/visit",0,0.5,0.5,0.5,0.5,0.5,0.5,0.5,0.5,0.5,0.5,0.5,{"$f":"IF(user_uv_maint=\"\",INDEX(UV_maint_time,user_treat_select),user_uv_maint)","v":0.5}]
["UV maintenance frequency","UV_maint_frequency","visits/hh/yr",0,1,1,1,1,1,1,1,1,1,1,1,{"$f":"IF(user_uv_freq=\"\",INDEX(UV_maint_frequency,user_treat_select),user_uv_freq)","v":1}]
["Scheduling time","maint_scheduling","hrs/visit",0,0.5,0.5,0.5,0.5,0.5,0.5,0.5,0.5,0.5,0.5,0.5,{"$f":"IF(user_maint_sched=\"\",INDEX(maint_scheduling,user_treat_select),user_maint_sched)","v":0.5}]
[]
["Public Education Program"]
["Information updates","tech_labor_om","hrs",12,12,12,12,12,12,12,12,12,12,12,12,{"$f":"IF(user_updates_tech=\"\",VLOOKUP(A12,tech_labor_om,user_treat_select+3,FALSE),user_updates_tech)","v":12}]
["Nitrate information updates","tech_labor_om","hrs",20,20,20,20,20,20,20,20,20,20,20,20,{"$f":"IF(user_nitr_updates_tech=\"\",VLOOKUP(A13,tech_labor_om,user_treat_select+3,FALSE),user_nitr_updates_tech)","v":20}]
["Information updates","clerical_labor_om","hrs",12,12,12,12,12,12,12,12,12,12,12,12,{"$f":"IF(user_info_cler=\"\",VLOOKUP(A14,clerical_labor_om,user_treat_select+3,FALSE),user_info_cler)","v":12}]
["Nitrate information updates","clerical_labor_om","hrs",20,20,20,20,20,20,20,20,20,20,20,20,{"$f":"IF(user_nitr_updates_cler=\"\",VLOOKUP(A15,clerical_labor_om,user_treat_select+3,FALSE),user_nitr_updates_cler)","v":20}]
{"$rows_left_out":92}