{"text_format":"1","workbook":"xlsx","n_sheets":8,"sheets":["Read Me","0. Plan Information","1. Adminstrative Timeline","2. Activity Log","3. Plan Review","4. Plan Completeness Summary","5. Adequacy Summary","6. Evaluation Summary"],"not_rendered":{"charts":0,"images":0,"macros":1,"external_links":0,"defined_names":12,"comments":2,"pivot_tables":0},"unopened":[],"bounds":{"document_bytes":16777216,"sheet_cells":100000,"rows_first":2000,"rows_last":500,"rows_between":2000,"halvings":0,"cell_chars":16384,"cell_head_chars":4096},"cells_cut":0,"cells_raw":0,"read":"whole","date_system":"1900"}

{"sheet":"Read Me","index":0,"n_rows":17,"n_cols":3,"rows_kept":17,"cut":false,"hidden":false,"merged":[[1,1,1,2]]}
["This workbook was created as a companion to Module 3 of EPA's Integrated Planning Permitting Authority Toolkit to help permitting authorities facilitate an integrated plan review as part of the permit renewal process, determine if the plan contains all of the information necessary to inform the permit development, and align the integrated plan outcomes with permit requirements, permit issuance, and compliance schedules. Use the tab and arrow keys to navigate each page. Messages are provided in most cells to notify the user how to use each cell and form."]
[null,"Integrated Planning in Action Permitting Authority Toolkit: Module 3 Workbook"]
[null,"Overview","This workbook was created as a companion to Module 3 of EPA's Integrated Planning Permitting Authority Toolkit to help permitting authorities facilitate an integrated plan review as part of the permit renewal process, determine if the plan contains all of the information necessary to inform the permit development, and align the integrated plan outcomes with permit requirements, permit issuance, and compliance schedules."]
[null,"Sheet","Description"]
[null,"0. Plan Information","Enter basic information about the permittee, integrated plan submittal, and the relevant permits and enforcement actions."]
[null,"1. Administrative Timeline","Displays plan review timeline against permit expiration dates to visualize the integrated plan review window and help you identify key dates."]
{"$rows_left_out":12}
{"sheet":"0. Plan Information","index":1,"n_rows":70,"n_cols":17,"rows_kept":70,"cut":false,"hidden":false,"merged":[[0,1,0,2],[2,1,2,3],[3,1,3,2],[4,1,4,2],[64,2,65,2],[64,3,65,3],[65,1,67,1],[66,2,68,2],[66,3,68,3],[58,2,59,2],[58,3,59,3],[59,1,61,1],[60,2,62,2],[60,3,62,3],[6,1,6,2],[10,1,10,3],[10,5,10,7],[11,1,11,2],[16,2,17,2],[16,3,17,3],[22,2,23,2],[22,3,23,3],[49,5,49,7],[50,1,50,2],[52,2,53,2],[52,3,53,3],[53,1,55,1],[54,2,56,2],[54,3,56,3],[49,1,49,3],[5,1,5,3],[28,2,29,2],[28,3,29,3],[34,2,35,2],[34,3,35,3],[40,2,41,2],[40,3,41,3],[9,1,9,2],[46,2,47,2],[46,3,47,3]]}
[null,"Instructions: Enter information in purple tool input cells. The number of permit and enforcement actions you indicate will determine how many sections are shown. Enter the number of permit or enforcement requirements being addressed in the plan which will make tables available to the right where you can input the compliance requirements being addressed in the plan and the deadline for each requirement."]
[]
[null,"Basic Plan Information"]
[null,"Permittee Name"]
[null,"Plan Name"]
[null,"Integrated Plan Information",null,null,null,null,null,null,null,null,null,null,"WWTF",2,"Yes",1,1]
{"$rows_left_out":65}
{"sheet":"1. Adminstrative Timeline","index":2,"n_rows":22,"n_cols":133,"rows_kept":22,"cut":false,"hidden":false,"merged":[[0,1,0,2],[6,1,6,3],[9,56,9,67],[9,68,9,79],[9,104,9,115],[9,116,9,127],[7,1,8,3],[9,8,9,19],[9,20,9,31],[9,32,9,43],[9,5,9,6],[9,44,9,55],[9,80,9,91],[9,92,9,103]]}
[null,"Instructions: Enter the expiration date for each permit generated below from the Plan Information tab. The timeframe available to review the integrated plan without having to extend and/or reopen a permit will be generated in yellow."]
[null,null,null,null,null,null,null,null,1,{"$f":"I2+1","v":2},{"$f":"J2+1","v":3},4,5,6,7,8,9,10,11,12,{"$f":"T2+1","v":13},{"$f":"U2+1","v":14},{"$f":"V2+1","v":15},{"$f":"W2+1","v":16},{"$f":"X2+1","v":17},{"$f":"Y2+1","v":18},{"$f":"Z2+1","v":19},{"$f":"AA2+1","v":20},{"$f":"AB2+1","v":21},{"$f":"AC2+1","v":22},{"$f":"AD2+1","v":23},{"$f":"AE2+1","v":24},{"$f":"AF2+1","v":25},{"$f":"AG2+1","v":26},{"$f":"AH2+1","v":27},{"$f":"AI2+1","v":28},{"$f":"AJ2+1","v":29},{"$f":"AK2+1","v":30},{"$f":"AL2+1","v":31},{"$f":"AM2+1","v":32},{"$f":"AN2+1","v":33},{"$f":"AO2+1","v":34},{"$f":"AP2+1","v":35},{"$f":"AQ2+1","v":36},{"$f":"AR2+1","v":37},{"$f":"AS2+1","v":38},{"$f":"AT2+1","v":39},{"$f":"AU2+1","v":40},{"$f":"AV2+1","v":41},{"$f":"AW2+1","v":42},{"$f":"AX2+1","v":43},{"$f":"AY2+1","v":44},{"$f":"AZ2+1","v":45},{"$f":"BA2+1","v":46},{"$f":"BB2+1","v":47},{"$f":"BC2+1","v":48},{"$f":"BD2+1","v":49},{"$f":"BE2+1","v":50},{"$f":"BF2+1","v":51},{"$f":"BG2+1","v":52},{"$f":"BH2+1","v":53},{"$f":"BI2+1","v":54},{"$f":"BJ2+1","v":55},{"$f":"BK2+1","v":56},{"$f":"BL2+1","v":57},{"$f":"BM2+1","v":58},{"$f":"BN2+1","v":59},{"$f":"BO2+1","v":60},{"$f":"BP2+1","v":61},{"$f":"BQ2+1","v":62},{"$f":"BR2+1","v":63},{"$f":"BS2+1","v":64},{"$f":"BT2+1","v":65},{"$f":"BU2+1","v":66},{"$f":"BV2+1","v":67},{"$f":"BW2+1","v":68},{"$f":"BX2+1","v":69},{"$f":"BY2+1","v":70},{"$f":"BZ2+1","v":71},{"$f":"CA2+1","v":72},{"$f":"CB2+1","v":73},{"$f":"CC2+1","v":74},{"$f":"CD2+1","v":75},{"$f":"CE2+1","v":76},{"$f":"CF2+1","v":77},{"$f":"CG2+1","v":78},{"$f":"CH2+1","v":79},{"$f":"CI2+1","v":80},{"$f":"CJ2+1","v":81},{"$f":"CK2+1","v":82},{"$f":"CL2+1","v":83},{"$f":"CM2+1","v":84},{"$f":"CN2+1","v":85},{"$f":"CO2+1","v":86},{"$f":"CP2+1","v":87},{"$f":"CQ2+1","v":88},{"$f":"CR2+1","v":89},{"$f":"CS2+1","v":90},{"$f":"CT2+1","v":91},{"$f":"CU2+1","v":92},{"$f":"CV2+1","v":93},{"$f":"CW2+1","v":94},{"$f":"CX2+1","v":95},{"$f":"CY2+1","v":96},{"$f":"CZ2+1","v":97},{"$f":"DA2+1","v":98},{"$f":"DB2+1","v":99},{"$f":"DC2+1","v":100},{"$f":"DD2+1","v":101},{"$f":"DE2+1","v":102},{"$f":"DF2+1","v":103},{"$f":"DG2+1","v":104},{"$f":"DH2+1","v":105},{"$f":"DI2+1","v":106},{"$f":"DJ2+1","v":107},{"$f":"DK2+1","v":108},{"$f":"DL2+1","v":109},{"$f":"DM2+1","v":110},{"$f":"DN2+1","v":111},{"$f":"DO2+1","v":112},{"$f":"DP2+1","v":113},{"$f":"DQ2+1","v":114},{"$f":"DR2+1","v":115},{"$f":"DS2+1","v":116},{"$f":"DT2+1","v":117},{"$f":"DU2+1","v":118},{"$f":"DV2+1","v":119},{"$f":"DW2+1","v":120}]
[null,"DO NOT DELETE ROW","Plan Review Start Date",{"$f":"IF(ISBLANK('0. Plan Information'!$D$8),'0. Plan Information'!$D$9,'0. Plan Information'!$D$8)","v":"00:00:00"}]
[null,"DO NOT DELETE ROW","Plan Review End Date",{"$f":"EDATE(D3,'0. Plan Information'!$D$10)","v":"00:00:00"}]
[null,"DO NOT DELETE ROW","Timeline Start Date",{"$f":"DATE(IF(ISBLANK(D12),YEAR(D3),YEAR(MIN(D3,D12:D17))),1,1)","v":"1900-01-01"},null,null,null,null,1,2,3,4,5,6,7,8,9,10,11,12,1,2,3,4,5,6,7,8,9,10,11,12,1,2,3,4,5,6,7,8,9,10,11,12,1,2,3,4,5,6,7,8,9,10,11,12,1,2,3,4,5,6,7,8,9,10,11,12,1,2,3,4,5,6,7,8,9,10,11,12,1,2,3,4,5,6,7,8,9,10,11,12,1,2,3,4,5,6,7,8,9,10,11,12,1,2,3,4,5,6,7,8,9,10,11,12,1,2,3,4,5,6,7,8,9,10,11,12]
[null,"DO NOT DELETE ROW","Timeline End Date",{"$f":"MAX(E12:G17,D3:D4)","v":"00:00:00"},null,null,null,null,{"$f":"DATE(YEAR(D5),1,1)","v":"1900-01-01"},{"$f":"IF(J5=1,DATE(YEAR(I6)+1,1,1),DATE(YEAR(I6),J5,1))","v":"1900-02-01"},{"$f":"IF(K5=1,DATE(YEAR(J6)+1,1,1),DATE(YEAR(J6),K5,1))","v":"1900-03-01"},"1900-04-01","1900-05-01","1900-06-01","1900-07-01","1900-08-01","1900-09-01","1900-10-01","1900-11-01","1900-12-01","1901-01-01","1901-02-01","1901-03-01","1901-04-01","1901-05-01","1901-06-01","1901-07-01","1901-08-01","1901-09-01","1901-10-01","1901-11-01","1901-12-01",{"$f":"IF(AG5=1,DATE(YEAR(AF6)+1,1,1),DATE(YEAR(AF6),AG5,1))","v":"1902-01-01"},{"$f":"IF(AH5=1,DATE(YEAR(AG6)+1,1,1),DATE(YEAR(AG6),AH5,1))","v":"1902-02-01"},{"$f":"IF(AI5=1,DATE(YEAR(AH6)+1,1,1),DATE(YEAR(AH6),AI5,1))","v":"1902-03-01"},{"$f":"IF(AJ5=1,DATE(YEAR(AI6)+1,1,1),DATE(YEAR(AI6),AJ5,1))","v":"1902-04-01"},{"$f":"IF(AK5=1,DATE(YEAR(AJ6)+1,1,1),DATE(YEAR(AJ6),AK5,1))","v":"1902-05-01"},{"$f":"IF(AL5=1,DATE(YEAR(AK6)+1,1,1),DATE(YEAR(AK6),AL5,1))","v":"1902-06-01"},{"$f":"IF(AM5=1,DATE(YEAR(AL6)+1,1,1),DATE(YEAR(AL6),AM5,1))","v":"1902-07-01"},{"$f":"IF(AN5=1,DATE(YEAR(AM6)+1,1,1),DATE(YEAR(AM6),AN5,1))","v":"1902-08-01"},{"$f":"IF(AO5=1,DATE(YEAR(AN6)+1,1,1),DATE(YEAR(AN6),AO5,1))","v":"1902-09-01"},{"$f":"IF(AP5=1,DATE(YEAR(AO6)+1,1,1),DATE(YEAR(AO6),AP5,1))","v":"1902-10-01"},{"$f":"IF(AQ5=1,DATE(YEAR(AP6)+1,1,1),DATE(YEAR(AP6),AQ5,1))","v":"1902-11-01"},{"$f":"IF(AR5=1,DATE(YEAR(AQ6)+1,1,1),DATE(YEAR(AQ6),AR5,1))","v":"1902-12-01"},{"$f":"IF(AS5=1,DATE(YEAR(AR6)+1,1,1),DATE(YEAR(AR6),AS5,1))","v":"1903-01-01"},{"$f":"IF(AT5=1,DATE(YEAR(AS6)+1,1,1),DATE(YEAR(AS6),AT5,1))","v":"1903-02-01"},{"$f":"IF(AU5=1,DATE(YEAR(AT6)+1,1,1),DATE(YEAR(AT6),AU5,1))","v":"1903-03-01"},{"$f":"IF(AV5=1,DATE(YEAR(AU6)+1,1,1),DATE(YEAR(AU6),AV5,1))","v":"1903-04-01"},{"$f":"IF(AW5=1,DATE(YEAR(AV6)+1,1,1),DATE(YEAR(AV6),AW5,1))","v":"1903-05-01"},{"$f":"IF(AX5=1,DATE(YEAR(AW6)+1,1,1),DATE(YEAR(AW6),AX5,1))","v":"1903-06-01"},{"$f":"IF(AY5=1,DATE(YEAR(AX6)+1,1,1),DATE(YEAR(AX6),AY5,1))","v":"1903-07-01"},{"$f":"IF(AZ5=1,DATE(YEAR(AY6)+1,1,1),DATE(YEAR(AY6),AZ5,1))","v":"1903-08-01"},{"$f":"IF(BA5=1,DATE(YEAR(AZ6)+1,1,1),DATE(YEAR(AZ6),BA5,1))","v":"1903-09-01"},{"$f":"IF(BB5=1,DATE(YEAR(BA6)+1,1,1),DATE(YEAR(BA6),BB5,1))","v":"1903-10-01"},{"$f":"IF(BC5=1,DATE(YEAR(BB6)+1,1,1),DATE(YEAR(BB6),BC5,1))","v":"1903-11-01"},{"$f":"IF(BD5=1,DATE(YEAR(BC6)+1,1,1),DATE(YEAR(BC6),BD5,1))","v":"1903-12-01"},{"$f":"IF(BE5=1,DATE(YEAR(BD6)+1,1,1),DATE(YEAR(BD6),BE5,1))","v":"1904-01-01"},{"$f":"IF(BF5=1,DATE(YEAR(BE6)+1,1,1),DATE(YEAR(BE6),BF5,1))","v":"1904-02-01"},{"$f":"IF(BG5=1,DATE(YEAR(BF6)+1,1,1),DATE(YEAR(BF6),BG5,1))","v":"1904-03-01"},{"$f":"IF(BH5=1,DATE(YEAR(BG6)+1,1,1),DATE(YEAR(BG6),BH5,1))","v":"1904-04-01"},{"$f":"IF(BI5=1,DATE(YEAR(BH6)+1,1,1),DATE(YEAR(BH6),BI5,1))","v":"1904-05-01"},{"$f":"IF(BJ5=1,DATE(YEAR(BI6)+1,1,1),DATE(YEAR(BI6),BJ5,1))","v":"1904-06-01"},{"$f":"IF(BK5=1,DATE(YEAR(BJ6)+1,1,1),DATE(YEAR(BJ6),BK5,1))","v":"1904-07-01"},{"$f":"IF(BL5=1,DATE(YEAR(BK6)+1,1,1),DATE(YEAR(BK6),BL5,1))","v":"1904-08-01"},{"$f":"IF(BM5=1,DATE(YEAR(BL6)+1,1,1),DATE(YEAR(BL6),BM5,1))","v":"1904-09-01"},{"$f":"IF(BN5=1,DATE(YEAR(BM6)+1,1,1),DATE(YEAR(BM6),BN5,1))","v":"1904-10-01"},{"$f":"IF(BO5=1,DATE(YEAR(BN6)+1,1,1),DATE(YEAR(BN6),BO5,1))","v":"1904-11-01"},{"$f":"IF(BP5=1,DATE(YEAR(BO6)+1,1,1),DATE(YEAR(BO6),BP5,1))","v":"1904-12-01"},{"$f":"IF(BQ5=1,DATE(YEAR(BP6)+1,1,1),DATE(YEAR(BP6),BQ5,1))","v":"1905-01-01"},{"$f":"IF(BR5=1,DATE(YEAR(BQ6)+1,1,1),DATE(YEAR(BQ6),BR5,1))","v":"1905-02-01"},{"$f":"IF(BS5=1,DATE(YEAR(BR6)+1,1,1),DATE(YEAR(BR6),BS5,1))","v":"1905-03-01"},{"$f":"IF(BT5=1,DATE(YEAR(BS6)+1,1,1),DATE(YEAR(BS6),BT5,1))","v":"1905-04-01"},{"$f":"IF(BU5=1,DATE(YEAR(BT6)+1,1,1),DATE(YEAR(BT6),BU5,1))","v":"1905-05-01"},{"$f":"IF(BV5=1,DATE(YEAR(BU6)+1,1,1),DATE(YEAR(BU6),BV5,1))","v":"1905-06-01"},{"$f":"IF(BW5=1,DATE(YEAR(BV6)+1,1,1),DATE(YEAR(BV6),BW5,1))","v":"1905-07-01"},{"$f":"IF(BX5=1,DATE(YEAR(BW6)+1,1,1),DATE(YEAR(BW6),BX5,1))","v":"1905-08-01"},{"$f":"IF(BY5=1,DATE(YEAR(BX6)+1,1,1),DATE(YEAR(BX6),BY5,1))","v":"1905-09-01"},{"$f":"IF(BZ5=1,DATE(YEAR(BY6)+1,1,1),DATE(YEAR(BY6),BZ5,1))","v":"1905-10-01"},{"$f":"IF(CA5=1,DATE(YEAR(BZ6)+1,1,1),DATE(YEAR(BZ6),CA5,1))","v":"1905-11-01"},{"$f":"IF(CB5=1,DATE(YEAR(CA6)+1,1,1),DATE(YEAR(CA6),CB5,1))","v":"1905-12-01"},{"$f":"IF(CC5=1,DATE(YEAR(CB6)+1,1,1),DATE(YEAR(CB6),CC5,1))","v":"1906-01-01"},{"$f":"IF(CD5=1,DATE(YEAR(CC6)+1,1,1),DATE(YEAR(CC6),CD5,1))","v":"1906-02-01"},{"$f":"IF(CE5=1,DATE(YEAR(CD6)+1,1,1),DATE(YEAR(CD6),CE5,1))","v":"1906-03-01"},{"$f":"IF(CF5=1,DATE(YEAR(CE6)+1,1,1),DATE(YEAR(CE6),CF5,1))","v":"1906-04-01"},{"$f":"IF(CG5=1,DATE(YEAR(CF6)+1,1,1),DATE(YEAR(CF6),CG5,1))","v":"1906-05-01"},{"$f":"IF(CH5=1,DATE(YEAR(CG6)+1,1,1),DATE(YEAR(CG6),CH5,1))","v":"1906-06-01"},{"$f":"IF(CI5=1,DATE(YEAR(CH6)+1,1,1),DATE(YEAR(CH6),CI5,1))","v":"1906-07-01"},{"$f":"IF(CJ5=1,DATE(YEAR(CI6)+1,1,1),DATE(YEAR(CI6),CJ5,1))","v":"1906-08-01"},{"$f":"IF(CK5=1,DATE(YEAR(CJ6)+1,1,1),DATE(YEAR(CJ6),CK5,1))","v":"1906-09-01"},{"$f":"IF(CL5=1,DATE(YEAR(CK6)+1,1,1),DATE(YEAR(CK6),CL5,1))","v":"1906-10-01"},{"$f":"IF(CM5=1,DATE(YEAR(CL6)+1,1,1),DATE(YEAR(CL6),CM5,1))","v":"1906-11-01"},{"$f":"IF(CN5=1,DATE(YEAR(CM6)+1,1,1),DATE(YEAR(CM6),CN5,1))","v":"1906-12-01"},{"$f":"IF(CO5=1,DATE(YEAR(CN6)+1,1,1),DATE(YEAR(CN6),CO5,1))","v":"1907-01-01"},{"$f":"IF(CP5=1,DATE(YEAR(CO6)+1,1,1),DATE(YEAR(CO6),CP5,1))","v":"1907-02-01"},{"$f":"IF(CQ5=1,DATE(YEAR(CP6)+1,1,1),DATE(YEAR(CP6),CQ5,1))","v":"1907-03-01"},{"$f":"IF(CR5=1,DATE(YEAR(CQ6)+1,1,1),DATE(YEAR(CQ6),CR5,1))","v":"1907-04-01"},{"$f":"IF(CS5=1,DATE(YEAR(CR6)+1,1,1),DATE(YEAR(CR6),CS5,1))","v":"1907-05-01"},{"$f":"IF(CT5=1,DATE(YEAR(CS6)+1,1,1),DATE(YEAR(CS6),CT5,1))","v":"1907-06-01"},{"$f":"IF(CU5=1,DATE(YEAR(CT6)+1,1,1),DATE(YEAR(CT6),CU5,1))","v":"1907-07-01"},{"$f":"IF(CV5=1,DATE(YEAR(CU6)+1,1,1),DATE(YEAR(CU6),CV5,1))","v":"1907-08-01"},{"$f":"IF(CW5=1,DATE(YEAR(CV6)+1,1,1),DATE(YEAR(CV6),CW5,1))","v":"1907-09-01"},{"$f":"IF(CX5=1,DATE(YEAR(CW6)+1,1,1),DATE(YEAR(CW6),CX5,1))","v":"1907-10-01"},{"$f":"IF(CY5=1,DATE(YEAR(CX6)+1,1,1),DATE(YEAR(CX6),CY5,1))","v":"1907-11-01"},{"$f":"IF(CZ5=1,DATE(YEAR(CY6)+1,1,1),DATE(YEAR(CY6),CZ5,1))","v":"1907-12-01"},{"$f":"IF(DA5=1,DATE(YEAR(CZ6)+1,1,1),DATE(YEAR(CZ6),DA5,1))","v":"1908-01-01"},{"$f":"IF(DB5=1,DATE(YEAR(DA6)+1,1,1),DATE(YEAR(DA6),DB5,1))","v":"1908-02-01"},{"$f":"IF(DC5=1,DATE(YEAR(DB6)+1,1,1),DATE(YEAR(DB6),DC5,1))","v":"1908-03-01"},{"$f":"IF(DD5=1,DATE(YEAR(DC6)+1,1,1),DATE(YEAR(DC6),DD5,1))","v":"1908-04-01"},{"$f":"IF(DE5=1,DATE(YEAR(DD6)+1,1,1),DATE(YEAR(DD6),DE5,1))","v":"1908-05-01"},{"$f":"IF(DF5=1,DATE(YEAR(DE6)+1,1,1),DATE(YEAR(DE6),DF5,1))","v":"1908-06-01"},{"$f":"IF(DG5=1,DATE(YEAR(DF6)+1,1,1),DATE(YEAR(DF6),DG5,1))","v":"1908-07-01"},{"$f":"IF(DH5=1,DATE(YEAR(DG6)+1,1,1),DATE(YEAR(DG6),DH5,1))","v":"1908-08-01"},{"$f":"IF(DI5=1,DATE(YEAR(DH6)+1,1,1),DATE(YEAR(DH6),DI5,1))","v":"1908-09-01"},{"$f":"IF(DJ5=1,DATE(YEAR(DI6)+1,1,1),DATE(YEAR(DI6),DJ5,1))","v":"1908-10-01"},{"$f":"IF(DK5=1,DATE(YEAR(DJ6)+1,1,1),DATE(YEAR(DJ6),DK5,1))","v":"1908-11-01"},{"$f":"IF(DL5=1,DATE(YEAR(DK6)+1,1,1),DATE(YEAR(DK6),DL5,1))","v":"1908-12-01"},{"$f":"IF(DM5=1,DATE(YEAR(DL6)+1,1,1),DATE(YEAR(DL6),DM5,1))","v":"1909-01-01"},{"$f":"IF(DN5=1,DATE(YEAR(DM6)+1,1,1),DATE(YEAR(DM6),DN5,1))","v":"1909-02-01"},{"$f":"IF(DO5=1,DATE(YEAR(DN6)+1,1,1),DATE(YEAR(DN6),DO5,1))","v":"1909-03-01"},{"$f":"IF(DP5=1,DATE(YEAR(DO6)+1,1,1),DATE(YEAR(DO6),DP5,1))","v":"1909-04-01"},{"$f":"IF(DQ5=1,DATE(YEAR(DP6)+1,1,1),DATE(YEAR(DP6),DQ5,1))","v":"1909-05-01"},{"$f":"IF(DR5=1,DATE(YEAR(DQ6)+1,1,1),DATE(YEAR(DQ6),DR5,1))","v":"1909-06-01"},{"$f":"IF(DS5=1,DATE(YEAR(DR6)+1,1,1),DATE(YEAR(DR6),DS5,1))","v":"1909-07-01"},{"$f":"IF(DT5=1,DATE(YEAR(DS6)+1,1,1),DATE(YEAR(DS6),DT5,1))","v":"1909-08-01"},{"$f":"IF(DU5=1,DATE(YEAR(DT6)+1,1,1),DATE(YEAR(DT6),DU5,1))","v":"1909-09-01"},{"$f":"IF(DV5=1,DATE(YEAR(DU6)+1,1,1),DATE(YEAR(DU6),DV5,1))","v":"1909-10-01"},{"$f":"IF(DW5=1,DATE(YEAR(DV6)+1,1,1),DATE(YEAR(DV6),DW5,1))","v":"1909-11-01"},{"$f":"IF(DX5=1,DATE(YEAR(DW6)+1,1,1),DATE(YEAR(DW6),DX5,1))","v":"1909-12-01"}]
{"$rows_left_out":17}
{"sheet":"2. Activity Log","index":3,"n_rows":8,"n_cols":10,"rows_kept":8,"cut":false,"hidden":false,"merged":[[1,1,1,7],[0,1,0,6]]}
[null,"Instructions: Select the plan review step from the dropdown and enter the reviewer name, completion date, notes, and whether follow-up with the permittee is needed. If there is follow-up, enter the date and any relevant notes.",null,null,null,null,null,null,"Yes"]
[null,"Activity Log",null,null,null,null,null,null,"No","WW technical review"]
[null,"Review Step","Reviewer Name","Date Complete","Review Notes","Follow-Up Required?","Follow-Up Date","Follow Up Notes",null,"CSO technical review"]
[null,null,null,null,null,null,null,null,null,"SW technical review"]
[null,null,null,null,null,null,null,null,null,"Enforcement"]
[null,null,null,null,null,null,null,null,null,"Management"]
{"$rows_left_out":3}
{"sheet":"3. Plan Review","index":4,"n_rows":108,"n_cols":7,"rows_kept":108,"cut":false,"hidden":false,"merged":[[0,1,0,4],[100,1,100,5],[99,2,99,3],[44,2,44,3],[75,2,75,3],[76,2,76,3],[85,2,85,3],[87,4,87,5],[89,2,89,3],[90,2,90,3],[92,2,97,2],[45,2,55,2],[45,5,55,5],[87,1,87,3],[85,4,85,5],[70,1,70,5],[86,1,86,5],[69,4,69,5],[83,2,83,3],[82,4,83,4],[82,5,83,5],[99,4,99,5],[71,1,71,3],[92,1,97,1],[78,2,78,3],[79,2,79,3],[82,2,82,3],[71,4,71,5],[73,2,73,3],[80,2,80,3],[81,2,81,3],[98,4,98,5],[98,2,98,3],[84,4,84,5],[84,2,84,3],[92,5,97,5],[74,2,74,3],[107,2,107,3],[101,4,101,5],[103,2,103,3],[104,2,104,3],[101,1,101,3],[107,4,107,5],[106,2,106,3],[106,4,106,5],[56,1,61,1],[62,1,67,1],[45,1,55,1],[68,4,68,5],[68,2,68,3],[62,5,67,5],[62,2,67,2],[2,1,2,5],[3,1,3,3],[3,4,3,5],[6,2,6,3],[5,2,5,3],[8,1,12,1],[39,1,39,3],[13,2,13,3],[14,2,14,3],[17,2,17,3],[36,2,36,3],[16,2,16,3],[29,2,35,2],[37,2,37,3],[19,1,19,5],[38,1,38,5],[24,1,28,1],[29,1,35,1],[20,1,20,3],[16,4,16,5],[18,4,18,5],[8,5,12,5],[8,2,12,2],[39,4,39,5],[22,2,22,3],[24,2,28,2],[24,5,28,5],[20,4,20,5],[15,2,15,3],[36,4,36,5],[29,5,35,5],[37,4,37,5],[17,4,17,5],[42,2,42,3],[18,2,18,3],[56,2,61,2],[56,5,61,5],[69,2,69,3],[41,2,41,3]]}
[null,"Instructions: Indicate what information the plan addresses for each element using the dropdowns in the purple tool input cells. Enter additional information to support your determination (e.g., plan page number, description of plan element) in the gray optional input cells. Add any questions specific to your permitting authority in the \"Placeholder\" cells with red text."]
[]
[null,"Element 1: A Description of the Water Quality, Human Health, and Regulatory Issues the Plan Addresses",null,null,null,null,"Yes"]
[null,"Question",null,null,"Answer & Notes",null,"Somewhat"]
[null,"Required Elements",null,null,null,null,"No"]
[{"$f":"E6","v":0},"E1.1","Does the plan include a description of the water quality, public health and regulatory issues to be addressed? If yes, note the plan section to the right."]
{"$rows_left_out":103}
{"sheet":"4. Plan Completeness Summary","index":5,"n_rows":11,"n_cols":13,"rows_kept":11,"cut":false,"hidden":false,"merged":[[2,1,2,5],[3,1,3,2],[3,3,3,5],[4,1,4,2],[0,1,0,4]]}
[null,"Instructions: Element completeness cells use the Plan Review tab to summarize how completely the plan addresses each element. Red cells indicate that a required part of an element was not completed. Based on follow up with the permittee, indicate whether the missing information was resolved, including the follow up date and any relevant notes."]
[null,null,null,null,null,null,null,"Yes"]
[null,"Integrated Plan Completeness Summary",null,null,null,null,null,"No"]
[null,"Element Summary",null,"Follow-up"]
[null,"Element Completeness",null,"Resolved?","Resolved Date","Resolved Notes",null,null,"Blank","Yes","Somewhat","No","Blank, Somewhat and No"]
[null,"Element 1: Describing Requirements and Drivers",{"$f":"IF(AND(J6=\"\",K6=\"\",L6=\"\"),\"\",IF(AND(I6=\"\",K6=\"\",L6=\"\"),\"All required elements have been addressed.\",IF(M6<>\"\",CONCATENATE(\"Element(s) \",M6,\" must still be addressed.\"),\"\")))","v":""},null,null,null,null,"E6:E7",{"$f":"_xlfn.TEXTJOIN(\", \",TRUE,IF('3. Plan Review'!E6:E7=\"\",'3. Plan Review'!B6:B7,\"\"))","v":"E1.1, E1.2"},{"$f":"_xlfn.TEXTJOIN(\", \",TRUE,IF('3. Plan Review'!E6:E7=\"Yes\",'3. Plan Review'!B6:B7,\"\"))","v":""},{"$f":"_xlfn.TEXTJOIN(\", \",TRUE,IF('3. Plan Review'!E6:E7=\"Somewhat\",'3. Plan Review'!B6:B7,\"\"))","v":""},{"$f":"_xlfn.TEXTJOIN(\", \",TRUE,IF('3. Plan Review'!E6:E7=\"No\",'3. Plan Review'!B6:B7,\"\"))","v":""},{"$f":"IF(AND(I6=\"\",K6=\"\"),L6,IF(AND(I6=\"\",L6=\"\"),K6,IF(AND(K6=\"\",L6=\"\"),I6,IF(I6=\"\",CONCATENATE(K6,\", \",L6),IF(K6=\"\",CONCATENATE(I6,\", \",L6),IF(L6=\"\",CONCATENATE(I6,\", \",K6),CONCATENATE(I6,\", \",K6,\", \",L6)))))))","v":"E1.1, E1.2"}]
{"$rows_left_out":6}
{"sheet":"5. Adequacy Summary","index":6,"n_rows":92,"n_cols":10,"rows_kept":92,"cut":false,"hidden":false,"merged":[[67,4,67,5],[68,4,68,5],[69,4,69,5],[70,4,70,5],[71,4,71,5],[60,4,60,5],[61,4,61,5],[62,4,62,5],[63,4,63,5],[64,4,64,5],[53,4,53,5],[54,4,54,5],[55,4,55,5],[56,4,56,5],[57,4,57,5],[48,1,48,7],[49,1,49,3],[49,4,49,7],[50,1,50,2],[50,4,50,5],[22,4,22,5],[23,4,23,5],[45,4,45,5],[46,4,46,5],[29,4,29,5],[30,4,30,5],[31,4,31,5],[32,4,32,5],[35,4,35,5],[39,4,39,5],[42,4,42,5],[43,4,43,5],[44,4,44,5],[4,4,4,5],[7,4,7,5],[4,1,4,2],[18,4,18,5],[21,4,21,5],[8,4,8,5],[9,4,9,5],[10,4,10,5],[11,4,11,5],[14,4,14,5],[15,4,15,5],[16,4,16,5],[17,4,17,5],[87,1,87,7],[88,1,88,3],[88,4,88,7],[89,1,89,3],[91,1,91,3],[89,5,89,7],[91,5,91,7],[90,1,90,3],[90,5,90,7],[82,1,82,3],[86,5,86,7],[86,1,86,3],[83,1,83,3],[84,1,84,3],[82,5,82,7],[83,5,83,7],[84,5,84,7],[85,1,85,3],[85,5,85,7],[78,1,78,3],[76,1,76,3],[77,1,77,3],[81,4,81,7],[79,4,79,7],[80,1,80,7],[81,1,81,3],[79,1,79,3],[78,4,78,7],[77,4,77,7],[0,1,0,6],[75,4,75,7],[76,4,76,7],[36,4,36,5],[37,4,37,5],[38,4,38,5],[75,1,75,3],[73,1,73,7],[74,4,74,7],[74,1,74,3],[24,4,24,5],[25,4,25,5],[28,4,28,5],[2,1,2,7],[3,1,3,3],[3,4,3,7]]}
[null,"Instructions: Enter information from the plan about proposed outcomes, revised compliance deadlines, and the permittee justification in purple tool input cells. Note that the Plan Outcome Adequacy table is populated based on the compliance requirements entered in the Plan Information tab. Use the optional questions under Water Quality Objectives to elaborate on the justification for an integrated approach to permit compliance. Add any questions specific to your permitting authority in the \"Placeholder\" cells with red text. "]
[]
[null,"Plan Outcome Adequacy - Permit Requirements",null,null,null,null,null,null,"Yes","Yes"]
[null,"Original Permit Requirements",null,null,"Proposed Integrated Plan Outcome",null,null,null,"Somewhat","No"]
[null,"Original Compliance Requirement",null,"Original Compliance Deadline","Proposed Plan Outcome",null,"Proposed  Compliance Deadline","Permittee Justification for Adjustment","No"]
[]
{"$rows_left_out":87}
{"sheet":"6. Evaluation Summary","index":7,"n_rows":81,"n_cols":8,"rows_kept":81,"cut":false,"hidden":false,"merged":[[57,1,57,3],[57,4,57,7],[58,1,58,2],[0,1,0,7],[10,1,10,3],[11,1,11,3],[12,4,12,7],[12,1,12,3],[9,4,9,7],[13,1,13,2],[10,4,10,7],[11,4,11,7],[5,1,5,7],[2,1,2,7],[3,1,3,3],[4,1,4,3],[8,1,8,3],[9,1,9,3],[7,4,7,7],[8,4,8,7],[3,4,3,7],[4,4,4,7],[6,4,6,7],[6,1,6,3],[7,1,7,3]]}
[null,"Instructions: Review the plan completeness summary along with the proposed integrated plan outcome. Once determined, input the final state decision and relevant notes for recordkeeping purposes. Each compliance requirement does not have to have an independent decision; if needed, put \"N/A\"."]
[]
[null,"Basic Plan Information"]
[null,"Permittee Name",null,null,{"$f":"IF(ISBLANK('0. Plan Information'!$D$4),\"\",'0. Plan Information'!$D$4)","v":""}]
[null,"Plan Name",null,null,{"$f":"IF(ISBLANK('0. Plan Information'!$D$4),\"\",'0. Plan Information'!$D$5)","v":""}]
[null,"Integrated Plan Completeness Summary"]
{"$rows_left_out":75}