{"text_format":"1","workbook":"xlsx","n_sheets":7,"sheets":["Instructions","General Info","SASS_SuperSASS","SASS_Super SASS collocated","URG","URG_collocated","Reference"],"not_rendered":{"charts":0,"images":0,"macros":1,"external_links":1,"defined_names":455,"comments":5,"pivot_tables":0},"unopened":[],"bounds":{"document_bytes":16777216,"sheet_cells":100000,"rows_first":2000,"rows_last":500,"rows_between":2000,"halvings":0,"cell_chars":16384,"cell_head_chars":4096},"cells_cut":0,"cells_raw":0,"read":"whole","date_system":"1900"}

{"sheet":"Instructions","index":0,"n_rows":31,"n_cols":1,"rows_kept":31,"cut":false,"hidden":false,"merged":[]}
["Instructions for CSN Sampler Flow Rate Audit and Monthly Flow Check Worksheets"]
[]
["Overview"]
["This workbook contains worksheets needed for audits of up to two SASS samplers and/or two URG 3000N samplers and monthly flow checks for up to two SASS samplers and up two URG 3000N samplers at a single site. The purpose of this workbook is to assist state, local, and/or tribal air agencies in recordkeeping and reporting of flow rate audits and flow checks to AQS.  "]
[]
["You must fill out all infomation in the 'General Info' worksheet.  This is because the basic site information (name, AQS code, etc.) are taken from the 'General Info' worksheet and automatically applied in all other sheets where applicable. In selecting your particular use for this workbook (Sampler Flow Check Audit or Sampler Monthly Flow Check) from the dropdown option in cell F3 of 'General Info' worksheet, cells not needed for your purpose will black out. Cell F3 should be the first entry you make in the workbook."]
[]
["Protected Document"]
["These worksheets are protected to prevent accidental edits to formulas, etc. To remove the worksheet protections, go to the Review tab, and click \"Unprotect Sheet.\" No password is needed to unprotect the worksheets."]
[]
["Cell Color Coding"]
["White cells contain labels and other text. Do NOT overwrite any white cell."]
["Orange cells require user input - all your data should be placed in the appropriate orange cells."]
["Blue cells contain data entered from another sheet or calculated using formulae. Do NOT overwrite any blue cell. "]
["Black cells mark out info not needed for your particular use of the workbook. These cells can be ignored/skipped."]
[]
["Special Instructions for Selected Cells"]
["Many cells have comments, as indicated by the red triangle in the upper left corner. These comments contain information on acceptable input values for that cell. The comments will be visible when you place your mouse cursor over or in the cell."]
[]
["Dropdown Boxes"]
["Some cells are dropdown boxes. When you place your cursor in the field, a small triangle will appear on the right-hand side of the box. You may click on the box and a list of acceptable values will appear. Note that only the values in the list may be selected. All other values are invalid."]
[]
["Dropdown Box Color Coding"]
["Green cells indicate a good or acceptable value."]
["Orange cells indicate an unfilled or neutral value (e.g., Not evaluated)"]
["Red cells indicate a problem at the site - enter a note in the questions section to explain the problem."]
[]
["% Difference Color Coding"]
["Green cells indicate a good or acceptable value, and no corrective action required."]
["Yellow cells indicate a recalibration is required but affected data do not need to be invalidated."]
["Red cells indicate a recalibration is required and affected data must be invalidated."]

{"sheet":"General Info","index":1,"n_rows":79,"n_cols":8,"rows_kept":79,"cut":false,"hidden":false,"merged":[[2,1,2,4],[2,5,2,6],[6,1,6,4],[7,1,7,4],[9,1,9,4],[8,5,8,10],[8,1,8,4],[3,5,3,10],[4,5,4,6],[6,5,6,10],[7,5,7,10],[9,5,9,6],[10,1,10,4],[10,5,10,6],[13,1,13,4],[11,1,11,4],[11,5,11,6],[12,5,12,6],[13,5,13,6],[12,1,12,4]]}
[null,"Chemical Speciation Network",null,null,null,null,"Version Date:","2024-10-16"]
[null,"General Information - Used by all Spreadsheets"]
[null,"Purpose/Use of Worksheet: ",null,null,null,"Select From Dropdown List"]
[null,"Monitoring Site Name/Location:"]
[null,"AQS Site ID:",null,null,null,null,null,{"$f":"IF(OR(ISBLANK(Location_Name),ISBLANK(AQS_Site_Code)),\"Missing Site Name or Site Code!\",\"\")","v":""}]
[]
[null,{"$f":"IF($F$3=\"Sampler Monthly Flow Check\",\"\",\"Auditor Name:\")","v":"Auditor Name:"}]
[null,{"$f":"IF($F$3=\"Sampler Monthly Flow Check\",\"\",\"Auditor Affiliation:\")","v":"Auditor Affiliation:"}]
[null,{"$f":"IF($F$3=\"Sampler Monthly Flow Check\",\"\",\"Observer(s) Name and Affiliation:\")","v":"Observer(s) Name and Affiliation:"}]
[null,"Operator Name:"]
[null,{"$f":"IF($F$3=\"Sampler Audit\",\"\",\"Operator Affiliation:\")","v":"Operator Affiliation:"}]
[null,{"$f":"IF($F$3=\"Sampler Monthly Flow Check\",\"\",IF($F$3=\"Sampler Audit\",\"\",\"Operator Phone Number:\"))","v":"Operator Phone Number:"}]
[null,{"$f":"IF(F3=\"Sampler Monthly Flow Check\",\"Agency Type:\",IF(F3=\"Sampler Audit\",\"Auditing Agency Type\",IF(F3=\"Technical System Audit\",\"Auditing Agency Type\",\"Agency Type\")))","v":"Agency Type"},null,null,null,"Select From Dropdown List",null,{"$f":"IF(OR(ISBLANK(F13),F13=\"Select From Dropdown List\"),\"Missing Agency Type!\",\"\")","v":"Missing Agency Type!"}]
[null,"Assessment Date:",null,null,null,null,null,{"$f":"IF(ISBLANK(F14),\"Missing Assessment Date!\",\"\")","v":"Missing Assessment Date!"}]
[]
[]
[]
[]
[]
[]
[]
[]
[]
[]
[]
[]
[]
[]
[]
[]
[]
[]
[]
[]
[]
[]
[]
[]
[]
[]
{"$rows_left_out":40}
{"sheet":"SASS_SuperSASS","index":2,"n_rows":141,"n_cols":11,"rows_kept":141,"cut":false,"hidden":false,"merged":[[22,3,22,5],[24,3,24,5],[23,4,23,5],[113,8,113,9],[135,8,135,9],[104,8,104,9],[36,6,37,6],[36,2,36,4],[1,4,2,4],[15,7,15,9],[4,7,4,9],[24,8,24,9],[43,7,43,9],[12,7,12,9],[23,8,23,9],[22,8,22,9],[33,1,35,9],[25,8,25,9],[19,8,19,9],[27,8,27,9],[25,4,25,5],[26,8,26,9],[27,4,27,5],[26,3,26,5],[19,3,19,5],[4,2,4,5],[13,2,13,5],[8,4,8,6],[15,1,15,2],[10,2,10,5],[11,2,11,5],[16,7,16,9],[15,3,15,5],[12,2,12,5],[5,2,5,5],[17,7,17,9],[10,7,10,9]]}
[null,"Chemical Speciation Network",null,null,null,null,{"$f":"IF(Purpose=\"Sampler Monthly Flow Check\", IF(Op_Aff=\"\",\"\",Op_Aff), IF(A_Aff=\"\",\"\",A_Aff))","v":""}]
[null,{"$f":"IF(Purpose=\"Sampler Monthly Flow Check\",\"Flow Check Worksheet\",\"Performance Audit Worksheet\")","v":"Performance Audit Worksheet"},null,null,"Version Date:"]
[null,"Met One SASS/Super SASS - Primary Sampler",null,null,null,{"$f":"IF(V_Date=\"\",\"\",V_Date)","v":"2024-10-16"}]
[null,"Note - blue fields are entered from 'General Info' worksheet or calculated - orange fields are to be filled in here"]
[null,"Location",{"$f":"IF(M_site=\"\",\"\",M_site)","v":""},null,null,null,"Date",{"$f":"IF('General Info'!F14=\"\",\"\",'General Info'!F14)","v":""}]
[null,"AQS Site ID",{"$f":"IF(S_ID=\"\",\"\",S_ID)","v":""},null,null,null,{"$f":"IF(OR(ISBLANK(Location_Name),ISBLANK(AQS_Site_Code),ISBLANK(D7),H5=\"\"),\"Missing Date, Site Name, Site Code, or POC\",\"\")","v":"Missing Date, Site Name, Site Code, or POC"}]
[null,"AQS Sampler POC"]
[null,"Site Information"]
[null,null,null,"Sampler Type (Model)","Select From Dropdown List"]
[]
[null,"Auditor(s)",{"$f":"IF(A_Name=\"\",\"\",A_Name)","v":""},null,null,null,"Affiliation",{"$f":"IF(A_Aff=\"\",\"\",A_Aff)","v":""}]
[null,{"$f":"IF(Purpose=\"Sampler Monthly Flow Check\",\"Agency Type\",\"Audit Type\")","v":"Audit Type"},{"$f":"IF(A_Type=\"\",\"\",IF(A_Type=\"Select From Dropdown List\",\"\",A_Type))","v":""},null,null,null,{"$f":"IF(OR(ISBLANK(C12),'General Info'!F13=\"Select From Dropdown List\"),\"Missing Agency Type!\",\"\")","v":"Missing Agency Type!"}]
[null,"Operator(s)",{"$f":"IF(OP_Name=\"\",\"\",OP_Name)","v":""},null,null,null,"Affiliation",{"$f":"IF(Op_Aff=\"\",\"\",Op_Aff)","v":""}]
[null,"Phone No.",{"$f":"IF(Phone=\"\",\"\",Phone)","v":""}]
[]
[null,null,null,null,null,null,"Sampler S/N"]
[null,null,null,null,null,null,"Head S/N"]
[null,null,null,null,null,null,"Pump S/N"]
[]
[null,null,"Last Calibration Date"]
[]
[null,"Reference Standards"]
[null,null,"Flow Reference Std Model","Select From Dropdown List",null,null,null,"Standard S/N"]
[null,null,null,"Specify if \"Other\"",null,null,null,"Calibration Date"]
[null,null,"Temperature Ref Std Model",null,null,null,null,"Standard S/N"]
[null,null,null,"Specify if \"Other\"",null,null,null,"Calibration Date"]
[null,null,"BP Std Model",null,null,null,null,"Standard S/N"]
[null,null,null,"Specify if \"Other\"",null,null,null,"Calibration Date"]
[]
[]
[]
[null,{"$f":"B3","v":"Met One SASS/Super SASS - Primary Sampler"}]
[null,"Clock/timer Verification"]
[null,"If local time is under daylight saving, convert Ref Std to Local Standard Time. Daylight Saving Time begins for most of the United States at 2:00 a.m. on the second Sunday of March. Time reverts to standard time at 2:00 a.m. on the first Sunday of November."]
[]
[]
[null,null,"Time (hh:mm)",null,null,null,"Difference Minutes",null,"     1 minutes or less?"]
[null,null,"Ref Std",null,"SASS",null,null,null,"Pass","Fail"]
[null,"Check Time",null,null,null,null,{"$f":"IF(ISBLANK(SA_01_00_TI_S),\"\",ROUND(((SA_01_00_D_S+SA_01_00_TI_S)-(SA_01_00_D_R+SA_01_00_TI_R))*24*60,0))","v":""},null,{"$f":"IF(C39=\"\",\"\",IF(ABS(G39)<=1,\"X\",\"\"))","v":""},{"$f":"IF(C39=\"\",\"\",IF(ABS(G39)>1,\"X\",\"\"))","v":""}]
[null,"Date",{"$f":"Audit_Date","v":""},null,null,{"$f":"IF(ISBLANK(E40), \"Missing Sampler Date!\",IF(INT(C40)<>INT(E40),\"Sampler and Audit Clock Dates Don't Match!\",\"\"))","v":"Missing Sampler Date!"}]
{"$rows_left_out":102}
{"sheet":"SASS_Super SASS collocated","index":3,"n_rows":141,"n_cols":11,"rows_kept":141,"cut":false,"hidden":false,"merged":[[135,8,135,9],[33,1,35,9],[36,2,36,4],[36,6,37,6],[43,7,43,9],[104,8,104,9],[113,8,113,9],[26,3,26,5],[26,8,26,9],[25,8,25,9],[23,4,23,5],[25,4,25,5],[24,3,24,5],[27,4,27,5],[27,8,27,9],[4,2,4,5],[12,2,12,5],[12,7,12,9],[13,2,13,5],[15,1,15,2],[15,3,15,5],[8,4,8,6],[15,7,15,9],[4,7,4,9],[5,2,5,5],[16,7,16,9],[17,7,17,9],[19,3,19,5],[19,8,19,9],[1,4,2,4],[24,8,24,9],[23,8,23,9],[22,8,22,9],[10,2,10,5],[11,2,11,5],[22,3,22,5],[10,7,10,9]]}
[null,"Chemical Speciation Network",null,null,null,null,{"$f":"IF(Purpose=\"Sampler Monthly Flow Check\", IF(Op_Aff=\"\",\"\",Op_Aff), IF(A_Aff=\"\",\"\",A_Aff))","v":""}]
[null,{"$f":"IF(Purpose=\"Sampler Monthly Flow Check\",\"Flow Check Worksheet\",\"Performance Audit Worksheet\")","v":"Performance Audit Worksheet"},null,null,"Version Date:"]
[null,"Met One SASS/Super SASS - Collocated Sampler",null,null,null,{"$f":"IF(V_Date=\"\",\"\",V_Date)","v":"2024-10-16"}]
[null,"Note - blue fields are entered from 'General Info' worksheet or calculated - orange fields are to be filled in here"]
[null,"Location",{"$f":"IF(M_site=\"\",\"\",M_site)","v":""},null,null,null,"Date",{"$f":"IF('General Info'!F14=\"\",\"\",'General Info'!F14)","v":""}]
[null,"AQS Site ID",{"$f":"IF(S_ID=\"\",\"\",S_ID)","v":""},null,null,null,{"$f":"IF(OR(ISBLANK(Location_Name),ISBLANK(AQS_Site_Code),ISBLANK(D7),H5=\"\"),\"Missing Date, Site Name, Site Code, or POC\",\"\")","v":"Missing Date, Site Name, Site Code, or POC"}]
[null,"AQS Sampler POC"]
[null,"Site Information"]
[null,null,null,"Sampler Type (Model)","Select From Dropdown List"]
[]
[null,"Auditor(s)",{"$f":"IF(A_Name=\"\",\"\",A_Name)","v":""},null,null,null,"Affiliation",{"$f":"IF(A_Aff=\"\",\"\",A_Aff)","v":""}]
[null,{"$f":"IF(Purpose=\"Sampler Monthly Flow Check\",\"Agency Type\",\"Audit Type\")","v":"Audit Type"},{"$f":"IF(A_Type=\"\",\"\",IF(A_Type=\"Select From Dropdown List\",\"\",A_Type))","v":""},null,null,null,{"$f":"IF(OR(ISBLANK(C12),'General Info'!F13=\"Select From Dropdown List\"),\"Missing Agency Type!\",\"\")","v":"Missing Agency Type!"}]
[null,"Operator(s)",{"$f":"IF(OP_Name=\"\",\"\",OP_Name)","v":""},null,null,null,"Affiliation",{"$f":"IF(Op_Aff=\"\",\"\",Op_Aff)","v":""}]
[null,"Phone No.",{"$f":"IF(Phone=\"\",\"\",Phone)","v":""}]
[]
[null,null,null,null,null,null,"Sampler S/N"]
[null,null,null,null,null,null,"Head S/N"]
[null,null,null,null,null,null,"Pump S/N"]
[]
[null,null,"Last Calibration Date"]
[]
[null,"Reference Standards"]
[null,null,"Flow Reference Std Model","Select From Dropdown List",null,null,null,"Standard S/N"]
[null,null,null,"Specify if \"Other\"",null,null,null,"Calibration Date"]
[null,null,"Temperature Ref Std Model",null,null,null,null,"Standard S/N"]
[null,null,null,"Specify if \"Other\"",null,null,null,"Calibration Date"]
[null,null,"BP Std Model",null,null,null,null,"Standard S/N"]
[null,null,null,"Specify if \"Other\"",null,null,null,"Calibration Date"]
[]
[]
[]
[null,{"$f":"B3","v":"Met One SASS/Super SASS - Collocated Sampler"}]
[null,"Clock/timer Verification"]
[null,"If local time is under daylight saving, convert Ref Std to Local Standard Time. Daylight Saving Time begins for most of the United States at 2:00 a.m. on the second Sunday of March. Time reverts to standard time at 2:00 a.m. on the first Sunday of November."]
[]
[]
[null,null,"Time (hh:mm)",null,null,null,"Difference Minutes",null,"     1 minutes or less?"]
[null,null,"Ref Std",null,"SASS",null,null,null,"Pass","Fail"]
[null,"Check Time",null,null,null,null,{"$f":"IF(ISBLANK(SA_02_00_D_S),\"\",ROUND(((SA_02_00_D_S+SA_02_00_TI_S_R)-(SA_02_00_D_R+SA_02_00_TI_R_R))*24*60,0))","v":""},null,{"$f":"IF(C39=\"\",\"\",IF(ABS(G39)<=1,\"X\",\"\"))","v":""},{"$f":"IF(C39=\"\",\"\",IF(ABS(G39)>1,\"X\",\"\"))","v":""}]
[null,"Date",{"$f":"Audit_Date","v":""},null,null,{"$f":"IF(ISBLANK(E40), \"Missing Sampler Date!\",IF(INT(C40)<>INT(E40),\"Sampler and Audit Clock Dates Don't Match!\",\"\"))","v":"Missing Sampler Date!"}]
{"$rows_left_out":102}
{"sheet":"URG","index":4,"n_rows":81,"n_cols":11,"rows_kept":81,"cut":false,"hidden":false,"merged":[[69,8,69,9],[76,8,76,9],[82,1,82,9],[33,1,35,9],[36,2,36,4],[36,6,37,6],[43,7,43,9],[25,4,25,5],[23,4,23,5],[25,8,25,9],[24,3,24,5],[20,8,20,9],[21,8,21,9],[22,8,22,9],[22,3,22,5],[24,8,24,9],[1,4,2,4],[4,2,4,5],[5,2,5,5],[4,7,4,9],[21,4,21,5],[9,2,9,5],[14,7,14,9],[9,7,9,9],[14,3,14,5],[10,2,10,5],[15,7,15,9],[18,3,18,5],[11,2,11,5],[11,7,11,9],[12,2,12,5],[16,7,16,9],[20,3,20,5],[23,8,23,9]]}
[null,"Chemical Speciation Network",null,null,null,null,{"$f":"IF(Purpose=\"Sampler Monthly Flow Check\", IF(Op_Aff=\"\",\"\",Op_Aff), IF(A_Aff=\"\",\"\",A_Aff))","v":""}]
[null,{"$f":"IF(Purpose=\"Sampler Monthly Flow Check\",\"Flow Check Worksheet\",\"Performance Audit Worksheet\")","v":"Performance Audit Worksheet"},null,null,"Version Date:"]
[null,"URG 3000N - Primary Sampler",null,null,null,{"$f":"IF(V_Date=\"\",\"\",V_Date)","v":"2024-10-16"}]
[null,"Note - blue fields are entered from 'General Info' worksheet or calculated - orange fields are to be filled in here"]
[null,"Location",{"$f":"IF(M_site=\"\",\"\",M_site)","v":""},null,null,null,"Date",{"$f":"IF('General Info'!F14=\"\",\"\",'General Info'!F14)","v":""}]
[null,"AQS Site ID",{"$f":"IF(S_ID=\"\",\"\",S_ID)","v":""},null,null,null,{"$f":"IF(OR(ISBLANK(Location_Name),ISBLANK(AQS_Site_Code),ISBLANK(D7),H5=\"\"),\"Missing Date, Site Name, Site Code, or POC\",\"\")","v":"Missing Date, Site Name, Site Code, or POC"}]
[null,"AQS Sampler POC"]
[null,"Site Information"]
[]
[null,"Auditor(s)",{"$f":"IF(A_Name=\"\",\"\",A_Name)","v":""},null,null,null,"Affiliation",{"$f":"IF(A_Aff=\"\",\"\",A_Aff)","v":""}]
[null,{"$f":"IF(Purpose=\"Sampler Monthly Flow Check\",\"Agency Type\",\"Audit Type\")","v":"Audit Type"},{"$f":"IF(A_Type=\"\",\"\",IF(A_Type=\"Select From Dropdown List\",\"\",A_Type))","v":""},null,null,null,{"$f":"IF(OR(ISBLANK(C12),'General Info'!F13=\"Select From Dropdown List\"),\"Missing Agency Type!\",\"\")","v":"Missing Agency Type!"}]
[null,"Operator(s)",{"$f":"IF(OP_Name=\"\",\"\",OP_Name)","v":""},null,null,null,"Affiliation",{"$f":"IF(Op_Aff=\"\",\"\",Op_Aff)","v":""}]
[null,"Phone No.",{"$f":"IF(Phone=\"\",\"\",Phone)","v":""}]
[]
[null,null,"Sampler Model","URG 3000 N",null,null,"Controller S/N"]
[null,null,null,null,null,null,"Pump S/N"]
[null,null,null,null,null,null,"Sampler S/N"]
[]
[null,null,"Last Calibration Date"]
[null,"Reference Standards"]
[null,null,"Flow Reference Std Model","Select From Dropdown List",null,null,null,"Standard S/N"]
[null,null,null,"Specify if \"Other\"",null,null,null,"Calibration Date"]
[null,null,"Temperature Ref Std Model","Select From Dropdown List",null,null,null,"Standard S/N"]
[null,null,null,"Specify if \"Other\"",null,null,null,"Calibration Date"]
[null,null,"BP Std Model","Select From Dropdown List",null,null,null,"Standard S/N"]
[null,null,null,"Specify if \"Other\"",null,null,null,"Calibration Date"]
[]
[]
[]
[]
[]
[null,{"$f":"B3","v":"URG 3000N - Primary Sampler"}]
[null,"Clock/timer Verification"]
[null,"If local time is under daylight saving, convert Ref Std to Local Standard Time. Daylight Saving Time begins for most of the United States at 2:00 a.m. on the second Sunday of March. Time reverts to standard time at 2:00 a.m. on the first Sunday of November."]
[]
[]
[null,null,"Time (hh:mm)",null,null,null,"Difference Minutes",null,"     1 minutes or less?"]
[null,null,"Ref Std",null,"URG",null,null,null,"Pass","Fail"]
[null,"Check Time",null,null,null,null,{"$f":"IF(ISBLANK(URG_01_00_TI_S),\"\",ROUND(((URG_01_00_D_S+URG_01_00_TI_S)-(URG_01_00_D_R+URG_01_00_TI_R))*24*60,0))","v":""},null,{"$f":"IF(C39=\"\",\"\",IF(ABS(G39)<=1,\"X\",\"\"))","v":""},{"$f":"IF(C39=\"\",\"\",IF(ABS(G39)>1,\"X\",\"\"))","v":""}]
[null,"Date",{"$f":"Audit_Date3","v":""},null,null,{"$f":"IF(ISBLANK(E40), \"Missing Sampler Date!\",IF(INT(C40)<>INT(E40),\"Sampler and Audit Clock Dates Don't Match!\",\"\"))","v":"Missing Sampler Date!"}]
{"$rows_left_out":42}
{"sheet":"URG_collocated","index":5,"n_rows":81,"n_cols":11,"rows_kept":81,"cut":false,"hidden":false,"merged":[[82,1,82,9],[33,1,35,9],[36,2,36,4],[36,6,37,6],[43,7,43,9],[69,8,69,9],[76,8,76,9],[24,3,24,5],[24,8,24,9],[25,4,25,5],[25,8,25,9],[22,3,22,5],[23,8,23,9],[23,4,23,5],[22,8,22,9],[9,2,9,5],[11,2,11,5],[11,7,11,9],[12,2,12,5],[1,4,2,4],[4,2,4,5],[5,2,5,5],[4,7,4,9],[9,7,9,9],[10,2,10,5],[18,3,18,5],[14,7,14,9],[20,3,20,5],[21,8,21,9],[21,4,21,5],[14,3,14,5],[15,7,15,9],[16,7,16,9],[20,8,20,9]]}
[null,"Chemical Speciation Network",null,null,null,null,{"$f":"IF(Purpose=\"Sampler Monthly Flow Check\", IF(Op_Aff=\"\",\"\",Op_Aff), IF(A_Aff=\"\",\"\",A_Aff))","v":""}]
[null,{"$f":"IF(Purpose=\"Sampler Monthly Flow Check\",\"Flow Check Worksheet\",\"Performance Audit Worksheet\")","v":"Performance Audit Worksheet"},null,null,"Version Date:"]
[null,"URG 3000N - Collocated Sampler",null,null,null,{"$f":"IF(V_Date=\"\",\"\",V_Date)","v":"2024-10-16"}]
[null,"Note - blue fields are entered from 'General Info' worksheet or calculated - orange fields are to be filled in here"]
[null,"Location",{"$f":"IF(M_site=\"\",\"\",M_site)","v":""},null,null,null,"Date",{"$f":"IF('General Info'!F14=\"\",\"\",'General Info'!F14)","v":""}]
[null,"AQS Site ID",{"$f":"IF(S_ID=\"\",\"\",S_ID)","v":""},null,null,null,{"$f":"IF(OR(ISBLANK(Location_Name),ISBLANK(AQS_Site_Code),ISBLANK(D7),H5=\"\"),\"Missing Date, Site Name, Site Code, or POC\",\"\")","v":"Missing Date, Site Name, Site Code, or POC"}]
[null,"AQS Sampler POC"]
[null,"Site Information"]
[]
[null,"Auditor(s)",{"$f":"IF(A_Name=\"\",\"\",A_Name)","v":""},null,null,null,"Affiliation",{"$f":"IF(A_Aff=\"\",\"\",A_Aff)","v":""}]
[null,{"$f":"IF(Purpose=\"Sampler Monthly Flow Check\",\"Agency Type\",\"Audit Type\")","v":"Audit Type"},{"$f":"IF(A_Type=\"\",\"\",IF(A_Type=\"Select From Dropdown List\",\"\",A_Type))","v":""},null,null,null,{"$f":"IF(OR(ISBLANK(C12),'General Info'!F13=\"Select From Dropdown List\"),\"Missing Agency Type!\",\"\")","v":"Missing Agency Type!"}]
[null,"Operator(s)",{"$f":"IF(OP_Name=\"\",\"\",OP_Name)","v":""},null,null,null,"Affiliation",{"$f":"IF(Op_Aff=\"\",\"\",Op_Aff)","v":""}]
[null,"Phone No.",{"$f":"IF(Phone=\"\",\"\",Phone)","v":""}]
[]
[null,null,"Sampler Model","URG 3000 N",null,null,"Controller S/N"]
[null,null,null,null,null,null,"Pump S/N"]
[null,null,null,null,null,null,"Sampler S/N"]
[]
[null,null,"Last Calibration Date"]
[null,"Reference Standards"]
[null,null,"Flow Reference Std Model","Select From Dropdown List",null,null,null,"Standard S/N"]
[null,null,null,"Specify if \"Other\"",null,null,null,"Calibration Date"]
[null,null,"Temperature Ref Std Model","Select From Dropdown List",null,null,null,"Standard S/N"]
[null,null,null,"Specify if \"Other\"",null,null,null,"Calibration Date"]
[null,null,"BP Std Model","Select From Dropdown List",null,null,null,"Standard S/N"]
[null,null,null,"Specify if \"Other\"",null,null,null,"Calibration Date"]
[]
[]
[]
[]
[]
[null,{"$f":"B3","v":"URG 3000N - Collocated Sampler"}]
[null,"Clock/timer Verification"]
[null,"If local time is under daylight saving, convert Ref Std to Local Standard Time. Daylight Saving Time begins for most of the United States at 2:00 a.m. on the second Sunday of March. Time reverts to standard time at 2:00 a.m. on the first Sunday of November."]
[]
[]
[null,null,"Time (hh:mm)",null,null,null,"Difference Minutes",null,"     1 minutes or less?"]
[null,null,"Ref Std",null,"URG",null,null,null,"Pass","Fail"]
[null,"Check Time",null,null,null,null,{"$f":"IF(ISBLANK(URG_01_00_TI_S),\"\",ROUND(((URG_01_00_D_S+URG_01_00_TI_S)-(URG_01_00_D_R+URG_01_00_TI_R))*24*60,0))","v":""},null,{"$f":"IF(C39=\"\",\"\",IF(ABS(G39)<=1,\"X\",\"\"))","v":""},{"$f":"IF(C39=\"\",\"\",IF(ABS(G39)>1,\"X\",\"\"))","v":""}]
[null,"Date",{"$f":"Audit_Date3","v":""},null,null,{"$f":"IF(ISBLANK(E40), \"Missing Sampler Date!\",IF(INT(C40)<>INT(E40),\"Sampler and Audit Clock Dates Don't Match!\",\"\"))","v":"Missing Sampler Date!"}]
{"$rows_left_out":42}
{"sheet":"Reference","index":6,"n_rows":54,"n_cols":1,"rows_kept":54,"cut":false,"hidden":true,"merged":[]}
["This spreadsheet will be hidden in the final version"]
["YNO Box Values"]
["Not_Evaluated"]
["Yes"]
["No"]
["Not_Applicable"]
["Other"]
[]
[]
["SASS Channel Configurations"]
["Select From Dropdown List"]
["SASS "]
["Super SASS"]
[]
[]
["Audit Types"]
["Flow Verification by Site Operator"]
["PQAO"]
["Reporting Org"]
["Federal"]
["Federal Contractor"]
[]
["Flow Reference Methods"]
["Select From Dropdown List"]
["BGI DELTACAL"]
["BGI TETRACAL"]
["BGI TRI CAL"]
["BIOS 20K"]
["BIOS 30K"]
["BIOS 40K"]
["BIOS DEFENDER"]
["BUBBLE FLOW METER"]
["CERTIFIED ORIFICE DEVICE"]
["CHINOOK FTS"]
["DRY TEST METER"]
["DRYCAL DC2 FLOWMETER"]
["ROOTSMETER (CERTIFIED)"]
["WET TEST METER"]
["OTHER FLOW STANDARDS"]
[]
{"$rows_left_out":14}