{"text_format":"1","workbook":"xlsx","n_sheets":21,"sheets":["Control","Dataframe","Dataframe_Sum","Natural Gas - Production","Natural Gas - Transmission","Natural Gas - Distribution","Natural Gas - Venting_Flaring","Petroleum Systems","Additional Emission Sources","Summary","Tracker","Uncertainty","Gas Data Sources","Additional Data Sources","Oil Data Sources","Emission Factors","Production Data","Data","ListData","Notes","Number of Wells"],"not_rendered":{"charts":1,"images":109,"macros":1,"external_links":0,"defined_names":71,"comments":5,"pivot_tables":0},"unopened":[],"bounds":{"document_bytes":16777216,"sheet_cells":100000,"rows_first":2000,"rows_last":500,"rows_between":2000,"halvings":0,"cell_chars":16384,"cell_head_chars":4096},"cells_cut":0,"cells_raw":0,"read":"whole","date_system":"1900"}

{"sheet":"Control","index":0,"n_rows":79,"n_cols":9,"rows_kept":79,"cut":false,"hidden":false,"merged":[[27,1,30,1],[8,0,8,5],[29,2,29,3],[25,0,25,4],[0,0,0,6]]}
["State Inventory Tool - Emissions from Natural Gas and Oil Systems\nVersion 2025.2"]
["This module provides default activity data, emission factors, and other relevant metrics for 1990-2022. Emissions Factors are proxied for 2023-2025."]
[]
["1. Choose a State."]
["This is very important - it selects the correct default variables for your state."]
[]
["2. - 5. Enter emission factors and activity data for natural gas production and proceed to the respective worksheets to enter activity data."]
["Either type in the value or click the default box."]
["Emission factors express the amount of methane emitted per activity unit (e.g. per mile of pipeline, per transmission compressor station, etc.) or the amount of carbon dioxide emitted per activity unit (e.g. per Btu of natural gas vented and flared) each year. The default values are based on national data. Please use state-specific data whenever possible."]
[]
["Natural Gas Emission Factors"]
[null,null,"Activity ",null,null,"Default Emission Factor",null,"Factor Used","Use Default? (Check for Yes)"]
["2. Enter Emission Factors and Activity Data for Natural Gas Production"]
[null,null,"Metric tons of CH4 per Well",null,null,"Variable by year"]
[null,null,"Metric tons of CH4 per shallow water off-shore platforms in the Gulf of Mexico and Pacific",null,null,{"$f":"ShallowWaterEF","v":8899}]
[null,null,"Metric tons of CH4 per deepwater off-shore platforms in the Gulf of Mexico and Pacific",null,null,{"$f":"DeepWaterEF","v":93836}]
[]
[]
["3. Enter Emission Factors and Activity Data for Natural Gas Transmission"]
[null,null,"Metric tons of CH4 per mile of gathering pipeline ",null,null,0.4]
[null,null,"Metric tons of CH4 per gas processing plant",null,null,1249.95]
[null,null,"Metric tons of CH4 per gas transmission compressor station",null,null,983.66]
[null,null,"Metric tons of CH4 per gas storage compressor station",null,null,964.15]
[null,null,"Metric tons of CH4 per mile of transmission pipeline",null,null,0.62]
[null,null,"Metric tons of CH4 per LNG storage compressor station",null,null,1184.99]
["4. Enter Emission Factors and Activity Data for Natural Gas Distribution\nTwo methodologies for calculating emissions are presented below.  If you have emission factors and data available for the preferred methodology, please estimate emissions for this methodology.  Otherwise, please use the alternate methodology."]
[null,null,"Preferred Methodology"]
[null,null,"Metric tons of CH4 per mile of cast iron distribution pipeline",null,null,5.8]
[null,null,"Metric tons of CH4 per mile of unprotected steel distribution pipeline",null,null,2.12]
[null,null,"Metric tons of CH4 per mile of protected steel distribution pipeline",null,null,0.06]
[null,null,"Metric tons of CH4 per mile of plastic distribution pipeline",null,null,0.37]
[null,null,"Alternate Methodology"]
[null,null,"Metric tons of CH4 per mile of distribution pipeline ",null,null,0.54]
[]
[null,null,"Metric tons of CH4 per service",null,null,0.02]
[null,null,"Metric tons of CH4 per unprotected steel services",null,null,0.03]
[null,null,"Metric tons of CH4 per protected steel services",null,null,3.0000000000000001E-3]
[]
["5. Enter Emission Factors and Activity Data for Natural Gas Venting and Flaring"]
[null,null,"Metric tons of CO2 per Billion BTUs of natural gas vented and flared",null,null,54.71]
[]
["Petroleum Systems Emission Factors"]
[]
["6. Enter Emission Factors and Activity Data for Petroleum Systems"]
[null,null,"Activity ","Units",null,"Default Emission Factor",null,{"$f":"F45","v":"Default Emission Factor"},"Use Default? (Check for Yes)"]
[]
[null,null,"Oil Production","kg CH4/1000 barrels (bbl)",null,"Variable by year"]
[null,null,"Oil Refining","kg CH4/1000 bbl",null,"Variable by year"]
[null,null,"Oil Transportation","kg CH4/1000 bbl",null,"Variable by year"]
[]
["7. Proceed to the Additional Emission Sources worksheet."]
[]
[]
[]
[]
[]
[{"$f":"\"8. Proceed to Summary worksheet for emissions summary for \"&ListData!D2&\".\"","v":"8. Proceed to Summary worksheet for emissions summary for Select a State . . .."}]
[]
[]
[]
[]
[]
[]
["9. Export the results for use in the Synthesis Tool."]
[]
[]
[]
[]
[]
[]
[]
["Constants"]
["The default GWPs used in this module are from the IPCC Fifth Assessment Report (AR5) but can be adjusted in the cells below to reflect other sources."]
[null,null,"kg/Gg",1000000]
[null,null,"kg/metric ton",1000]
[null,null,"Kbarrels/MMbarrels",1000]
[null,null,"days/year",365]
[null,null,"Methane Global Warming Potential",28]
[null,null,"metric tons CO2 / metric ton C",{"$f":"44/12","v":3.6666666666666665}]

{"sheet":"Dataframe","index":1,"n_rows":3,"n_cols":38,"rows_kept":3,"cut":false,"hidden":true,"merged":[]}
["Emissions (MMTCO2 Eq.)","Category",1990,1991,1992,1993,1994,1995,1996,1997,1998,1999,2000,2001,2002,2003,2004,2005,2006,2007,2008,2009,2010,2011,2012,2013,2014,2015,2016,2017,2018,2019,2020,2021,2022,2023,2024,2025]
["Natural Gas","Energy - Natural Gas and Oil Systems - Natural Gas",{"$f":"Summary!C12","v":0},{"$f":"Summary!D12","v":"-"},{"$f":"Summary!E12","v":"-"},{"$f":"Summary!F12","v":"-"},{"$f":"Summary!G12","v":"-"},{"$f":"Summary!H12","v":"-"},{"$f":"Summary!I12","v":"-"},{"$f":"Summary!J12","v":"-"},{"$f":"Summary!K12","v":"-"},{"$f":"Summary!L12","v":"-"},{"$f":"Summary!M12","v":"-"},{"$f":"Summary!N12","v":"-"},{"$f":"Summary!O12","v":"-"},{"$f":"Summary!P12","v":"-"},{"$f":"Summary!Q12","v":"-"},{"$f":"Summary!R12","v":"-"},{"$f":"Summary!S12","v":"-"},{"$f":"Summary!T12","v":"-"},{"$f":"Summary!U12","v":"-"},{"$f":"Summary!V12","v":"-"},{"$f":"Summary!W12","v":"-"},{"$f":"Summary!X12","v":"-"},{"$f":"Summary!Y12","v":"-"},{"$f":"Summary!Z12","v":"-"},{"$f":"Summary!AA12","v":"-"},{"$f":"Summary!AB12","v":"-"},{"$f":"Summary!AC12","v":"-"},{"$f":"Summary!AD12","v":"-"},{"$f":"Summary!AE12","v":"-"},{"$f":"Summary!AF12","v":"-"},{"$f":"Summary!AG12","v":"-"},{"$f":"Summary!AH12","v":"-"},{"$f":"Summary!AI12","v":"-"},{"$f":"Summary!AJ12","v":"-"},{"$f":"Summary!AK12","v":"-"},{"$f":"Summary!AL12","v":"-"}]
["Oil","Energy - Natural Gas and Oil Systems - Oil",{"$f":"Summary!C13","v":0},{"$f":"Summary!D13","v":0},{"$f":"Summary!E13","v":0},{"$f":"Summary!F13","v":0},{"$f":"Summary!G13","v":0},{"$f":"Summary!H13","v":0},{"$f":"Summary!I13","v":0},{"$f":"Summary!J13","v":0},{"$f":"Summary!K13","v":0},{"$f":"Summary!L13","v":0},{"$f":"Summary!M13","v":0},{"$f":"Summary!N13","v":0},{"$f":"Summary!O13","v":0},{"$f":"Summary!P13","v":0},{"$f":"Summary!Q13","v":0},{"$f":"Summary!R13","v":0},{"$f":"Summary!S13","v":0},{"$f":"Summary!T13","v":0},{"$f":"Summary!U13","v":0},{"$f":"Summary!V13","v":0},{"$f":"Summary!W13","v":0},{"$f":"Summary!X13","v":0},{"$f":"Summary!Y13","v":0},{"$f":"Summary!Z13","v":0},{"$f":"Summary!AA13","v":0},{"$f":"Summary!AB13","v":0},{"$f":"Summary!AC13","v":0},{"$f":"Summary!AD13","v":0},{"$f":"Summary!AE13","v":0},{"$f":"Summary!AF13","v":0},{"$f":"Summary!AG13","v":0},{"$f":"Summary!AH13","v":0},{"$f":"Summary!AI13","v":0},{"$f":"Summary!AJ13","v":0},{"$f":"Summary!AK13","v":0},{"$f":"Summary!AL13","v":0}]

{"sheet":"Dataframe_Sum","index":2,"n_rows":2,"n_cols":38,"rows_kept":2,"cut":false,"hidden":true,"merged":[]}
["Emissions (MMTCO2 Eq.)","Category",1990,1991,1992,1993,1994,1995,1996,1997,1998,1999,2000,2001,2002,2003,2004,2005,2006,2007,2008,2009,2010,2011,2012,2013,2014,2015,2016,2017,2018,2019,2020,2021,2022,2023,2024,2025]
["Total","Energy - Natural Gas and Oil Systems",{"$f":"Summary!C12+Summary!C13","v":0},{"$f":"Summary!D12+Summary!D13","v":{"$error":"#VALUE!"}},{"$f":"Summary!E12+Summary!E13","v":{"$error":"#VALUE!"}},{"$f":"Summary!F12+Summary!F13","v":{"$error":"#VALUE!"}},{"$f":"Summary!G12+Summary!G13","v":{"$error":"#VALUE!"}},{"$f":"Summary!H12+Summary!H13","v":{"$error":"#VALUE!"}},{"$f":"Summary!I12+Summary!I13","v":{"$error":"#VALUE!"}},{"$f":"Summary!J12+Summary!J13","v":{"$error":"#VALUE!"}},{"$f":"Summary!K12+Summary!K13","v":{"$error":"#VALUE!"}},{"$f":"Summary!L12+Summary!L13","v":{"$error":"#VALUE!"}},{"$f":"Summary!M12+Summary!M13","v":{"$error":"#VALUE!"}},{"$f":"Summary!N12+Summary!N13","v":{"$error":"#VALUE!"}},{"$f":"Summary!O12+Summary!O13","v":{"$error":"#VALUE!"}},{"$f":"Summary!P12+Summary!P13","v":{"$error":"#VALUE!"}},{"$f":"Summary!Q12+Summary!Q13","v":{"$error":"#VALUE!"}},{"$f":"Summary!R12+Summary!R13","v":{"$error":"#VALUE!"}},{"$f":"Summary!S12+Summary!S13","v":{"$error":"#VALUE!"}},{"$f":"Summary!T12+Summary!T13","v":{"$error":"#VALUE!"}},{"$f":"Summary!U12+Summary!U13","v":{"$error":"#VALUE!"}},{"$f":"Summary!V12+Summary!V13","v":{"$error":"#VALUE!"}},{"$f":"Summary!W12+Summary!W13","v":{"$error":"#VALUE!"}},{"$f":"Summary!X12+Summary!X13","v":{"$error":"#VALUE!"}},{"$f":"Summary!Y12+Summary!Y13","v":{"$error":"#VALUE!"}},{"$f":"Summary!Z12+Summary!Z13","v":{"$error":"#VALUE!"}},{"$f":"Summary!AA12+Summary!AA13","v":{"$error":"#VALUE!"}},{"$f":"Summary!AB12+Summary!AB13","v":{"$error":"#VALUE!"}},{"$f":"Summary!AC12+Summary!AC13","v":{"$error":"#VALUE!"}},{"$f":"Summary!AD12+Summary!AD13","v":{"$error":"#VALUE!"}},{"$f":"Summary!AE12+Summary!AE13","v":{"$error":"#VALUE!"}},{"$f":"Summary!AF12+Summary!AF13","v":{"$error":"#VALUE!"}},{"$f":"Summary!AG12+Summary!AG13","v":{"$error":"#VALUE!"}},{"$f":"Summary!AH12+Summary!AH13","v":{"$error":"#VALUE!"}},{"$f":"Summary!AI12+Summary!AI13","v":{"$error":"#VALUE!"}},{"$f":"Summary!AJ12+Summary!AJ13","v":{"$error":"#VALUE!"}},{"$f":"Summary!AK12+Summary!AK13","v":{"$error":"#VALUE!"}},{"$f":"Summary!AL12+Summary!AL13","v":{"$error":"#VALUE!"}}]

{"sheet":"Natural Gas - Production","index":3,"n_rows":326,"n_cols":12,"rows_kept":326,"cut":false,"hidden":false,"merged":[]}
[null,{"$f":"\"2. Emissions from Natural Gas Production Activities in \"&ListData!D2","v":"2. Emissions from Natural Gas Production Activities in Select a State . . ."}]
[null,{"$f":"VLOOKUP(StateID,ListData!$B$3:$D$53,3,FALSE)","v":"XX"}]
[null,{"$f":"Region","v":{"$error":"#N/A"}}]
[null,"Natural Gas - Production",null,1990]
[]
[null,null,null,"Activity Data",null,"Emission Factor",null,"Metric Tons CH4",null,"MMTCO2E",null,"MMTCE"]
[null,null,null,null,null,"metric tons CH4 per year per activity unit"]
[null,"Total number of wells",null,null,"x",{"$f":"VLOOKUP($B$3,WellEFbyRegion,D4-1988,FALSE)","v":{"$error":"#N/A"}},"=",{"$f":"D8*F8","v":{"$error":"#N/A"}},"=",{"$f":"H8*MethGWP*10^-6","v":{"$error":"#N/A"}},"=",{"$f":"J8/CO2_C","v":{"$error":"#N/A"}}]
[null,"Number of shallow water off-shore platforms in the Gulf of Mexico and Pacific",null,null,"x",{"$f":"Control!$H$15","v":0},"=",{"$f":"D9*F9","v":0},"=",{"$f":"H9*MethGWP*10^-6","v":0},"=",{"$f":"J9/CO2_C","v":0}]
[null,"Number of deepwater off-shore platforms in the Gulf of Mexico and Pacific",null,null,"x",{"$f":"Control!$H$16","v":0},"=",{"$f":"D10*F10","v":0},"=",{"$f":"H10*MethGWP*10^-6","v":0},"=",{"$f":"J10/CO2_C","v":0}]
[null,"Total  ",null,null,null,null,null,{"$f":"SUM(H8:H10)","v":{"$error":"#N/A"}},"=",{"$f":"H11*MethGWP*10^-6","v":{"$error":"#N/A"}},"=",{"$f":"J11/CO2_C","v":{"$error":"#N/A"}}]
[]
[null,"Natural Gas - Production",null,{"$f":"D4+1","v":1991}]
[]
[null,null,null,"Activity Data",null,"Emission Factor",null,"Metric Tons CH4",null,"MMTCO2E",null,"MMTCE"]
[null,null,null,null,null,"metric tons CH4 per year per activity unit"]
[null,"Total number of wells",null,null,"x",{"$f":"VLOOKUP($B$3,WellEFbyRegion,D13-1988,FALSE)","v":{"$error":"#N/A"}},"=",{"$f":"D17*F17","v":{"$error":"#N/A"}},"=",{"$f":"H17*MethGWP*10^-6","v":{"$error":"#N/A"}},"=",{"$f":"J17/CO2_C","v":{"$error":"#N/A"}}]
[null,"Number of shallow water off-shore platforms in the Gulf of Mexico and Pacific",null,null,"x",{"$f":"Control!$H$15","v":0},"=",{"$f":"D18*F18","v":0},"=",{"$f":"H18*MethGWP*10^-6","v":0},"=",{"$f":"J18/CO2_C","v":0}]
[null,"Number of deepwater off-shore platforms in the Gulf of Mexico and Pacific",null,null,"x",{"$f":"Control!$H$16","v":0},"=",{"$f":"D19*F19","v":0},"=",{"$f":"H19*MethGWP*10^-6","v":0},"=",{"$f":"J19/CO2_C","v":0}]
[null,"Total  ",null,null,null,null,null,{"$f":"SUM(H17:H19)","v":{"$error":"#N/A"}},"=",{"$f":"H20*MethGWP*10^-6","v":{"$error":"#N/A"}},"=",{"$f":"J20/CO2_C","v":{"$error":"#N/A"}}]
[]
[null,"Natural Gas - Production",null,{"$f":"D13+1","v":1992}]
[]
[null,null,null,"Activity Data",null,"Emission Factor",null,"Metric Tons CH4",null,"MMTCO2E",null,"MMTCE"]
[null,null,null,null,null,"metric tons CH4 per year per activity unit"]
[null,"Total number of wells",null,null,"x",{"$f":"VLOOKUP($B$3,WellEFbyRegion,D22-1988,FALSE)","v":{"$error":"#N/A"}},"=",{"$f":"D26*F26","v":{"$error":"#N/A"}},"=",{"$f":"H26*MethGWP*10^-6","v":{"$error":"#N/A"}},"=",{"$f":"J26/CO2_C","v":{"$error":"#N/A"}}]
[null,"Number of shallow water off-shore platforms in the Gulf of Mexico and Pacific",null,null,"x",{"$f":"Control!$H$15","v":0},"=",{"$f":"D27*F27","v":0},"=",{"$f":"H27*MethGWP*10^-6","v":0},"=",{"$f":"J27/CO2_C","v":0}]
[null,"Number of deepwater off-shore platforms in the Gulf of Mexico and Pacific",null,null,"x",{"$f":"Control!$H$16","v":0},"=",{"$f":"D28*F28","v":0},"=",{"$f":"H28*MethGWP*10^-6","v":0},"=",{"$f":"J28/CO2_C","v":0}]
[null,"Total  ",null,null,null,null,null,{"$f":"SUM(H26:H28)","v":{"$error":"#N/A"}},"=",{"$f":"H29*MethGWP*10^-6","v":{"$error":"#N/A"}},"=",{"$f":"J29/CO2_C","v":{"$error":"#N/A"}}]
[]
[null,"Natural Gas - Production",null,{"$f":"D22+1","v":1993}]
[]
[null,null,null,"Activity Data",null,"Emission Factor",null,"Metric Tons CH4",null,"MMTCO2E",null,"MMTCE"]
[null,null,null,null,null,"metric tons CH4 per year per activity unit"]
[null,"Total number of wells",null,null,"x",{"$f":"VLOOKUP($B$3,WellEFbyRegion,D31-1988,FALSE)","v":{"$error":"#N/A"}},"=",{"$f":"D35*F35","v":{"$error":"#N/A"}},"=",{"$f":"H35*MethGWP*10^-6","v":{"$error":"#N/A"}},"=",{"$f":"J35/CO2_C","v":{"$error":"#N/A"}}]
[null,"Number of shallow water off-shore platforms in the Gulf of Mexico and Pacific",null,null,"x",{"$f":"Control!$H$15","v":0},"=",{"$f":"D36*F36","v":0},"=",{"$f":"H36*MethGWP*10^-6","v":0},"=",{"$f":"J36/CO2_C","v":0}]
[null,"Number of deepwater off-shore platforms in the Gulf of Mexico and Pacific",null,null,"x",{"$f":"Control!$H$16","v":0},"=",{"$f":"D37*F37","v":0},"=",{"$f":"H37*MethGWP*10^-6","v":0},"=",{"$f":"J37/CO2_C","v":0}]
[null,"Total  ",null,null,null,null,null,{"$f":"SUM(H35:H37)","v":{"$error":"#N/A"}},"=",{"$f":"H38*MethGWP*10^-6","v":{"$error":"#N/A"}},"=",{"$f":"J38/CO2_C","v":{"$error":"#N/A"}}]
[]
[null,"Natural Gas - Production",null,{"$f":"D31+1","v":1994}]
[]
[null,null,null,"Activity Data",null,"Emission Factor",null,"Metric Tons CH4",null,"MMTCO2E",null,"MMTCE"]
[null,null,null,null,null,"metric tons CH4 per year per activity unit"]
[null,"Total number of wells",null,null,"x",{"$f":"VLOOKUP($B$3,WellEFbyRegion,D40-1988,FALSE)","v":{"$error":"#N/A"}},"=",{"$f":"D44*F44","v":{"$error":"#N/A"}},"=",{"$f":"H44*MethGWP*10^-6","v":{"$error":"#N/A"}},"=",{"$f":"J44/CO2_C","v":{"$error":"#N/A"}}]
[null,"Number of shallow water off-shore platforms in the Gulf of Mexico and Pacific",null,null,"x",{"$f":"Control!$H$15","v":0},"=",{"$f":"D45*F45","v":0},"=",{"$f":"H45*MethGWP*10^-6","v":0},"=",{"$f":"J45/CO2_C","v":0}]
[null,"Number of deepwater off-shore platforms in the Gulf of Mexico and Pacific",null,null,"x",{"$f":"Control!$H$16","v":0},"=",{"$f":"D46*F46","v":0},"=",{"$f":"H46*MethGWP*10^-6","v":0},"=",{"$f":"J46/CO2_C","v":0}]
[null,"Total  ",null,null,null,null,null,{"$f":"SUM(H44:H46)","v":{"$error":"#N/A"}},"=",{"$f":"H47*MethGWP*10^-6","v":{"$error":"#N/A"}},"=",{"$f":"J47/CO2_C","v":{"$error":"#N/A"}}]
[]
[null,"Natural Gas - Production",null,{"$f":"D40+1","v":1995}]
[]
[null,null,null,"Activity Data",null,"Emission Factor",null,"Metric Tons CH4",null,"MMTCO2E",null,"MMTCE"]
[null,null,null,null,null,"metric tons CH4 per year per activity unit"]
[null,"Total number of wells",null,null,"x",{"$f":"VLOOKUP($B$3,WellEFbyRegion,D49-1988,FALSE)","v":{"$error":"#N/A"}},"=",{"$f":"D53*F53","v":{"$error":"#N/A"}},"=",{"$f":"H53*MethGWP*10^-6","v":{"$error":"#N/A"}},"=",{"$f":"J53/CO2_C","v":{"$error":"#N/A"}}]
[null,"Number of shallow water off-shore platforms in the Gulf of Mexico and Pacific",null,null,"x",{"$f":"Control!$H$15","v":0},"=",{"$f":"D54*F54","v":0},"=",{"$f":"H54*MethGWP*10^-6","v":0},"=",{"$f":"J54/CO2_C","v":0}]
[null,"Number of deepwater off-shore platforms in the Gulf of Mexico and Pacific",null,null,"x",{"$f":"Control!$H$16","v":0},"=",{"$f":"D55*F55","v":0},"=",{"$f":"H55*MethGWP*10^-6","v":0},"=",{"$f":"J55/CO2_C","v":0}]
[null,"Total  ",null,null,null,null,null,{"$f":"SUM(H53:H55)","v":{"$error":"#N/A"}},"=",{"$f":"H56*MethGWP*10^-6","v":{"$error":"#N/A"}},"=",{"$f":"J56/CO2_C","v":{"$error":"#N/A"}}]
[]
[null,"Natural Gas - Production",null,{"$f":"D49+1","v":1996}]
[]
[null,null,null,"Activity Data",null,"Emission Factor",null,"Metric Tons CH4",null,"MMTCO2E",null,"MMTCE"]
[null,null,null,null,null,"metric tons CH4 per year per activity unit"]
[null,"Total number of wells",null,null,"x",{"$f":"VLOOKUP($B$3,WellEFbyRegion,D58-1988,FALSE)","v":{"$error":"#N/A"}},"=",{"$f":"D62*F62","v":{"$error":"#N/A"}},"=",{"$f":"H62*MethGWP*10^-6","v":{"$error":"#N/A"}},"=",{"$f":"J62/CO2_C","v":{"$error":"#N/A"}}]
[null,"Number of shallow water off-shore platforms in the Gulf of Mexico and Pacific",null,null,"x",{"$f":"Control!$H$15","v":0},"=",{"$f":"D63*F63","v":0},"=",{"$f":"H63*MethGWP*10^-6","v":0},"=",{"$f":"J63/CO2_C","v":0}]
[null,"Number of deepwater off-shore platforms in the Gulf of Mexico and Pacific",null,null,"x",{"$f":"Control!$H$16","v":0},"=",{"$f":"D64*F64","v":0},"=",{"$f":"H64*MethGWP*10^-6","v":0},"=",{"$f":"J64/CO2_C","v":0}]
[null,"Total  ",null,null,null,null,null,{"$f":"SUM(H62:H64)","v":{"$error":"#N/A"}},"=",{"$f":"H65*MethGWP*10^-6","v":{"$error":"#N/A"}},"=",{"$f":"J65/CO2_C","v":{"$error":"#N/A"}}]
[]
[null,"Natural Gas - Production",null,{"$f":"D58+1","v":1997}]
[]
[null,null,null,"Activity Data",null,"Emission Factor",null,"Metric Tons CH4",null,"MMTCO2E",null,"MMTCE"]
[null,null,null,null,null,"metric tons CH4 per year per activity unit"]
[null,"Total number of wells",null,null,"x",{"$f":"VLOOKUP($B$3,WellEFbyRegion,D67-1988,FALSE)","v":{"$error":"#N/A"}},"=",{"$f":"D71*F71","v":{"$error":"#N/A"}},"=",{"$f":"H71*MethGWP*10^-6","v":{"$error":"#N/A"}},"=",{"$f":"J71/CO2_C","v":{"$error":"#N/A"}}]
[null,"Number of shallow water off-shore platforms in the Gulf of Mexico and Pacific",null,null,"x",{"$f":"Control!$H$15","v":0},"=",{"$f":"D72*F72","v":0},"=",{"$f":"H72*MethGWP*10^-6","v":0},"=",{"$f":"J72/CO2_C","v":0}]
[null,"Number of deepwater off-shore platforms in the Gulf of Mexico and Pacific",null,null,"x",{"$f":"Control!$H$16","v":0},"=",{"$f":"D73*F73","v":0},"=",{"$f":"H73*MethGWP*10^-6","v":0},"=",{"$f":"J73/CO2_C","v":0}]
[null,"Total  ",null,null,null,null,null,{"$f":"SUM(H71:H73)","v":{"$error":"#N/A"}},"=",{"$f":"H74*MethGWP*10^-6","v":{"$error":"#N/A"}},"=",{"$f":"J74/CO2_C","v":{"$error":"#N/A"}}]
[]
[null,"Natural Gas - Production",null,{"$f":"D67+1","v":1998}]
[]
[null,null,null,"Activity Data",null,"Emission Factor",null,"Metric Tons CH4",null,"MMTCO2E",null,"MMTCE"]
[null,null,null,null,null,"metric tons CH4 per year per activity unit"]
[null,"Total number of wells",null,null,"x",{"$f":"VLOOKUP($B$3,WellEFbyRegion,D76-1988,FALSE)","v":{"$error":"#N/A"}},"=",{"$f":"D80*F80","v":{"$error":"#N/A"}},"=",{"$f":"H80*MethGWP*10^-6","v":{"$error":"#N/A"}},"=",{"$f":"J80/CO2_C","v":{"$error":"#N/A"}}]
[null,"Number of shallow water off-shore platforms in the Gulf of Mexico and Pacific",null,null,"x",{"$f":"Control!$H$15","v":0},"=",{"$f":"D81*F81","v":0},"=",{"$f":"H81*MethGWP*10^-6","v":0},"=",{"$f":"J81/CO2_C","v":0}]
[null,"Number of deepwater off-shore platforms in the Gulf of Mexico and Pacific",null,null,"x",{"$f":"Control!$H$16","v":0},"=",{"$f":"D82*F82","v":0},"=",{"$f":"H82*MethGWP*10^-6","v":0},"=",{"$f":"J82/CO2_C","v":0}]
[null,"Total  ",null,null,null,null,null,{"$f":"SUM(H80:H82)","v":{"$error":"#N/A"}},"=",{"$f":"H83*MethGWP*10^-6","v":{"$error":"#N/A"}},"=",{"$f":"J83/CO2_C","v":{"$error":"#N/A"}}]
[]
[null,"Natural Gas - Production",null,{"$f":"D76+1","v":1999}]
[]
[null,null,null,"Activity Data",null,"Emission Factor",null,"Metric Tons CH4",null,"MMTCO2E",null,"MMTCE"]
[null,null,null,null,null,"metric tons CH4 per year per activity unit"]
[null,"Total number of wells",null,null,"x",{"$f":"VLOOKUP($B$3,WellEFbyRegion,D85-1988,FALSE)","v":{"$error":"#N/A"}},"=",{"$f":"D89*F89","v":{"$error":"#N/A"}},"=",{"$f":"H89*MethGWP*10^-6","v":{"$error":"#N/A"}},"=",{"$f":"J89/CO2_C","v":{"$error":"#N/A"}}]
[null,"Number of shallow water off-shore platforms in the Gulf of Mexico and Pacific",null,null,"x",{"$f":"Control!$H$15","v":0},"=",{"$f":"D90*F90","v":0},"=",{"$f":"H90*MethGWP*10^-6","v":0},"=",{"$f":"J90/CO2_C","v":0}]
[null,"Number of deepwater off-shore platforms in the Gulf of Mexico and Pacific",null,null,"x",{"$f":"Control!$H$16","v":0},"=",{"$f":"D91*F91","v":0},"=",{"$f":"H91*MethGWP*10^-6","v":0},"=",{"$f":"J91/CO2_C","v":0}]
[null,"Total  ",null,null,null,null,null,{"$f":"SUM(H89:H91)","v":{"$error":"#N/A"}},"=",{"$f":"H92*MethGWP*10^-6","v":{"$error":"#N/A"}},"=",{"$f":"J92/CO2_C","v":{"$error":"#N/A"}}]
[]
[null,"Natural Gas - Production",null,{"$f":"D85+1","v":2000}]
[]
[null,null,null,"Activity Data",null,"Emission Factor",null,"Metric Tons CH4",null,"MMTCO2E",null,"MMTCE"]
[null,null,null,null,null,"metric tons CH4 per year per activity unit"]
[null,"Total number of wells",null,null,"x",{"$f":"VLOOKUP($B$3,WellEFbyRegion,D94-1988,FALSE)","v":{"$error":"#N/A"}},"=",{"$f":"D98*F98","v":{"$error":"#N/A"}},"=",{"$f":"H98*MethGWP*10^-6","v":{"$error":"#N/A"}},"=",{"$f":"J98/CO2_C","v":{"$error":"#N/A"}}]
[null,"Number of shallow water off-shore platforms in the Gulf of Mexico and Pacific",null,null,"x",{"$f":"Control!$H$15","v":0},"=",{"$f":"D99*F99","v":0},"=",{"$f":"H99*MethGWP*10^-6","v":0},"=",{"$f":"J99/CO2_C","v":0}]
[null,"Number of deepwater off-shore platforms in the Gulf of Mexico and Pacific",null,null,"x",{"$f":"Control!$H$16","v":0},"=",{"$f":"D100*F100","v":0},"=",{"$f":"H100*MethGWP*10^-6","v":0},"=",{"$f":"J100/CO2_C","v":0}]
[null,"Total  ",null,null,null,null,null,{"$f":"SUM(H98:H100)","v":{"$error":"#N/A"}},"=",{"$f":"H101*MethGWP*10^-6","v":{"$error":"#N/A"}},"=",{"$f":"J101/CO2_C","v":{"$error":"#N/A"}}]
[]
[null,"Natural Gas - Production",null,{"$f":"D94+1","v":2001}]
[]
[null,null,null,"Activity Data",null,"Emission Factor",null,"Metric Tons CH4",null,"MMTCO2E",null,"MMTCE"]
[null,null,null,null,null,"metric tons CH4 per year per activity unit"]
[null,"Total number of wells",null,null,"x",{"$f":"VLOOKUP($B$3,WellEFbyRegion,D103-1988,FALSE)","v":{"$error":"#N/A"}},"=",{"$f":"D107*F107","v":{"$error":"#N/A"}},"=",{"$f":"H107*MethGWP*10^-6","v":{"$error":"#N/A"}},"=",{"$f":"J107/CO2_C","v":{"$error":"#N/A"}}]
[null,"Number of shallow water off-shore platforms in the Gulf of Mexico and Pacific",null,null,"x",{"$f":"Control!$H$15","v":0},"=",{"$f":"D108*F108","v":0},"=",{"$f":"H108*MethGWP*10^-6","v":0},"=",{"$f":"J108/CO2_C","v":0}]
[null,"Number of deepwater off-shore platforms in the Gulf of Mexico and Pacific",null,null,"x",{"$f":"Control!$H$16","v":0},"=",{"$f":"D109*F109","v":0},"=",{"$f":"H109*MethGWP*10^-6","v":0},"=",{"$f":"J109/CO2_C","v":0}]
[null,"Total  ",null,null,null,null,null,{"$f":"SUM(H107:H109)","v":{"$error":"#N/A"}},"=",{"$f":"H110*MethGWP*10^-6","v":{"$error":"#N/A"}},"=",{"$f":"J110/CO2_C","v":{"$error":"#N/A"}}]
[]
[null,"Natural Gas - Production",null,{"$f":"D103+1","v":2002}]
[]
[null,null,null,"Activity Data",null,"Emission Factor",null,"Metric Tons CH4",null,"MMTCO2E",null,"MMTCE"]
[null,null,null,null,null,"metric tons CH4 per year per activity unit"]
[null,"Total number of wells",null,null,"x",{"$f":"VLOOKUP($B$3,WellEFbyRegion,D112-1988,FALSE)","v":{"$error":"#N/A"}},"=",{"$f":"D116*F116","v":{"$error":"#N/A"}},"=",{"$f":"H116*MethGWP*10^-6","v":{"$error":"#N/A"}},"=",{"$f":"J116/CO2_C","v":{"$error":"#N/A"}}]
[null,"Number of shallow water off-shore platforms in the Gulf of Mexico and Pacific",null,null,"x",{"$f":"Control!$H$15","v":0},"=",{"$f":"D117*F117","v":0},"=",{"$f":"H117*MethGWP*10^-6","v":0},"=",{"$f":"J117/CO2_C","v":0}]
[null,"Number of deepwater off-shore platforms in the Gulf of Mexico and Pacific",null,null,"x",{"$f":"Control!$H$16","v":0},"=",{"$f":"D118*F118","v":0},"=",{"$f":"H118*MethGWP*10^-6","v":0},"=",{"$f":"J118/CO2_C","v":0}]
[null,"Total  ",null,null,null,null,null,{"$f":"SUM(H116:H118)","v":{"$error":"#N/A"}},"=",{"$f":"H119*MethGWP*10^-6","v":{"$error":"#N/A"}},"=",{"$f":"J119/CO2_C","v":{"$error":"#N/A"}}]
[]
[null,"Natural Gas - Production",null,{"$f":"D112+1","v":2003}]
[]
[null,null,null,"Activity Data",null,"Emission Factor",null,"Metric Tons CH4",null,"MMTCO2E",null,"MMTCE"]
[null,null,null,null,null,"metric tons CH4 per year per activity unit"]
[null,"Total number of wells",null,null,"x",{"$f":"VLOOKUP($B$3,WellEFbyRegion,D121-1988,FALSE)","v":{"$error":"#N/A"}},"=",{"$f":"D125*F125","v":{"$error":"#N/A"}},"=",{"$f":"H125*MethGWP*10^-6","v":{"$error":"#N/A"}},"=",{"$f":"J125/CO2_C","v":{"$error":"#N/A"}}]
[null,"Number of shallow water off-shore platforms in the Gulf of Mexico and Pacific",null,null,"x",{"$f":"Control!$H$15","v":0},"=",{"$f":"D126*F126","v":0},"=",{"$f":"H126*MethGWP*10^-6","v":0},"=",{"$f":"J126/CO2_C","v":0}]
[null,"Number of deepwater off-shore platforms in the Gulf of Mexico and Pacific",null,null,"x",{"$f":"Control!$H$16","v":0},"=",{"$f":"D127*F127","v":0},"=",{"$f":"H127*MethGWP*10^-6","v":0},"=",{"$f":"J127/CO2_C","v":0}]
[null,"Total  ",null,null,null,null,null,{"$f":"SUM(H125:H127)","v":{"$error":"#N/A"}},"=",{"$f":"H128*MethGWP*10^-6","v":{"$error":"#N/A"}},"=",{"$f":"J128/CO2_C","v":{"$error":"#N/A"}}]
[]
[null,"Natural Gas - Production",null,{"$f":"D121+1","v":2004}]
[]
[null,null,null,"Activity Data",null,"Emission Factor",null,"Metric Tons CH4",null,"MMTCO2E",null,"MMTCE"]
[null,null,null,null,null,"metric tons CH4 per year per activity unit"]
[null,"Total number of wells",null,null,"x",{"$f":"VLOOKUP($B$3,WellEFbyRegion,D130-1988,FALSE)","v":{"$error":"#N/A"}},"=",{"$f":"D134*F134","v":{"$error":"#N/A"}},"=",{"$f":"H134*MethGWP*10^-6","v":{"$error":"#N/A"}},"=",{"$f":"J134/CO2_C","v":{"$error":"#N/A"}}]
[null,"Number of shallow water off-shore platforms in the Gulf of Mexico and Pacific",null,null,"x",{"$f":"Control!$H$15","v":0},"=",{"$f":"D135*F135","v":0},"=",{"$f":"H135*MethGWP*10^-6","v":0},"=",{"$f":"J135/CO2_C","v":0}]
[null,"Number of deepwater off-shore platforms in the Gulf of Mexico and Pacific",null,null,"x",{"$f":"Control!$H$16","v":0},"=",{"$f":"D136*F136","v":0},"=",{"$f":"H136*MethGWP*10^-6","v":0},"=",{"$f":"J136/CO2_C","v":0}]
[null,"Total  ",null,null,null,null,null,{"$f":"SUM(H134:H136)","v":{"$error":"#N/A"}},"=",{"$f":"H137*MethGWP*10^-6","v":{"$error":"#N/A"}},"=",{"$f":"J137/CO2_C","v":{"$error":"#N/A"}}]
[]
[null,"Natural Gas - Production",null,{"$f":"D130+1","v":2005}]
[]
[null,null,null,"Activity Data",null,"Emission Factor",null,"Metric Tons CH4",null,"MMTCO2E",null,"MMTCE"]
[null,null,null,null,null,"metric tons CH4 per year per activity unit"]
[null,"Total number of wells",null,null,"x",{"$f":"VLOOKUP($B$3,WellEFbyRegion,D139-1988,FALSE)","v":{"$error":"#N/A"}},"=",{"$f":"D143*F143","v":{"$error":"#N/A"}},"=",{"$f":"H143*MethGWP*10^-6","v":{"$error":"#N/A"}},"=",{"$f":"J143/CO2_C","v":{"$error":"#N/A"}}]
[null,"Number of shallow water off-shore platforms in the Gulf of Mexico and Pacific",null,null,"x",{"$f":"Control!$H$15","v":0},"=",{"$f":"D144*F144","v":0},"=",{"$f":"H144*MethGWP*10^-6","v":0},"=",{"$f":"J144/CO2_C","v":0}]
[null,"Number of deepwater off-shore platforms in the Gulf of Mexico and Pacific",null,null,"x",{"$f":"Control!$H$16","v":0},"=",{"$f":"D145*F145","v":0},"=",{"$f":"H145*MethGWP*10^-6","v":0},"=",{"$f":"J145/CO2_C","v":0}]
[null,"Total  ",null,null,null,null,null,{"$f":"SUM(H143:H145)","v":{"$error":"#N/A"}},"=",{"$f":"H146*MethGWP*10^-6","v":{"$error":"#N/A"}},"=",{"$f":"J146/CO2_C","v":{"$error":"#N/A"}}]
[]
[null,"Natural Gas - Production",null,{"$f":"D139+1","v":2006}]
[]
[null,null,null,"Activity Data",null,"Emission Factor",null,"Metric Tons CH4",null,"MMTCO2E",null,"MMTCE"]
[null,null,null,null,null,"metric tons CH4 per year per activity unit"]
[null,"Total number of wells",null,null,"x",{"$f":"VLOOKUP($B$3,WellEFbyRegion,D148-1988,FALSE)","v":{"$error":"#N/A"}},"=",{"$f":"D152*F152","v":{"$error":"#N/A"}},"=",{"$f":"H152*MethGWP*10^-6","v":{"$error":"#N/A"}},"=",{"$f":"J152/CO2_C","v":{"$error":"#N/A"}}]
[null,"Number of shallow water off-shore platforms in the Gulf of Mexico and Pacific",null,null,"x",{"$f":"Control!$H$15","v":0},"=",{"$f":"D153*F153","v":0},"=",{"$f":"H153*MethGWP*10^-6","v":0},"=",{"$f":"J153/CO2_C","v":0}]
[null,"Number of deepwater off-shore platforms in the Gulf of Mexico and Pacific",null,null,"x",{"$f":"Control!$H$16","v":0},"=",{"$f":"D154*F154","v":0},"=",{"$f":"H154*MethGWP*10^-6","v":0},"=",{"$f":"J154/CO2_C","v":0}]
[null,"Total  ",null,null,null,null,null,{"$f":"SUM(H152:H154)","v":{"$error":"#N/A"}},"=",{"$f":"H155*MethGWP*10^-6","v":{"$error":"#N/A"}},"=",{"$f":"J155/CO2_C","v":{"$error":"#N/A"}}]
[]
[null,"Natural Gas - Production",null,{"$f":"D148+1","v":2007}]
[]
[null,null,null,"Activity Data",null,"Emission Factor",null,"Metric Tons CH4",null,"MMTCO2E",null,"MMTCE"]
[null,null,null,null,null,"metric tons CH4 per year per activity unit"]
[null,"Total number of wells",null,null,"x",{"$f":"VLOOKUP($B$3,WellEFbyRegion,D157-1988,FALSE)","v":{"$error":"#N/A"}},"=",{"$f":"D161*F161","v":{"$error":"#N/A"}},"=",{"$f":"H161*MethGWP*10^-6","v":{"$error":"#N/A"}},"=",{"$f":"J161/CO2_C","v":{"$error":"#N/A"}}]
[null,"Number of shallow water off-shore platforms in the Gulf of Mexico and Pacific",null,null,"x",{"$f":"Control!$H$15","v":0},"=",{"$f":"D162*F162","v":0},"=",{"$f":"H162*MethGWP*10^-6","v":0},"=",{"$f":"J162/CO2_C","v":0}]
[null,"Number of deepwater off-shore platforms in the Gulf of Mexico and Pacific",null,null,"x",{"$f":"Control!$H$16","v":0},"=",{"$f":"D163*F163","v":0},"=",{"$f":"H163*MethGWP*10^-6","v":0},"=",{"$f":"J163/CO2_C","v":0}]
[null,"Total  ",null,null,null,null,null,{"$f":"SUM(H161:H163)","v":{"$error":"#N/A"}},"=",{"$f":"H164*MethGWP*10^-6","v":{"$error":"#N/A"}},"=",{"$f":"J164/CO2_C","v":{"$error":"#N/A"}}]
[]
[null,"Natural Gas - Production",null,{"$f":"D157+1","v":2008}]
[]
[null,null,null,"Activity Data",null,"Emission Factor",null,"Metric Tons CH4",null,"MMTCO2E",null,"MMTCE"]
[null,null,null,null,null,"metric tons CH4 per year per activity unit"]
[null,"Total number of wells",null,null,"x",{"$f":"VLOOKUP($B$3,WellEFbyRegion,D166-1988,FALSE)","v":{"$error":"#N/A"}},"=",{"$f":"D170*F170","v":{"$error":"#N/A"}},"=",{"$f":"H170*MethGWP*10^-6","v":{"$error":"#N/A"}},"=",{"$f":"J170/CO2_C","v":{"$error":"#N/A"}}]
[null,"Number of shallow water off-shore platforms in the Gulf of Mexico and Pacific",null,null,"x",{"$f":"Control!$H$15","v":0},"=",{"$f":"D171*F171","v":0},"=",{"$f":"H171*MethGWP*10^-6","v":0},"=",{"$f":"J171/CO2_C","v":0}]
[null,"Number of deepwater off-shore platforms in the Gulf of Mexico and Pacific",null,null,"x",{"$f":"Control!$H$16","v":0},"=",{"$f":"D172*F172","v":0},"=",{"$f":"H172*MethGWP*10^-6","v":0},"=",{"$f":"J172/CO2_C","v":0}]
[null,"Total  ",null,null,null,null,null,{"$f":"SUM(H170:H172)","v":{"$error":"#N/A"}},"=",{"$f":"H173*MethGWP*10^-6","v":{"$error":"#N/A"}},"=",{"$f":"J173/CO2_C","v":{"$error":"#N/A"}}]
[]
[null,"Natural Gas - Production",null,{"$f":"D166+1","v":2009}]
[]
[null,null,null,"Activity Data",null,"Emission Factor",null,"Metric Tons CH4",null,"MMTCO2E",null,"MMTCE"]
[null,null,null,null,null,"metric tons CH4 per year per activity unit"]
[null,"Total number of wells",null,null,"x",{"$f":"VLOOKUP($B$3,WellEFbyRegion,D175-1988,FALSE)","v":{"$error":"#N/A"}},"=",{"$f":"D179*F179","v":{"$error":"#N/A"}},"=",{"$f":"H179*MethGWP*10^-6","v":{"$error":"#N/A"}},"=",{"$f":"J179/CO2_C","v":{"$error":"#N/A"}}]
[null,"Number of shallow water off-shore platforms in the Gulf of Mexico and Pacific",null,null,"x",{"$f":"Control!$H$15","v":0},"=",{"$f":"D180*F180","v":0},"=",{"$f":"H180*MethGWP*10^-6","v":0},"=",{"$f":"J180/CO2_C","v":0}]
[null,"Number of deepwater off-shore platforms in the Gulf of Mexico and Pacific",null,null,"x",{"$f":"Control!$H$16","v":0},"=",{"$f":"D181*F181","v":0},"=",{"$f":"H181*MethGWP*10^-6","v":0},"=",{"$f":"J181/CO2_C","v":0}]
[null,"Total  ",null,null,null,null,null,{"$f":"SUM(H179:H181)","v":{"$error":"#N/A"}},"=",{"$f":"H182*MethGWP*10^-6","v":{"$error":"#N/A"}},"=",{"$f":"J182/CO2_C","v":{"$error":"#N/A"}}]
[]
[null,"Natural Gas - Production",null,{"$f":"D175+1","v":2010}]
[]
[null,null,null,"Activity Data",null,"Emission Factor",null,"Metric Tons CH4",null,"MMTCO2E",null,"MMTCE"]
[null,null,null,null,null,"metric tons CH4 per year per activity unit"]
[null,"Total number of wells",null,null,"x",{"$f":"VLOOKUP($B$3,WellEFbyRegion,D184-1988,FALSE)","v":{"$error":"#N/A"}},"=",{"$f":"D188*F188","v":{"$error":"#N/A"}},"=",{"$f":"H188*MethGWP*10^-6","v":{"$error":"#N/A"}},"=",{"$f":"J188/CO2_C","v":{"$error":"#N/A"}}]
[null,"Number of shallow water off-shore platforms in the Gulf of Mexico and Pacific",null,null,"x",{"$f":"Control!$H$15","v":0},"=",{"$f":"D189*F189","v":0},"=",{"$f":"H189*MethGWP*10^-6","v":0},"=",{"$f":"J189/CO2_C","v":0}]
[null,"Number of deepwater off-shore platforms in the Gulf of Mexico and Pacific",null,null,"x",{"$f":"Control!$H$16","v":0},"=",{"$f":"D190*F190","v":0},"=",{"$f":"H190*MethGWP*10^-6","v":0},"=",{"$f":"J190/CO2_C","v":0}]
[null,"Total  ",null,null,null,null,null,{"$f":"SUM(H188:H190)","v":{"$error":"#N/A"}},"=",{"$f":"H191*MethGWP*10^-6","v":{"$error":"#N/A"}},"=",{"$f":"J191/CO2_C","v":{"$error":"#N/A"}}]
[]
[null,"Natural Gas - Production",null,{"$f":"D184+1","v":2011}]
[]
[null,null,null,"Activity Data",null,"Emission Factor",null,"Metric Tons CH4",null,"MMTCO2E",null,"MMTCE"]
[null,null,null,null,null,"metric tons CH4 per year per activity unit"]
[null,"Total number of wells",null,null,"x",{"$f":"VLOOKUP($B$3,WellEFbyRegion,D193-1988,FALSE)","v":{"$error":"#N/A"}},"=",{"$f":"D197*F197","v":{"$error":"#N/A"}},"=",{"$f":"H197*MethGWP*10^-6","v":{"$error":"#N/A"}},"=",{"$f":"J197/CO2_C","v":{"$error":"#N/A"}}]
[null,"Number of shallow water off-shore platforms in the Gulf of Mexico and Pacific",null,null,"x",{"$f":"Control!$H$15","v":0},"=",{"$f":"D198*F198","v":0},"=",{"$f":"H198*MethGWP*10^-6","v":0},"=",{"$f":"J198/CO2_C","v":0}]
[null,"Number of deepwater off-shore platforms in the Gulf of Mexico and Pacific",null,null,"x",{"$f":"Control!$H$16","v":0},"=",{"$f":"D199*F199","v":0},"=",{"$f":"H199*MethGWP*10^-6","v":0},"=",{"$f":"J199/CO2_C","v":0}]
[null,"Total  ",null,null,null,null,null,{"$f":"SUM(H197:H199)","v":{"$error":"#N/A"}},"=",{"$f":"H200*MethGWP*10^-6","v":{"$error":"#N/A"}},"=",{"$f":"J200/CO2_C","v":{"$error":"#N/A"}}]
[]
[null,"Natural Gas - Production",null,{"$f":"D193+1","v":2012}]
[]
[null,null,null,"Activity Data",null,"Emission Factor",null,"Metric Tons CH4",null,"MMTCO2E",null,"MMTCE"]
[null,null,null,null,null,"metric tons CH4 per year per activity unit"]
[null,"Total number of wells",null,null,"x",{"$f":"VLOOKUP($B$3,WellEFbyRegion,D202-1988,FALSE)","v":{"$error":"#N/A"}},"=",{"$f":"D206*F206","v":{"$error":"#N/A"}},"=",{"$f":"H206*MethGWP*10^-6","v":{"$error":"#N/A"}},"=",{"$f":"J206/CO2_C","v":{"$error":"#N/A"}}]
[null,"Number of shallow water off-shore platforms in the Gulf of Mexico and Pacific",null,null,"x",{"$f":"Control!$H$15","v":0},"=",{"$f":"D207*F207","v":0},"=",{"$f":"H207*MethGWP*10^-6","v":0},"=",{"$f":"J207/CO2_C","v":0}]
[null,"Number of deepwater off-shore platforms in the Gulf of Mexico and Pacific",null,null,"x",{"$f":"Control!$H$16","v":0},"=",{"$f":"D208*F208","v":0},"=",{"$f":"H208*MethGWP*10^-6","v":0},"=",{"$f":"J208/CO2_C","v":0}]
[null,"Total  ",null,null,null,null,null,{"$f":"SUM(H206:H208)","v":{"$error":"#N/A"}},"=",{"$f":"H209*MethGWP*10^-6","v":{"$error":"#N/A"}},"=",{"$f":"J209/CO2_C","v":{"$error":"#N/A"}}]
[]
[null,"Natural Gas - Production",null,{"$f":"D202+1","v":2013}]
[]
[null,null,null,"Activity Data",null,"Emission Factor",null,"Metric Tons CH4",null,"MMTCO2E",null,"MMTCE"]
[null,null,null,null,null,"metric tons CH4 per year per activity unit"]
[null,"Total number of wells",null,null,"x",{"$f":"VLOOKUP($B$3,WellEFbyRegion,D211-1988,FALSE)","v":{"$error":"#N/A"}},"=",{"$f":"D215*F215","v":{"$error":"#N/A"}},"=",{"$f":"H215*MethGWP*10^-6","v":{"$error":"#N/A"}},"=",{"$f":"J215/CO2_C","v":{"$error":"#N/A"}}]
[null,"Number of shallow water off-shore platforms in the Gulf of Mexico and Pacific",null,null,"x",{"$f":"Control!$H$15","v":0},"=",{"$f":"D216*F216","v":0},"=",{"$f":"H216*MethGWP*10^-6","v":0},"=",{"$f":"J216/CO2_C","v":0}]
[null,"Number of deepwater off-shore platforms in the Gulf of Mexico and Pacific",null,null,"x",{"$f":"Control!$H$16","v":0},"=",{"$f":"D217*F217","v":0},"=",{"$f":"H217*MethGWP*10^-6","v":0},"=",{"$f":"J217/CO2_C","v":0}]
[null,"Total  ",null,null,null,null,null,{"$f":"SUM(H215:H217)","v":{"$error":"#N/A"}},"=",{"$f":"H218*MethGWP*10^-6","v":{"$error":"#N/A"}},"=",{"$f":"J218/CO2_C","v":{"$error":"#N/A"}}]
[]
[null,"Natural Gas - Production",null,{"$f":"D211+1","v":2014}]
[]
[null,null,null,"Activity Data",null,"Emission Factor",null,"Metric Tons CH4",null,"MMTCO2E",null,"MMTCE"]
[null,null,null,null,null,"metric tons CH4 per year per activity unit"]
[null,"Total number of wells",null,null,"x",{"$f":"VLOOKUP($B$3,WellEFbyRegion,D220-1988,FALSE)","v":{"$error":"#N/A"}},"=",{"$f":"D224*F224","v":{"$error":"#N/A"}},"=",{"$f":"H224*MethGWP*10^-6","v":{"$error":"#N/A"}},"=",{"$f":"J224/CO2_C","v":{"$error":"#N/A"}}]
[null,"Number of shallow water off-shore platforms in the Gulf of Mexico and Pacific",null,null,"x",{"$f":"Control!$H$15","v":0},"=",{"$f":"D225*F225","v":0},"=",{"$f":"H225*MethGWP*10^-6","v":0},"=",{"$f":"J225/CO2_C","v":0}]
[null,"Number of deepwater off-shore platforms in the Gulf of Mexico and Pacific",null,null,"x",{"$f":"Control!$H$16","v":0},"=",{"$f":"D226*F226","v":0},"=",{"$f":"H226*MethGWP*10^-6","v":0},"=",{"$f":"J226/CO2_C","v":0}]
[null,"Total  ",null,null,null,null,null,{"$f":"SUM(H224:H226)","v":{"$error":"#N/A"}},"=",{"$f":"H227*MethGWP*10^-6","v":{"$error":"#N/A"}},"=",{"$f":"J227/CO2_C","v":{"$error":"#N/A"}}]
[]
[null,"Natural Gas - Production",null,{"$f":"D220+1","v":2015}]
[]
[null,null,null,"Activity Data",null,"Emission Factor",null,"Metric Tons CH4",null,"MMTCO2E",null,"MMTCE"]
[null,null,null,null,null,"metric tons CH4 per year per activity unit"]
[null,"Total number of wells",null,null,"x",{"$f":"VLOOKUP($B$3,WellEFbyRegion,D229-1988,FALSE)","v":{"$error":"#N/A"}},"=",{"$f":"D233*F233","v":{"$error":"#N/A"}},"=",{"$f":"H233*MethGWP*10^-6","v":{"$error":"#N/A"}},"=",{"$f":"J233/CO2_C","v":{"$error":"#N/A"}}]
[null,"Number of shallow water off-shore platforms in the Gulf of Mexico and Pacific",null,null,"x",{"$f":"Control!$H$15","v":0},"=",{"$f":"D234*F234","v":0},"=",{"$f":"H234*MethGWP*10^-6","v":0},"=",{"$f":"J234/CO2_C","v":0}]
[null,"Number of deepwater off-shore platforms in the Gulf of Mexico and Pacific",null,null,"x",{"$f":"Control!$H$16","v":0},"=",{"$f":"D235*F235","v":0},"=",{"$f":"H235*MethGWP*10^-6","v":0},"=",{"$f":"J235/CO2_C","v":0}]
[null,"Total  ",null,null,null,null,null,{"$f":"SUM(H233:H235)","v":{"$error":"#N/A"}},"=",{"$f":"H236*MethGWP*10^-6","v":{"$error":"#N/A"}},"=",{"$f":"J236/CO2_C","v":{"$error":"#N/A"}}]
[]
[null,"Natural Gas - Production",null,{"$f":"D229+1","v":2016}]
[]
[null,null,null,"Activity Data",null,"Emission Factor",null,"Metric Tons CH4",null,"MMTCO2E",null,"MMTCE"]
[null,null,null,null,null,"metric tons CH4 per year per activity unit"]
[null,"Total number of wells",null,null,"x",{"$f":"VLOOKUP($B$3,WellEFbyRegion,D238-1988,FALSE)","v":{"$error":"#N/A"}},"=",{"$f":"D242*F242","v":{"$error":"#N/A"}},"=",{"$f":"H242*MethGWP*10^-6","v":{"$error":"#N/A"}},"=",{"$f":"J242/CO2_C","v":{"$error":"#N/A"}}]
[null,"Number of shallow water off-shore platforms in the Gulf of Mexico and Pacific",null,null,"x",{"$f":"Control!$H$15","v":0},"=",{"$f":"D243*F243","v":0},"=",{"$f":"H243*MethGWP*10^-6","v":0},"=",{"$f":"J243/CO2_C","v":0}]
[null,"Number of deepwater off-shore platforms in the Gulf of Mexico and Pacific",null,null,"x",{"$f":"Control!$H$16","v":0},"=",{"$f":"D244*F244","v":0},"=",{"$f":"H244*MethGWP*10^-6","v":0},"=",{"$f":"J244/CO2_C","v":0}]
[null,"Total  ",null,null,null,null,null,{"$f":"SUM(H242:H244)","v":{"$error":"#N/A"}},"=",{"$f":"H245*MethGWP*10^-6","v":{"$error":"#N/A"}},"=",{"$f":"J245/CO2_C","v":{"$error":"#N/A"}}]
[]
[null,"Natural Gas - Production",null,{"$f":"D238+1","v":2017}]
[]
[null,null,null,"Activity Data",null,"Emission Factor",null,"Metric Tons CH4",null,"MMTCO2E",null,"MMTCE"]
[null,null,null,null,null,"metric tons CH4 per year per activity unit"]
[null,"Total number of wells",null,null,"x",{"$f":"VLOOKUP($B$3,WellEFbyRegion,D247-1988,FALSE)","v":{"$error":"#N/A"}},"=",{"$f":"D251*F251","v":{"$error":"#N/A"}},"=",{"$f":"H251*MethGWP*10^-6","v":{"$error":"#N/A"}},"=",{"$f":"J251/CO2_C","v":{"$error":"#N/A"}}]
[null,"Number of shallow water off-shore platforms in the Gulf of Mexico and Pacific",null,null,"x",{"$f":"Control!$H$15","v":0},"=",{"$f":"D252*F252","v":0},"=",{"$f":"H252*MethGWP*10^-6","v":0},"=",{"$f":"J252/CO2_C","v":0}]
[null,"Number of deepwater off-shore platforms in the Gulf of Mexico and Pacific",null,null,"x",{"$f":"Control!$H$16","v":0},"=",{"$f":"D253*F253","v":0},"=",{"$f":"H253*MethGWP*10^-6","v":0},"=",{"$f":"J253/CO2_C","v":0}]
[null,"Total  ",null,null,null,null,null,{"$f":"SUM(H251:H253)","v":{"$error":"#N/A"}},"=",{"$f":"H254*MethGWP*10^-6","v":{"$error":"#N/A"}},"=",{"$f":"J254/CO2_C","v":{"$error":"#N/A"}}]
[]
[null,"Natural Gas - Production",null,{"$f":"D247+1","v":2018}]
[]
[null,null,null,"Activity Data",null,"Emission Factor",null,"Metric Tons CH4",null,"MMTCO2E",null,"MMTCE"]
[null,null,null,null,null,"metric tons CH4 per year per activity unit"]
[null,"Total number of wells",null,null,"x",{"$f":"VLOOKUP($B$3,WellEFbyRegion,D256-1988,FALSE)","v":{"$error":"#N/A"}},"=",{"$f":"D260*F260","v":{"$error":"#N/A"}},"=",{"$f":"H260*MethGWP*10^-6","v":{"$error":"#N/A"}},"=",{"$f":"J260/CO2_C","v":{"$error":"#N/A"}}]
[null,"Number of shallow water off-shore platforms in the Gulf of Mexico and Pacific",null,null,"x",{"$f":"Control!$H$15","v":0},"=",{"$f":"D261*F261","v":0},"=",{"$f":"H261*MethGWP*10^-6","v":0},"=",{"$f":"J261/CO2_C","v":0}]
[null,"Number of deepwater off-shore platforms in the Gulf of Mexico and Pacific",null,null,"x",{"$f":"Control!$H$16","v":0},"=",{"$f":"D262*F262","v":0},"=",{"$f":"H262*MethGWP*10^-6","v":0},"=",{"$f":"J262/CO2_C","v":0}]
[null,"Total  ",null,null,null,null,null,{"$f":"SUM(H260:H262)","v":{"$error":"#N/A"}},"=",{"$f":"H263*MethGWP*10^-6","v":{"$error":"#N/A"}},"=",{"$f":"J263/CO2_C","v":{"$error":"#N/A"}}]
[]
[null,"Natural Gas - Production",null,{"$f":"D256+1","v":2019}]
[]
[null,null,null,"Activity Data",null,"Emission Factor",null,"Metric Tons CH4",null,"MMTCO2E",null,"MMTCE"]
[null,null,null,null,null,"metric tons CH4 per year per activity unit"]
[null,"Total number of wells",null,null,"x",{"$f":"VLOOKUP($B$3,WellEFbyRegion,D265-1988,FALSE)","v":{"$error":"#N/A"}},"=",{"$f":"D269*F269","v":{"$error":"#N/A"}},"=",{"$f":"H269*MethGWP*10^-6","v":{"$error":"#N/A"}},"=",{"$f":"J269/CO2_C","v":{"$error":"#N/A"}}]
[null,"Number of shallow water off-shore platforms in the Gulf of Mexico and Pacific",null,null,"x",{"$f":"Control!$H$15","v":0},"=",{"$f":"D270*F270","v":0},"=",{"$f":"H270*MethGWP*10^-6","v":0},"=",{"$f":"J270/CO2_C","v":0}]
[null,"Number of deepwater off-shore platforms in the Gulf of Mexico and Pacific",null,null,"x",{"$f":"Control!$H$16","v":0},"=",{"$f":"D271*F271","v":0},"=",{"$f":"H271*MethGWP*10^-6","v":0},"=",{"$f":"J271/CO2_C","v":0}]
[null,"Total  ",null,null,null,null,null,{"$f":"SUM(H269:H271)","v":{"$error":"#N/A"}},"=",{"$f":"H272*MethGWP*10^-6","v":{"$error":"#N/A"}},"=",{"$f":"J272/CO2_C","v":{"$error":"#N/A"}}]
[]
[null,"Natural Gas - Production",null,{"$f":"D265+1","v":2020}]
[]
[null,null,null,"Activity Data",null,"Emission Factor",null,"Metric Tons CH4",null,"MMTCO2E",null,"MMTCE"]
[null,null,null,null,null,"metric tons CH4 per year per activity unit"]
[null,"Total number of wells",null,null,"x",{"$f":"VLOOKUP($B$3,WellEFbyRegion,D274-1988,FALSE)","v":{"$error":"#N/A"}},"=",{"$f":"D278*F278","v":{"$error":"#N/A"}},"=",{"$f":"H278*MethGWP*10^-6","v":{"$error":"#N/A"}},"=",{"$f":"J278/CO2_C","v":{"$error":"#N/A"}}]
[null,"Number of shallow water off-shore platforms in the Gulf of Mexico and Pacific",null,null,"x",{"$f":"Control!$H$15","v":0},"=",{"$f":"D279*F279","v":0},"=",{"$f":"H279*MethGWP*10^-6","v":0},"=",{"$f":"J279/CO2_C","v":0}]
[null,"Number of deepwater off-shore platforms in the Gulf of Mexico and Pacific",null,null,"x",{"$f":"Control!$H$16","v":0},"=",{"$f":"D280*F280","v":0},"=",{"$f":"H280*MethGWP*10^-6","v":0},"=",{"$f":"J280/CO2_C","v":0}]
[null,"Total  ",null,null,null,null,null,{"$f":"SUM(H278:H280)","v":{"$error":"#N/A"}},"=",{"$f":"H281*MethGWP*10^-6","v":{"$error":"#N/A"}},"=",{"$f":"J281/CO2_C","v":{"$error":"#N/A"}}]
[]
[null,"Natural Gas - Production",null,{"$f":"D274+1","v":2021}]
[]
[null,null,null,"Activity Data",null,"Emission Factor",null,"Metric Tons CH4",null,"MMTCO2E",null,"MMTCE"]
[null,null,null,null,null,"metric tons CH4 per year per activity unit"]
[null,"Total number of wells",null,null,"x",{"$f":"VLOOKUP($B$3,WellEFbyRegion,D283-1988,FALSE)","v":{"$error":"#N/A"}},"=",{"$f":"D287*F287","v":{"$error":"#N/A"}},"=",{"$f":"H287*MethGWP*10^-6","v":{"$error":"#N/A"}},"=",{"$f":"J287/CO2_C","v":{"$error":"#N/A"}}]
[null,"Number of shallow water off-shore platforms in the Gulf of Mexico and Pacific",null,null,"x",{"$f":"Control!$H$15","v":0},"=",{"$f":"D288*F288","v":0},"=",{"$f":"H288*MethGWP*10^-6","v":0},"=",{"$f":"J288/CO2_C","v":0}]
[null,"Number of deepwater off-shore platforms in the Gulf of Mexico and Pacific",null,null,"x",{"$f":"Control!$H$16","v":0},"=",{"$f":"D289*F289","v":0},"=",{"$f":"H289*MethGWP*10^-6","v":0},"=",{"$f":"J289/CO2_C","v":0}]
[null,"Total  ",null,null,null,null,null,{"$f":"SUM(H287:H289)","v":{"$error":"#N/A"}},"=",{"$f":"H290*MethGWP*10^-6","v":{"$error":"#N/A"}},"=",{"$f":"J290/CO2_C","v":{"$error":"#N/A"}}]
[]
[null,"Natural Gas - Production",null,{"$f":"D283+1","v":2022}]
[]
[null,null,null,"Activity Data",null,"Emission Factor",null,"Metric Tons CH4",null,"MMTCO2E",null,"MMTCE"]
[null,null,null,null,null,"metric tons CH4 per year per activity unit"]
[null,"Total number of wells",null,null,"x",{"$f":"VLOOKUP($B$3,WellEFbyRegion,D292-1988,FALSE)","v":{"$error":"#N/A"}},"=",{"$f":"D296*F296","v":{"$error":"#N/A"}},"=",{"$f":"H296*MethGWP*10^-6","v":{"$error":"#N/A"}},"=",{"$f":"J296/CO2_C","v":{"$error":"#N/A"}}]
[null,"Number of shallow water off-shore platforms in the Gulf of Mexico and Pacific",null,null,"x",{"$f":"Control!$H$15","v":0},"=",{"$f":"D297*F297","v":0},"=",{"$f":"H297*MethGWP*10^-6","v":0},"=",{"$f":"J297/CO2_C","v":0}]
[null,"Number of deepwater off-shore platforms in the Gulf of Mexico and Pacific",null,null,"x",{"$f":"Control!$H$16","v":0},"=",{"$f":"D298*F298","v":0},"=",{"$f":"H298*MethGWP*10^-6","v":0},"=",{"$f":"J298/CO2_C","v":0}]
[null,"Total  ",null,null,null,null,null,{"$f":"SUM(H296:H298)","v":{"$error":"#N/A"}},"=",{"$f":"H299*MethGWP*10^-6","v":{"$error":"#N/A"}},"=",{"$f":"J299/CO2_C","v":{"$error":"#N/A"}}]
[]
[null,"Natural Gas - Production",null,{"$f":"D292+1","v":2023}]
[]
[null,null,null,"Activity Data",null,"Emission Factor",null,"Metric Tons CH4",null,"MMTCO2E",null,"MMTCE"]
[null,null,null,null,null,"metric tons CH4 per year per activity unit"]
[null,"Total number of wells",null,null,"x",{"$f":"VLOOKUP($B$3,WellEFbyRegion,D301-1988,FALSE)","v":{"$error":"#N/A"}},"=",{"$f":"D305*F305","v":{"$error":"#N/A"}},"=",{"$f":"H305*MethGWP*10^-6","v":{"$error":"#N/A"}},"=",{"$f":"J305/CO2_C","v":{"$error":"#N/A"}}]
[null,"Number of shallow water off-shore platforms in the Gulf of Mexico and Pacific",null,null,"x",{"$f":"Control!$H$15","v":0},"=",{"$f":"D306*F306","v":0},"=",{"$f":"H306*MethGWP*10^-6","v":0},"=",{"$f":"J306/CO2_C","v":0}]
[null,"Number of deepwater off-shore platforms in the Gulf of Mexico and Pacific",null,null,"x",{"$f":"Control!$H$16","v":0},"=",{"$f":"D307*F307","v":0},"=",{"$f":"H307*MethGWP*10^-6","v":0},"=",{"$f":"J307/CO2_C","v":0}]
[null,"Total  ",null,null,null,null,null,{"$f":"SUM(H305:H307)","v":{"$error":"#N/A"}},"=",{"$f":"H308*MethGWP*10^-6","v":{"$error":"#N/A"}},"=",{"$f":"J308/CO2_C","v":{"$error":"#N/A"}}]
[]
[null,"Natural Gas - Production",null,{"$f":"D301+1","v":2024}]
[]
[null,null,null,"Activity Data",null,"Emission Factor",null,"Metric Tons CH4",null,"MMTCO2E",null,"MMTCE"]
[null,null,null,null,null,"metric tons CH4 per year per activity unit"]
[null,"Total number of wells",null,null,"x",{"$f":"VLOOKUP($B$3,WellEFbyRegion,D310-1988,FALSE)","v":{"$error":"#N/A"}},"=",{"$f":"D314*F314","v":{"$error":"#N/A"}},"=",{"$f":"H314*MethGWP*10^-6","v":{"$error":"#N/A"}},"=",{"$f":"J314/CO2_C","v":{"$error":"#N/A"}}]
[null,"Number of shallow water off-shore platforms in the Gulf of Mexico and Pacific",null,null,"x",{"$f":"Control!$H$15","v":0},"=",{"$f":"D315*F315","v":0},"=",{"$f":"H315*MethGWP*10^-6","v":0},"=",{"$f":"J315/CO2_C","v":0}]
[null,"Number of deepwater off-shore platforms in the Gulf of Mexico and Pacific",null,null,"x",{"$f":"Control!$H$16","v":0},"=",{"$f":"D316*F316","v":0},"=",{"$f":"H316*MethGWP*10^-6","v":0},"=",{"$f":"J316/CO2_C","v":0}]
[null,"Total  ",null,null,null,null,null,{"$f":"SUM(H314:H316)","v":{"$error":"#N/A"}},"=",{"$f":"H317*MethGWP*10^-6","v":{"$error":"#N/A"}},"=",{"$f":"J317/CO2_C","v":{"$error":"#N/A"}}]
[]
[null,"Natural Gas - Production",null,{"$f":"D310+1","v":2025}]
[]
[null,null,null,"Activity Data",null,"Emission Factor",null,"Metric Tons CH4",null,"MMTCO2E",null,"MMTCE"]
[null,null,null,null,null,"metric tons CH4 per year per activity unit"]
[null,"Total number of wells",null,null,"x",{"$f":"VLOOKUP($B$3,WellEFbyRegion,D319-1988,FALSE)","v":{"$error":"#N/A"}},"=",{"$f":"D323*F323","v":{"$error":"#N/A"}},"=",{"$f":"H323*MethGWP*10^-6","v":{"$error":"#N/A"}},"=",{"$f":"J323/CO2_C","v":{"$error":"#N/A"}}]
[null,"Number of shallow water off-shore platforms in the Gulf of Mexico and Pacific",null,null,"x",{"$f":"Control!$H$15","v":0},"=",{"$f":"D324*F324","v":0},"=",{"$f":"H324*MethGWP*10^-6","v":0},"=",{"$f":"J324/CO2_C","v":0}]
[null,"Number of deepwater off-shore platforms in the Gulf of Mexico and Pacific",null,null,"x",{"$f":"Control!$H$16","v":0},"=",{"$f":"D325*F325","v":0},"=",{"$f":"H325*MethGWP*10^-6","v":0},"=",{"$f":"J325/CO2_C","v":0}]
[null,"Total  ",null,null,null,null,null,{"$f":"SUM(H323:H325)","v":{"$error":"#N/A"}},"=",{"$f":"H326*MethGWP*10^-6","v":{"$error":"#N/A"}},"=",{"$f":"J326/CO2_C","v":{"$error":"#N/A"}}]

{"sheet":"Natural Gas - Transmission","index":4,"n_rows":473,"n_cols":13,"rows_kept":473,"cut":false,"hidden":false,"merged":[[4,2,4,6],[4,8,4,11]]}
[null,{"$f":"\"3. Emission from Natural Gas Transmission Activities in \"&ListData!D2","v":"3. Emission from Natural Gas Transmission Activities in Select a State . . ."}]
[]
[]
[]
[null,null,"Gas Transmission Compressor Stations/Mile of Transmission Pipeline",null,null,null,null,5.9523809523809529E-3,"Gas Storage Compressor Stations/Mile of Transmission Pipeline",null,null,null,1.509442516844746E-3]
[]
[null,"Natural Gas - Transmission",1990]
[]
[null,null,null,"Activity Data",null,"Emission Factor",null,"Metric Tons CH4",null,"MMTCO2E",null,"MMTCE"]
[null,null,null,null,null,"metric tons CH4 per year per activity unit"]
[null,"Miles of gathering pipeline ","-->",null,"x",{"$f":"Control!$H$20","v":0},"=",{"$f":"D11*F11","v":0},"=",{"$f":"H11*MethGWP*10^-6","v":0},"=",{"$f":"J11/CO2_C","v":0}]
[null,"Number of gas processing plants","-->",null,"x",{"$f":"Control!$H$21","v":0},"=",{"$f":"D12*F12","v":0},"=",{"$f":"H12*MethGWP*10^-6","v":0},"=",{"$f":"J12/CO2_C","v":0}]
[null,"Number of LNG storage compressor stations","-->",null,"x",{"$f":"Control!$H$25","v":0},"=",{"$f":"D13*F13","v":0},"=",{"$f":"H13*MethGWP*10^-6","v":0},"=",{"$f":"J13/CO2_C","v":0}]
[]
[null,"Miles of transmission pipeline","-->",null,"x",{"$f":"Control!$H$24","v":0},"=",{"$f":"D15*F15","v":0},"=",{"$f":"H15*MethGWP*10^-6","v":0},"=",{"$f":"J15/CO2_C","v":0}]
[null,"Number of gas transmission compressor stations","-->",null,"x",{"$f":"Control!$H$22","v":0},"=",{"$f":"D16*F16","v":0},"=",{"$f":"H16*MethGWP*10^-6","v":0},"=",{"$f":"J16/CO2_C","v":0}]
[null,"Number of gas storage compressor stations","-->",null,"x",{"$f":"Control!$H$23","v":0},"=",{"$f":"D17*F17","v":0},"=",{"$f":"H17*MethGWP*10^-6","v":0},"=",{"$f":"J17/CO2_C","v":0}]
[null,"Total  ",null,null,null,null,null,{"$f":"SUM(H11:H17)","v":0},"=",{"$f":"H18*MethGWP*10^-6","v":0},"=",{"$f":"J18/CO2_C","v":0}]
[]
[null,"Natural Gas - Transmission",{"$f":"C7+1","v":1991}]
[]
[null,null,null,"Activity Data",null,"Emission Factor",null,"Metric Tons CH4",null,"MMTCO2E",null,"MMTCE"]
[null,null,null,null,null,"metric tons CH4 per year per activity unit"]
[null,"Miles of gathering pipeline ","-->",null,"x",{"$f":"Control!$H$20","v":0},"=",{"$f":"D24*F24","v":0},"=",{"$f":"H24*MethGWP*10^-6","v":0},"=",{"$f":"J24/CO2_C","v":0}]
[null,"Number of gas processing plants","-->",null,"x",{"$f":"Control!$H$21","v":0},"=",{"$f":"D25*F25","v":0},"=",{"$f":"H25*MethGWP*10^-6","v":0},"=",{"$f":"J25/CO2_C","v":0}]
[null,"Number of LNG storage compressor stations","-->",null,"x",{"$f":"Control!$H$25","v":0},"=",{"$f":"D26*F26","v":0},"=",{"$f":"H26*MethGWP*10^-6","v":0},"=",{"$f":"J26/CO2_C","v":0}]
[]
[null,"Miles of transmission pipeline","-->",null,"x",{"$f":"Control!$H$24","v":0},"=",{"$f":"D28*F28","v":0},"=",{"$f":"H28*MethGWP*10^-6","v":0},"=",{"$f":"J28/CO2_C","v":0}]
[null,"Number of gas transmission compressor stations","-->",null,"x",{"$f":"Control!$H$22","v":0},"=",{"$f":"D29*F29","v":0},"=",{"$f":"H29*MethGWP*10^-6","v":0},"=",{"$f":"J29/CO2_C","v":0}]
[null,"Number of gas storage compressor stations","-->",null,"x",{"$f":"Control!$H$23","v":0},"=",{"$f":"D30*F30","v":0},"=",{"$f":"H30*MethGWP*10^-6","v":0},"=",{"$f":"J30/CO2_C","v":0}]
[null,"Total  ",null,null,null,null,null,{"$f":"SUM(H24:H30)","v":0},"=",{"$f":"H31*MethGWP*10^-6","v":0},"=",{"$f":"J31/CO2_C","v":0}]
[]
[null,"Natural Gas - Transmission",{"$f":"C20+1","v":1992}]
[]
[null,null,null,"Activity Data",null,"Emission Factor",null,"Metric Tons CH4",null,"MMTCO2E",null,"MMTCE"]
[null,null,null,null,null,"metric tons CH4 per year per activity unit"]
[null,"Miles of gathering pipeline ","-->",null,"x",{"$f":"Control!$H$20","v":0},"=",{"$f":"D37*F37","v":0},"=",{"$f":"H37*MethGWP*10^-6","v":0},"=",{"$f":"J37/CO2_C","v":0}]
[null,"Number of gas processing plants","-->",null,"x",{"$f":"Control!$H$21","v":0},"=",{"$f":"D38*F38","v":0},"=",{"$f":"H38*MethGWP*10^-6","v":0},"=",{"$f":"J38/CO2_C","v":0}]
[null,"Number of LNG storage compressor stations","-->",null,"x",{"$f":"Control!$H$25","v":0},"=",{"$f":"D39*F39","v":0},"=",{"$f":"H39*MethGWP*10^-6","v":0},"=",{"$f":"J39/CO2_C","v":0}]
[]
[null,"Miles of transmission pipeline","-->",null,"x",{"$f":"Control!$H$24","v":0},"=",{"$f":"D41*F41","v":0},"=",{"$f":"H41*MethGWP*10^-6","v":0},"=",{"$f":"J41/CO2_C","v":0}]
[null,"Number of gas transmission compressor stations","-->",null,"x",{"$f":"Control!$H$22","v":0},"=",{"$f":"D42*F42","v":0},"=",{"$f":"H42*MethGWP*10^-6","v":0},"=",{"$f":"J42/CO2_C","v":0}]
[null,"Number of gas storage compressor stations","-->",null,"x",{"$f":"Control!$H$23","v":0},"=",{"$f":"D43*F43","v":0},"=",{"$f":"H43*MethGWP*10^-6","v":0},"=",{"$f":"J43/CO2_C","v":0}]
[null,"Total  ",null,null,null,null,null,{"$f":"SUM(H37:H43)","v":0},"=",{"$f":"H44*MethGWP*10^-6","v":0},"=",{"$f":"J44/CO2_C","v":0}]
[]
[null,"Natural Gas - Transmission",{"$f":"C33+1","v":1993}]
[]
[null,null,null,"Activity Data",null,"Emission Factor",null,"Metric Tons CH4",null,"MMTCO2E",null,"MMTCE"]
[null,null,null,null,null,"metric tons CH4 per year per activity unit"]
[null,"Miles of gathering pipeline ","-->",null,"x",{"$f":"Control!$H$20","v":0},"=",{"$f":"D50*F50","v":0},"=",{"$f":"H50*MethGWP*10^-6","v":0},"=",{"$f":"J50/CO2_C","v":0}]
[null,"Number of gas processing plants","-->",null,"x",{"$f":"Control!$H$21","v":0},"=",{"$f":"D51*F51","v":0},"=",{"$f":"H51*MethGWP*10^-6","v":0},"=",{"$f":"J51/CO2_C","v":0}]
[null,"Number of LNG storage compressor stations","-->",null,"x",{"$f":"Control!$H$25","v":0},"=",{"$f":"D52*F52","v":0},"=",{"$f":"H52*MethGWP*10^-6","v":0},"=",{"$f":"J52/CO2_C","v":0}]
[]
[null,"Miles of transmission pipeline","-->",null,"x",{"$f":"Control!$H$24","v":0},"=",{"$f":"D54*F54","v":0},"=",{"$f":"H54*MethGWP*10^-6","v":0},"=",{"$f":"J54/CO2_C","v":0}]
[null,"Number of gas transmission compressor stations","-->",null,"x",{"$f":"Control!$H$22","v":0},"=",{"$f":"D55*F55","v":0},"=",{"$f":"H55*MethGWP*10^-6","v":0},"=",{"$f":"J55/CO2_C","v":0}]
[null,"Number of gas storage compressor stations","-->",null,"x",{"$f":"Control!$H$23","v":0},"=",{"$f":"D56*F56","v":0},"=",{"$f":"H56*MethGWP*10^-6","v":0},"=",{"$f":"J56/CO2_C","v":0}]
[null,"Total  ",null,null,null,null,null,{"$f":"SUM(H50:H56)","v":0},"=",{"$f":"H57*MethGWP*10^-6","v":0},"=",{"$f":"J57/CO2_C","v":0}]
[]
[null,"Natural Gas - Transmission",{"$f":"C46+1","v":1994}]
[]
[null,null,null,"Activity Data",null,"Emission Factor",null,"Metric Tons CH4",null,"MMTCO2E",null,"MMTCE"]
[null,null,null,null,null,"metric tons CH4 per year per activity unit"]
[null,"Miles of gathering pipeline ","-->",null,"x",{"$f":"Control!$H$20","v":0},"=",{"$f":"D63*F63","v":0},"=",{"$f":"H63*MethGWP*10^-6","v":0},"=",{"$f":"J63/CO2_C","v":0}]
[null,"Number of gas processing plants","-->",null,"x",{"$f":"Control!$H$21","v":0},"=",{"$f":"D64*F64","v":0},"=",{"$f":"H64*MethGWP*10^-6","v":0},"=",{"$f":"J64/CO2_C","v":0}]
[null,"Number of LNG storage compressor stations","-->",null,"x",{"$f":"Control!$H$25","v":0},"=",{"$f":"D65*F65","v":0},"=",{"$f":"H65*MethGWP*10^-6","v":0},"=",{"$f":"J65/CO2_C","v":0}]
[]
[null,"Miles of transmission pipeline","-->",null,"x",{"$f":"Control!$H$24","v":0},"=",{"$f":"D67*F67","v":0},"=",{"$f":"H67*MethGWP*10^-6","v":0},"=",{"$f":"J67/CO2_C","v":0}]
[null,"Number of gas transmission compressor stations","-->",null,"x",{"$f":"Control!$H$22","v":0},"=",{"$f":"D68*F68","v":0},"=",{"$f":"H68*MethGWP*10^-6","v":0},"=",{"$f":"J68/CO2_C","v":0}]
[null,"Number of gas storage compressor stations","-->",null,"x",{"$f":"Control!$H$23","v":0},"=",{"$f":"D69*F69","v":0},"=",{"$f":"H69*MethGWP*10^-6","v":0},"=",{"$f":"J69/CO2_C","v":0}]
[null,"Total  ",null,null,null,null,null,{"$f":"SUM(H63:H69)","v":0},"=",{"$f":"H70*MethGWP*10^-6","v":0},"=",{"$f":"J70/CO2_C","v":0}]
[]
[null,"Natural Gas - Transmission",{"$f":"C59+1","v":1995}]
[]
[null,null,null,"Activity Data",null,"Emission Factor",null,"Metric Tons CH4",null,"MMTCO2E",null,"MMTCE"]
[null,null,null,null,null,"metric tons CH4 per year per activity unit"]
[null,"Miles of gathering pipeline ","-->",null,"x",{"$f":"Control!$H$20","v":0},"=",{"$f":"D76*F76","v":0},"=",{"$f":"H76*MethGWP*10^-6","v":0},"=",{"$f":"J76/CO2_C","v":0}]
[null,"Number of gas processing plants","-->",null,"x",{"$f":"Control!$H$21","v":0},"=",{"$f":"D77*F77","v":0},"=",{"$f":"H77*MethGWP*10^-6","v":0},"=",{"$f":"J77/CO2_C","v":0}]
[null,"Number of LNG storage compressor stations","-->",null,"x",{"$f":"Control!$H$25","v":0},"=",{"$f":"D78*F78","v":0},"=",{"$f":"H78*MethGWP*10^-6","v":0},"=",{"$f":"J78/CO2_C","v":0}]
[]
[null,"Miles of transmission pipeline","-->",null,"x",{"$f":"Control!$H$24","v":0},"=",{"$f":"D80*F80","v":0},"=",{"$f":"H80*MethGWP*10^-6","v":0},"=",{"$f":"J80/CO2_C","v":0}]
[null,"Number of gas transmission compressor stations","-->",null,"x",{"$f":"Control!$H$22","v":0},"=",{"$f":"D81*F81","v":0},"=",{"$f":"H81*MethGWP*10^-6","v":0},"=",{"$f":"J81/CO2_C","v":0}]
[null,"Number of gas storage compressor stations","-->",null,"x",{"$f":"Control!$H$23","v":0},"=",{"$f":"D82*F82","v":0},"=",{"$f":"H82*MethGWP*10^-6","v":0},"=",{"$f":"J82/CO2_C","v":0}]
[null,"Total  ",null,null,null,null,null,{"$f":"SUM(H76:H82)","v":0},"=",{"$f":"H83*MethGWP*10^-6","v":0},"=",{"$f":"J83/CO2_C","v":0}]
[]
[null,"Natural Gas - Transmission",{"$f":"C72+1","v":1996}]
[]
[null,null,null,"Activity Data",null,"Emission Factor",null,"Metric Tons CH4",null,"MMTCO2E",null,"MMTCE"]
[null,null,null,null,null,"metric tons CH4 per year per activity unit"]
[null,"Miles of gathering pipeline ","-->",null,"x",{"$f":"Control!$H$20","v":0},"=",{"$f":"D89*F89","v":0},"=",{"$f":"H89*MethGWP*10^-6","v":0},"=",{"$f":"J89/CO2_C","v":0}]
[null,"Number of gas processing plants","-->",null,"x",{"$f":"Control!$H$21","v":0},"=",{"$f":"D90*F90","v":0},"=",{"$f":"H90*MethGWP*10^-6","v":0},"=",{"$f":"J90/CO2_C","v":0}]
[null,"Number of LNG storage compressor stations","-->",null,"x",{"$f":"Control!$H$25","v":0},"=",{"$f":"D91*F91","v":0},"=",{"$f":"H91*MethGWP*10^-6","v":0},"=",{"$f":"J91/CO2_C","v":0}]
[]
[null,"Miles of transmission pipeline","-->",null,"x",{"$f":"Control!$H$24","v":0},"=",{"$f":"D93*F93","v":0},"=",{"$f":"H93*MethGWP*10^-6","v":0},"=",{"$f":"J93/CO2_C","v":0}]
[null,"Number of gas transmission compressor stations","-->",null,"x",{"$f":"Control!$H$22","v":0},"=",{"$f":"D94*F94","v":0},"=",{"$f":"H94*MethGWP*10^-6","v":0},"=",{"$f":"J94/CO2_C","v":0}]
[null,"Number of gas storage compressor stations","-->",null,"x",{"$f":"Control!$H$23","v":0},"=",{"$f":"D95*F95","v":0},"=",{"$f":"H95*MethGWP*10^-6","v":0},"=",{"$f":"J95/CO2_C","v":0}]
[null,"Total  ",null,null,null,null,null,{"$f":"SUM(H89:H95)","v":0},"=",{"$f":"H96*MethGWP*10^-6","v":0},"=",{"$f":"J96/CO2_C","v":0}]
[]
[null,"Natural Gas - Transmission",{"$f":"C85+1","v":1997}]
[]
[null,null,null,"Activity Data",null,"Emission Factor",null,"Metric Tons CH4",null,"MMTCO2E",null,"MMTCE"]
[null,null,null,null,null,"metric tons CH4 per year per activity unit"]
[null,"Miles of gathering pipeline ","-->",null,"x",{"$f":"Control!$H$20","v":0},"=",{"$f":"D102*F102","v":0},"=",{"$f":"H102*MethGWP*10^-6","v":0},"=",{"$f":"J102/CO2_C","v":0}]
[null,"Number of gas processing plants","-->",null,"x",{"$f":"Control!$H$21","v":0},"=",{"$f":"D103*F103","v":0},"=",{"$f":"H103*MethGWP*10^-6","v":0},"=",{"$f":"J103/CO2_C","v":0}]
[null,"Number of LNG storage compressor stations","-->",null,"x",{"$f":"Control!$H$25","v":0},"=",{"$f":"D104*F104","v":0},"=",{"$f":"H104*MethGWP*10^-6","v":0},"=",{"$f":"J104/CO2_C","v":0}]
[]
[null,"Miles of transmission pipeline","-->",null,"x",{"$f":"Control!$H$24","v":0},"=",{"$f":"D106*F106","v":0},"=",{"$f":"H106*MethGWP*10^-6","v":0},"=",{"$f":"J106/CO2_C","v":0}]
[null,"Number of gas transmission compressor stations","-->",null,"x",{"$f":"Control!$H$22","v":0},"=",{"$f":"D107*F107","v":0},"=",{"$f":"H107*MethGWP*10^-6","v":0},"=",{"$f":"J107/CO2_C","v":0}]
[null,"Number of gas storage compressor stations","-->",null,"x",{"$f":"Control!$H$23","v":0},"=",{"$f":"D108*F108","v":0},"=",{"$f":"H108*MethGWP*10^-6","v":0},"=",{"$f":"J108/CO2_C","v":0}]
[null,"Total  ",null,null,null,null,null,{"$f":"SUM(H102:H108)","v":0},"=",{"$f":"H109*MethGWP*10^-6","v":0},"=",{"$f":"J109/CO2_C","v":0}]
[]
[null,"Natural Gas - Transmission",{"$f":"C98+1","v":1998}]
[]
[null,null,null,"Activity Data",null,"Emission Factor",null,"Metric Tons CH4",null,"MMTCO2E",null,"MMTCE"]
[null,null,null,null,null,"metric tons CH4 per year per activity unit"]
[null,"Miles of gathering pipeline ","-->",null,"x",{"$f":"Control!$H$20","v":0},"=",{"$f":"D115*F115","v":0},"=",{"$f":"H115*MethGWP*10^-6","v":0},"=",{"$f":"J115/CO2_C","v":0}]
[null,"Number of gas processing plants","-->",null,"x",{"$f":"Control!$H$21","v":0},"=",{"$f":"D116*F116","v":0},"=",{"$f":"H116*MethGWP*10^-6","v":0},"=",{"$f":"J116/CO2_C","v":0}]
[null,"Number of LNG storage compressor stations","-->",null,"x",{"$f":"Control!$H$25","v":0},"=",{"$f":"D117*F117","v":0},"=",{"$f":"H117*MethGWP*10^-6","v":0},"=",{"$f":"J117/CO2_C","v":0}]
[]
[null,"Miles of transmission pipeline","-->",null,"x",{"$f":"Control!$H$24","v":0},"=",{"$f":"D119*F119","v":0},"=",{"$f":"H119*MethGWP*10^-6","v":0},"=",{"$f":"J119/CO2_C","v":0}]
[null,"Number of gas transmission compressor stations","-->",null,"x",{"$f":"Control!$H$22","v":0},"=",{"$f":"D120*F120","v":0},"=",{"$f":"H120*MethGWP*10^-6","v":0},"=",{"$f":"J120/CO2_C","v":0}]
[null,"Number of gas storage compressor stations","-->",null,"x",{"$f":"Control!$H$23","v":0},"=",{"$f":"D121*F121","v":0},"=",{"$f":"H121*MethGWP*10^-6","v":0},"=",{"$f":"J121/CO2_C","v":0}]
[null,"Total  ",null,null,null,null,null,{"$f":"SUM(H115:H121)","v":0},"=",{"$f":"H122*MethGWP*10^-6","v":0},"=",{"$f":"J122/CO2_C","v":0}]
[]
[null,"Natural Gas - Transmission",{"$f":"C111+1","v":1999}]
[]
[null,null,null,"Activity Data",null,"Emission Factor",null,"Metric Tons CH4",null,"MMTCO2E",null,"MMTCE"]
[null,null,null,null,null,"metric tons CH4 per year per activity unit"]
[null,"Miles of gathering pipeline ","-->",null,"x",{"$f":"Control!$H$20","v":0},"=",{"$f":"D128*F128","v":0},"=",{"$f":"H128*MethGWP*10^-6","v":0},"=",{"$f":"J128/CO2_C","v":0}]
[null,"Number of gas processing plants","-->",null,"x",{"$f":"Control!$H$21","v":0},"=",{"$f":"D129*F129","v":0},"=",{"$f":"H129*MethGWP*10^-6","v":0},"=",{"$f":"J129/CO2_C","v":0}]
[null,"Number of LNG storage compressor stations","-->",null,"x",{"$f":"Control!$H$25","v":0},"=",{"$f":"D130*F130","v":0},"=",{"$f":"H130*MethGWP*10^-6","v":0},"=",{"$f":"J130/CO2_C","v":0}]
[]
[null,"Miles of transmission pipeline","-->",null,"x",{"$f":"Control!$H$24","v":0},"=",{"$f":"D132*F132","v":0},"=",{"$f":"H132*MethGWP*10^-6","v":0},"=",{"$f":"J132/CO2_C","v":0}]
[null,"Number of gas transmission compressor stations","-->",null,"x",{"$f":"Control!$H$22","v":0},"=",{"$f":"D133*F133","v":0},"=",{"$f":"H133*MethGWP*10^-6","v":0},"=",{"$f":"J133/CO2_C","v":0}]
[null,"Number of gas storage compressor stations","-->",null,"x",{"$f":"Control!$H$23","v":0},"=",{"$f":"D134*F134","v":0},"=",{"$f":"H134*MethGWP*10^-6","v":0},"=",{"$f":"J134/CO2_C","v":0}]
[null,"Total  ",null,null,null,null,null,{"$f":"SUM(H128:H134)","v":0},"=",{"$f":"H135*MethGWP*10^-6","v":0},"=",{"$f":"J135/CO2_C","v":0}]
[]
[null,"Natural Gas - Transmission",{"$f":"C124+1","v":2000}]
[]
[null,null,null,"Activity Data",null,"Emission Factor",null,"Metric Tons CH4",null,"MMTCO2E",null,"MMTCE"]
[null,null,null,null,null,"metric tons CH4 per year per activity unit"]
[null,"Miles of gathering pipeline ","-->",null,"x",{"$f":"Control!$H$20","v":0},"=",{"$f":"D141*F141","v":0},"=",{"$f":"H141*MethGWP*10^-6","v":0},"=",{"$f":"J141/CO2_C","v":0}]
[null,"Number of gas processing plants","-->",null,"x",{"$f":"Control!$H$21","v":0},"=",{"$f":"D142*F142","v":0},"=",{"$f":"H142*MethGWP*10^-6","v":0},"=",{"$f":"J142/CO2_C","v":0}]
[null,"Number of LNG storage compressor stations","-->",null,"x",{"$f":"Control!$H$25","v":0},"=",{"$f":"D143*F143","v":0},"=",{"$f":"H143*MethGWP*10^-6","v":0},"=",{"$f":"J143/CO2_C","v":0}]
[]
[null,"Miles of transmission pipeline","-->",null,"x",{"$f":"Control!$H$24","v":0},"=",{"$f":"D145*F145","v":0},"=",{"$f":"H145*MethGWP*10^-6","v":0},"=",{"$f":"J145/CO2_C","v":0}]
[null,"Number of gas transmission compressor stations","-->",null,"x",{"$f":"Control!$H$22","v":0},"=",{"$f":"D146*F146","v":0},"=",{"$f":"H146*MethGWP*10^-6","v":0},"=",{"$f":"J146/CO2_C","v":0}]
[null,"Number of gas storage compressor stations","-->",null,"x",{"$f":"Control!$H$23","v":0},"=",{"$f":"D147*F147","v":0},"=",{"$f":"H147*MethGWP*10^-6","v":0},"=",{"$f":"J147/CO2_C","v":0}]
[null,"Total  ",null,null,null,null,null,{"$f":"SUM(H141:H147)","v":0},"=",{"$f":"H148*MethGWP*10^-6","v":0},"=",{"$f":"J148/CO2_C","v":0}]
[]
[null,"Natural Gas - Transmission",{"$f":"C137+1","v":2001}]
[]
[null,null,null,"Activity Data",null,"Emission Factor",null,"Metric Tons CH4",null,"MMTCO2E",null,"MMTCE"]
[null,null,null,null,null,"metric tons CH4 per year per activity unit"]
[null,"Miles of gathering pipeline ","-->",null,"x",{"$f":"Control!$H$20","v":0},"=",{"$f":"D154*F154","v":0},"=",{"$f":"H154*MethGWP*10^-6","v":0},"=",{"$f":"J154/CO2_C","v":0}]
[null,"Number of gas processing plants","-->",null,"x",{"$f":"Control!$H$21","v":0},"=",{"$f":"D155*F155","v":0},"=",{"$f":"H155*MethGWP*10^-6","v":0},"=",{"$f":"J155/CO2_C","v":0}]
[null,"Number of LNG storage compressor stations","-->",null,"x",{"$f":"Control!$H$25","v":0},"=",{"$f":"D156*F156","v":0},"=",{"$f":"H156*MethGWP*10^-6","v":0},"=",{"$f":"J156/CO2_C","v":0}]
[]
[null,"Miles of transmission pipeline","-->",null,"x",{"$f":"Control!$H$24","v":0},"=",{"$f":"D158*F158","v":0},"=",{"$f":"H158*MethGWP*10^-6","v":0},"=",{"$f":"J158/CO2_C","v":0}]
[null,"Number of gas transmission compressor stations","-->",null,"x",{"$f":"Control!$H$22","v":0},"=",{"$f":"D159*F159","v":0},"=",{"$f":"H159*MethGWP*10^-6","v":0},"=",{"$f":"J159/CO2_C","v":0}]
[null,"Number of gas storage compressor stations","-->",null,"x",{"$f":"Control!$H$23","v":0},"=",{"$f":"D160*F160","v":0},"=",{"$f":"H160*MethGWP*10^-6","v":0},"=",{"$f":"J160/CO2_C","v":0}]
[null,"Total  ",null,null,null,null,null,{"$f":"SUM(H154:H160)","v":0},"=",{"$f":"H161*MethGWP*10^-6","v":0},"=",{"$f":"J161/CO2_C","v":0}]
[]
[null,"Natural Gas - Transmission",{"$f":"C150+1","v":2002}]
[]
[null,null,null,"Activity Data",null,"Emission Factor",null,"Metric Tons CH4",null,"MMTCO2E",null,"MMTCE"]
[null,null,null,null,null,"metric tons CH4 per year per activity unit"]
[null,"Miles of gathering pipeline ","-->",null,"x",{"$f":"Control!$H$20","v":0},"=",{"$f":"D167*F167","v":0},"=",{"$f":"H167*MethGWP*10^-6","v":0},"=",{"$f":"J167/CO2_C","v":0}]
[null,"Number of gas processing plants","-->",null,"x",{"$f":"Control!$H$21","v":0},"=",{"$f":"D168*F168","v":0},"=",{"$f":"H168*MethGWP*10^-6","v":0},"=",{"$f":"J168/CO2_C","v":0}]
[null,"Number of LNG storage compressor stations","-->",null,"x",{"$f":"Control!$H$25","v":0},"=",{"$f":"D169*F169","v":0},"=",{"$f":"H169*MethGWP*10^-6","v":0},"=",{"$f":"J169/CO2_C","v":0}]
[]
[null,"Miles of transmission pipeline","-->",null,"x",{"$f":"Control!$H$24","v":0},"=",{"$f":"D171*F171","v":0},"=",{"$f":"H171*MethGWP*10^-6","v":0},"=",{"$f":"J171/CO2_C","v":0}]
[null,"Number of gas transmission compressor stations","-->",null,"x",{"$f":"Control!$H$22","v":0},"=",{"$f":"D172*F172","v":0},"=",{"$f":"H172*MethGWP*10^-6","v":0},"=",{"$f":"J172/CO2_C","v":0}]
[null,"Number of gas storage compressor stations","-->",null,"x",{"$f":"Control!$H$23","v":0},"=",{"$f":"D173*F173","v":0},"=",{"$f":"H173*MethGWP*10^-6","v":0},"=",{"$f":"J173/CO2_C","v":0}]
[null,"Total  ",null,null,null,null,null,{"$f":"SUM(H167:H173)","v":0},"=",{"$f":"H174*MethGWP*10^-6","v":0},"=",{"$f":"J174/CO2_C","v":0}]
[]
[null,"Natural Gas - Transmission",{"$f":"C163+1","v":2003}]
[]
[null,null,null,"Activity Data",null,"Emission Factor",null,"Metric Tons CH4",null,"MMTCO2E",null,"MMTCE"]
[null,null,null,null,null,"metric tons CH4 per year per activity unit"]
[null,"Miles of gathering pipeline ","-->",null,"x",{"$f":"Control!$H$20","v":0},"=",{"$f":"D180*F180","v":0},"=",{"$f":"H180*MethGWP*10^-6","v":0},"=",{"$f":"J180/CO2_C","v":0}]
[null,"Number of gas processing plants","-->",null,"x",{"$f":"Control!$H$21","v":0},"=",{"$f":"D181*F181","v":0},"=",{"$f":"H181*MethGWP*10^-6","v":0},"=",{"$f":"J181/CO2_C","v":0}]
[null,"Number of LNG storage compressor stations","-->",null,"x",{"$f":"Control!$H$25","v":0},"=",{"$f":"D182*F182","v":0},"=",{"$f":"H182*MethGWP*10^-6","v":0},"=",{"$f":"J182/CO2_C","v":0}]
[]
[null,"Miles of transmission pipeline","-->",null,"x",{"$f":"Control!$H$24","v":0},"=",{"$f":"D184*F184","v":0},"=",{"$f":"H184*MethGWP*10^-6","v":0},"=",{"$f":"J184/CO2_C","v":0}]
[null,"Number of gas transmission compressor stations","-->",null,"x",{"$f":"Control!$H$22","v":0},"=",{"$f":"D185*F185","v":0},"=",{"$f":"H185*MethGWP*10^-6","v":0},"=",{"$f":"J185/CO2_C","v":0}]
[null,"Number of gas storage compressor stations","-->",null,"x",{"$f":"Control!$H$23","v":0},"=",{"$f":"D186*F186","v":0},"=",{"$f":"H186*MethGWP*10^-6","v":0},"=",{"$f":"J186/CO2_C","v":0}]
[null,"Total  ",null,null,null,null,null,{"$f":"SUM(H180:H186)","v":0},"=",{"$f":"H187*MethGWP*10^-6","v":0},"=",{"$f":"J187/CO2_C","v":0}]
[]
[null,"Natural Gas - Transmission",{"$f":"C176+1","v":2004}]
[]
[null,null,null,"Activity Data",null,"Emission Factor",null,"Metric Tons CH4",null,"MMTCO2E",null,"MMTCE"]
[null,null,null,null,null,"metric tons CH4 per year per activity unit"]
[null,"Miles of gathering pipeline ","-->",null,"x",{"$f":"Control!$H$20","v":0},"=",{"$f":"D193*F193","v":0},"=",{"$f":"H193*MethGWP*10^-6","v":0},"=",{"$f":"J193/CO2_C","v":0}]
[null,"Number of gas processing plants","-->",null,"x",{"$f":"Control!$H$21","v":0},"=",{"$f":"D194*F194","v":0},"=",{"$f":"H194*MethGWP*10^-6","v":0},"=",{"$f":"J194/CO2_C","v":0}]
[null,"Number of LNG storage compressor stations","-->",null,"x",{"$f":"Control!$H$25","v":0},"=",{"$f":"D195*F195","v":0},"=",{"$f":"H195*MethGWP*10^-6","v":0},"=",{"$f":"J195/CO2_C","v":0}]
[]
[null,"Miles of transmission pipeline","-->",null,"x",{"$f":"Control!$H$24","v":0},"=",{"$f":"D197*F197","v":0},"=",{"$f":"H197*MethGWP*10^-6","v":0},"=",{"$f":"J197/CO2_C","v":0}]
[null,"Number of gas transmission compressor stations","-->",null,"x",{"$f":"Control!$H$22","v":0},"=",{"$f":"D198*F198","v":0},"=",{"$f":"H198*MethGWP*10^-6","v":0},"=",{"$f":"J198/CO2_C","v":0}]
[null,"Number of gas storage compressor stations","-->",null,"x",{"$f":"Control!$H$23","v":0},"=",{"$f":"D199*F199","v":0},"=",{"$f":"H199*MethGWP*10^-6","v":0},"=",{"$f":"J199/CO2_C","v":0}]
[null,"Total  ",null,null,null,null,null,{"$f":"SUM(H193:H199)","v":0},"=",{"$f":"H200*MethGWP*10^-6","v":0},"=",{"$f":"J200/CO2_C","v":0}]
[]
[null,"Natural Gas - Transmission",{"$f":"C189+1","v":2005}]
[]
[null,null,null,"Activity Data",null,"Emission Factor",null,"Metric Tons CH4",null,"MMTCO2E",null,"MMTCE"]
[null,null,null,null,null,"metric tons CH4 per year per activity unit"]
[null,"Miles of gathering pipeline ","-->",null,"x",{"$f":"Control!$H$20","v":0},"=",{"$f":"D206*F206","v":0},"=",{"$f":"H206*MethGWP*10^-6","v":0},"=",{"$f":"J206/CO2_C","v":0}]
[null,"Number of gas processing plants","-->",null,"x",{"$f":"Control!$H$21","v":0},"=",{"$f":"D207*F207","v":0},"=",{"$f":"H207*MethGWP*10^-6","v":0},"=",{"$f":"J207/CO2_C","v":0}]
[null,"Number of LNG storage compressor stations","-->",null,"x",{"$f":"Control!$H$25","v":0},"=",{"$f":"D208*F208","v":0},"=",{"$f":"H208*MethGWP*10^-6","v":0},"=",{"$f":"J208/CO2_C","v":0}]
[]
[null,"Miles of transmission pipeline","-->",null,"x",{"$f":"Control!$H$24","v":0},"=",{"$f":"D210*F210","v":0},"=",{"$f":"H210*MethGWP*10^-6","v":0},"=",{"$f":"J210/CO2_C","v":0}]
[null,"Number of gas transmission compressor stations","-->",null,"x",{"$f":"Control!$H$22","v":0},"=",{"$f":"D211*F211","v":0},"=",{"$f":"H211*MethGWP*10^-6","v":0},"=",{"$f":"J211/CO2_C","v":0}]
[null,"Number of gas storage compressor stations","-->",null,"x",{"$f":"Control!$H$23","v":0},"=",{"$f":"D212*F212","v":0},"=",{"$f":"H212*MethGWP*10^-6","v":0},"=",{"$f":"J212/CO2_C","v":0}]
[null,"Total  ",null,null,null,null,null,{"$f":"SUM(H206:H212)","v":0},"=",{"$f":"H213*MethGWP*10^-6","v":0},"=",{"$f":"J213/CO2_C","v":0}]
[]
[null,"Natural Gas - Transmission",{"$f":"C202+1","v":2006}]
[]
[null,null,null,"Activity Data",null,"Emission Factor",null,"Metric Tons CH4",null,"MMTCO2E",null,"MMTCE"]
[null,null,null,null,null,"metric tons CH4 per year per activity unit"]
[null,"Miles of gathering pipeline ","-->",null,"x",{"$f":"Control!$H$20","v":0},"=",{"$f":"D219*F219","v":0},"=",{"$f":"H219*MethGWP*10^-6","v":0},"=",{"$f":"J219/CO2_C","v":0}]
[null,"Number of gas processing plants","-->",null,"x",{"$f":"Control!$H$21","v":0},"=",{"$f":"D220*F220","v":0},"=",{"$f":"H220*MethGWP*10^-6","v":0},"=",{"$f":"J220/CO2_C","v":0}]
[null,"Number of LNG storage compressor stations","-->",null,"x",{"$f":"Control!$H$25","v":0},"=",{"$f":"D221*F221","v":0},"=",{"$f":"H221*MethGWP*10^-6","v":0},"=",{"$f":"J221/CO2_C","v":0}]
[]
[null,"Miles of transmission pipeline","-->",null,"x",{"$f":"Control!$H$24","v":0},"=",{"$f":"D223*F223","v":0},"=",{"$f":"H223*MethGWP*10^-6","v":0},"=",{"$f":"J223/CO2_C","v":0}]
[null,"Number of gas transmission compressor stations","-->",null,"x",{"$f":"Control!$H$22","v":0},"=",{"$f":"D224*F224","v":0},"=",{"$f":"H224*MethGWP*10^-6","v":0},"=",{"$f":"J224/CO2_C","v":0}]
[null,"Number of gas storage compressor stations","-->",null,"x",{"$f":"Control!$H$23","v":0},"=",{"$f":"D225*F225","v":0},"=",{"$f":"H225*MethGWP*10^-6","v":0},"=",{"$f":"J225/CO2_C","v":0}]
[null,"Total  ",null,null,null,null,null,{"$f":"SUM(H219:H225)","v":0},"=",{"$f":"H226*MethGWP*10^-6","v":0},"=",{"$f":"J226/CO2_C","v":0}]
[]
[null,"Natural Gas - Transmission",{"$f":"C215+1","v":2007}]
[]
[null,null,null,"Activity Data",null,"Emission Factor",null,"Metric Tons CH4",null,"MMTCO2E",null,"MMTCE"]
[null,null,null,null,null,"metric tons CH4 per year per activity unit"]
[null,"Miles of gathering pipeline ","-->",null,"x",{"$f":"Control!$H$20","v":0},"=",{"$f":"D232*F232","v":0},"=",{"$f":"H232*MethGWP*10^-6","v":0},"=",{"$f":"J232/CO2_C","v":0}]
[null,"Number of gas processing plants","-->",null,"x",{"$f":"Control!$H$21","v":0},"=",{"$f":"D233*F233","v":0},"=",{"$f":"H233*MethGWP*10^-6","v":0},"=",{"$f":"J233/CO2_C","v":0}]
[null,"Number of LNG storage compressor stations","-->",null,"x",{"$f":"Control!$H$25","v":0},"=",{"$f":"D234*F234","v":0},"=",{"$f":"H234*MethGWP*10^-6","v":0},"=",{"$f":"J234/CO2_C","v":0}]
[]
[null,"Miles of transmission pipeline","-->",null,"x",{"$f":"Control!$H$24","v":0},"=",{"$f":"D236*F236","v":0},"=",{"$f":"H236*MethGWP*10^-6","v":0},"=",{"$f":"J236/CO2_C","v":0}]
[null,"Number of gas transmission compressor stations","-->",null,"x",{"$f":"Control!$H$22","v":0},"=",{"$f":"D237*F237","v":0},"=",{"$f":"H237*MethGWP*10^-6","v":0},"=",{"$f":"J237/CO2_C","v":0}]
[null,"Number of gas storage compressor stations","-->",null,"x",{"$f":"Control!$H$23","v":0},"=",{"$f":"D238*F238","v":0},"=",{"$f":"H238*MethGWP*10^-6","v":0},"=",{"$f":"J238/CO2_C","v":0}]
[null,"Total  ",null,null,null,null,null,{"$f":"SUM(H232:H238)","v":0},"=",{"$f":"H239*MethGWP*10^-6","v":0},"=",{"$f":"J239/CO2_C","v":0}]
[]
[null,"Natural Gas - Transmission",{"$f":"C228+1","v":2008}]
[]
[null,null,null,"Activity Data",null,"Emission Factor",null,"Metric Tons CH4",null,"MMTCO2E",null,"MMTCE"]
[null,null,null,null,null,"metric tons CH4 per year per activity unit"]
[null,"Miles of gathering pipeline ","-->",null,"x",{"$f":"Control!$H$20","v":0},"=",{"$f":"D245*F245","v":0},"=",{"$f":"H245*MethGWP*10^-6","v":0},"=",{"$f":"J245/CO2_C","v":0}]
[null,"Number of gas processing plants","-->",null,"x",{"$f":"Control!$H$21","v":0},"=",{"$f":"D246*F246","v":0},"=",{"$f":"H246*MethGWP*10^-6","v":0},"=",{"$f":"J246/CO2_C","v":0}]
[null,"Number of LNG storage compressor stations","-->",null,"x",{"$f":"Control!$H$25","v":0},"=",{"$f":"D247*F247","v":0},"=",{"$f":"H247*MethGWP*10^-6","v":0},"=",{"$f":"J247/CO2_C","v":0}]
[]
[null,"Miles of transmission pipeline","-->",null,"x",{"$f":"Control!$H$24","v":0},"=",{"$f":"D249*F249","v":0},"=",{"$f":"H249*MethGWP*10^-6","v":0},"=",{"$f":"J249/CO2_C","v":0}]
[null,"Number of gas transmission compressor stations","-->",null,"x",{"$f":"Control!$H$22","v":0},"=",{"$f":"D250*F250","v":0},"=",{"$f":"H250*MethGWP*10^-6","v":0},"=",{"$f":"J250/CO2_C","v":0}]
[null,"Number of gas storage compressor stations","-->",null,"x",{"$f":"Control!$H$23","v":0},"=",{"$f":"D251*F251","v":0},"=",{"$f":"H251*MethGWP*10^-6","v":0},"=",{"$f":"J251/CO2_C","v":0}]
[null,"Total  ",null,null,null,null,null,{"$f":"SUM(H245:H251)","v":0},"=",{"$f":"H252*MethGWP*10^-6","v":0},"=",{"$f":"J252/CO2_C","v":0}]
[]
[null,"Natural Gas - Transmission",{"$f":"C241+1","v":2009}]
[]
[null,null,null,"Activity Data",null,"Emission Factor",null,"Metric Tons CH4",null,"MMTCO2E",null,"MMTCE"]
[null,null,null,null,null,"metric tons CH4 per year per activity unit"]
[null,"Miles of gathering pipeline ","-->",null,"x",{"$f":"Control!$H$20","v":0},"=",{"$f":"D258*F258","v":0},"=",{"$f":"H258*MethGWP*10^-6","v":0},"=",{"$f":"J258/CO2_C","v":0}]
[null,"Number of gas processing plants","-->",null,"x",{"$f":"Control!$H$21","v":0},"=",{"$f":"D259*F259","v":0},"=",{"$f":"H259*MethGWP*10^-6","v":0},"=",{"$f":"J259/CO2_C","v":0}]
[null,"Number of LNG storage compressor stations","-->",null,"x",{"$f":"Control!$H$25","v":0},"=",{"$f":"D260*F260","v":0},"=",{"$f":"H260*MethGWP*10^-6","v":0},"=",{"$f":"J260/CO2_C","v":0}]
[]
[null,"Miles of transmission pipeline","-->",null,"x",{"$f":"Control!$H$24","v":0},"=",{"$f":"D262*F262","v":0},"=",{"$f":"H262*MethGWP*10^-6","v":0},"=",{"$f":"J262/CO2_C","v":0}]
[null,"Number of gas transmission compressor stations","-->",null,"x",{"$f":"Control!$H$22","v":0},"=",{"$f":"D263*F263","v":0},"=",{"$f":"H263*MethGWP*10^-6","v":0},"=",{"$f":"J263/CO2_C","v":0}]
[null,"Number of gas storage compressor stations","-->",null,"x",{"$f":"Control!$H$23","v":0},"=",{"$f":"D264*F264","v":0},"=",{"$f":"H264*MethGWP*10^-6","v":0},"=",{"$f":"J264/CO2_C","v":0}]
[null,"Total  ",null,null,null,null,null,{"$f":"SUM(H258:H264)","v":0},"=",{"$f":"H265*MethGWP*10^-6","v":0},"=",{"$f":"J265/CO2_C","v":0}]
[]
[null,"Natural Gas - Transmission",{"$f":"C254+1","v":2010}]
[]
[null,null,null,"Activity Data",null,"Emission Factor",null,"Metric Tons CH4",null,"MMTCO2E",null,"MMTCE"]
[null,null,null,null,null,"metric tons CH4 per year per activity unit"]
[null,"Miles of gathering pipeline ","-->",null,"x",{"$f":"Control!$H$20","v":0},"=",{"$f":"D271*F271","v":0},"=",{"$f":"H271*MethGWP*10^-6","v":0},"=",{"$f":"J271/CO2_C","v":0}]
[null,"Number of gas processing plants","-->",null,"x",{"$f":"Control!$H$21","v":0},"=",{"$f":"D272*F272","v":0},"=",{"$f":"H272*MethGWP*10^-6","v":0},"=",{"$f":"J272/CO2_C","v":0}]
[null,"Number of LNG storage compressor stations","-->",null,"x",{"$f":"Control!$H$25","v":0},"=",{"$f":"D273*F273","v":0},"=",{"$f":"H273*MethGWP*10^-6","v":0},"=",{"$f":"J273/CO2_C","v":0}]
[]
[null,"Miles of transmission pipeline","-->",null,"x",{"$f":"Control!$H$24","v":0},"=",{"$f":"D275*F275","v":0},"=",{"$f":"H275*MethGWP*10^-6","v":0},"=",{"$f":"J275/CO2_C","v":0}]
[null,"Number of gas transmission compressor stations","-->",null,"x",{"$f":"Control!$H$22","v":0},"=",{"$f":"D276*F276","v":0},"=",{"$f":"H276*MethGWP*10^-6","v":0},"=",{"$f":"J276/CO2_C","v":0}]
[null,"Number of gas storage compressor stations","-->",null,"x",{"$f":"Control!$H$23","v":0},"=",{"$f":"D277*F277","v":0},"=",{"$f":"H277*MethGWP*10^-6","v":0},"=",{"$f":"J277/CO2_C","v":0}]
[null,"Total  ",null,null,null,null,null,{"$f":"SUM(H271:H277)","v":0},"=",{"$f":"H278*MethGWP*10^-6","v":0},"=",{"$f":"J278/CO2_C","v":0}]
[]
[null,"Natural Gas - Transmission",{"$f":"C267+1","v":2011}]
[]
[null,null,null,"Activity Data",null,"Emission Factor",null,"Metric Tons CH4",null,"MMTCO2E",null,"MMTCE"]
[null,null,null,null,null,"metric tons CH4 per year per activity unit"]
[null,"Miles of gathering pipeline ","-->",null,"x",{"$f":"Control!$H$20","v":0},"=",{"$f":"D284*F284","v":0},"=",{"$f":"H284*MethGWP*10^-6","v":0},"=",{"$f":"J284/CO2_C","v":0}]
[null,"Number of gas processing plants","-->",null,"x",{"$f":"Control!$H$21","v":0},"=",{"$f":"D285*F285","v":0},"=",{"$f":"H285*MethGWP*10^-6","v":0},"=",{"$f":"J285/CO2_C","v":0}]
[null,"Number of LNG storage compressor stations","-->",null,"x",{"$f":"Control!$H$25","v":0},"=",{"$f":"D286*F286","v":0},"=",{"$f":"H286*MethGWP*10^-6","v":0},"=",{"$f":"J286/CO2_C","v":0}]
[]
[null,"Miles of transmission pipeline","-->",null,"x",{"$f":"Control!$H$24","v":0},"=",{"$f":"D288*F288","v":0},"=",{"$f":"H288*MethGWP*10^-6","v":0},"=",{"$f":"J288/CO2_C","v":0}]
[null,"Number of gas transmission compressor stations","-->",null,"x",{"$f":"Control!$H$22","v":0},"=",{"$f":"D289*F289","v":0},"=",{"$f":"H289*MethGWP*10^-6","v":0},"=",{"$f":"J289/CO2_C","v":0}]
[null,"Number of gas storage compressor stations","-->",null,"x",{"$f":"Control!$H$23","v":0},"=",{"$f":"D290*F290","v":0},"=",{"$f":"H290*MethGWP*10^-6","v":0},"=",{"$f":"J290/CO2_C","v":0}]
[null,"Total  ",null,null,null,null,null,{"$f":"SUM(H284:H290)","v":0},"=",{"$f":"H291*MethGWP*10^-6","v":0},"=",{"$f":"J291/CO2_C","v":0}]
[]
[null,"Natural Gas - Transmission",{"$f":"C280+1","v":2012}]
[]
[null,null,null,"Activity Data",null,"Emission Factor",null,"Metric Tons CH4",null,"MMTCO2E",null,"MMTCE"]
[null,null,null,null,null,"metric tons CH4 per year per activity unit"]
[null,"Miles of gathering pipeline ","-->",null,"x",{"$f":"Control!$H$20","v":0},"=",{"$f":"D297*F297","v":0},"=",{"$f":"H297*MethGWP*10^-6","v":0},"=",{"$f":"J297/CO2_C","v":0}]
[null,"Number of gas processing plants","-->",null,"x",{"$f":"Control!$H$21","v":0},"=",{"$f":"D298*F298","v":0},"=",{"$f":"H298*MethGWP*10^-6","v":0},"=",{"$f":"J298/CO2_C","v":0}]
[null,"Number of LNG storage compressor stations","-->",null,"x",{"$f":"Control!$H$25","v":0},"=",{"$f":"D299*F299","v":0},"=",{"$f":"H299*MethGWP*10^-6","v":0},"=",{"$f":"J299/CO2_C","v":0}]
[]
[null,"Miles of transmission pipeline","-->",null,"x",{"$f":"Control!$H$24","v":0},"=",{"$f":"D301*F301","v":0},"=",{"$f":"H301*MethGWP*10^-6","v":0},"=",{"$f":"J301/CO2_C","v":0}]
[null,"Number of gas transmission compressor stations","-->",null,"x",{"$f":"Control!$H$22","v":0},"=",{"$f":"D302*F302","v":0},"=",{"$f":"H302*MethGWP*10^-6","v":0},"=",{"$f":"J302/CO2_C","v":0}]
[null,"Number of gas storage compressor stations","-->",null,"x",{"$f":"Control!$H$23","v":0},"=",{"$f":"D303*F303","v":0},"=",{"$f":"H303*MethGWP*10^-6","v":0},"=",{"$f":"J303/CO2_C","v":0}]
[null,"Total  ",null,null,null,null,null,{"$f":"SUM(H297:H303)","v":0},"=",{"$f":"H304*MethGWP*10^-6","v":0},"=",{"$f":"J304/CO2_C","v":0}]
[]
[null,"Natural Gas - Transmission",{"$f":"C293+1","v":2013}]
[]
[null,null,null,"Activity Data",null,"Emission Factor",null,"Metric Tons CH4",null,"MMTCO2E",null,"MMTCE"]
[null,null,null,null,null,"metric tons CH4 per year per activity unit"]
[null,"Miles of gathering pipeline ","-->",null,"x",{"$f":"Control!$H$20","v":0},"=",{"$f":"D310*F310","v":0},"=",{"$f":"H310*MethGWP*10^-6","v":0},"=",{"$f":"J310/CO2_C","v":0}]
[null,"Number of gas processing plants","-->",null,"x",{"$f":"Control!$H$21","v":0},"=",{"$f":"D311*F311","v":0},"=",{"$f":"H311*MethGWP*10^-6","v":0},"=",{"$f":"J311/CO2_C","v":0}]
[null,"Number of LNG storage compressor stations","-->",null,"x",{"$f":"Control!$H$25","v":0},"=",{"$f":"D312*F312","v":0},"=",{"$f":"H312*MethGWP*10^-6","v":0},"=",{"$f":"J312/CO2_C","v":0}]
[]
[null,"Miles of transmission pipeline","-->",null,"x",{"$f":"Control!$H$24","v":0},"=",{"$f":"D314*F314","v":0},"=",{"$f":"H314*MethGWP*10^-6","v":0},"=",{"$f":"J314/CO2_C","v":0}]
[null,"Number of gas transmission compressor stations","-->",null,"x",{"$f":"Control!$H$22","v":0},"=",{"$f":"D315*F315","v":0},"=",{"$f":"H315*MethGWP*10^-6","v":0},"=",{"$f":"J315/CO2_C","v":0}]
[null,"Number of gas storage compressor stations","-->",null,"x",{"$f":"Control!$H$23","v":0},"=",{"$f":"D316*F316","v":0},"=",{"$f":"H316*MethGWP*10^-6","v":0},"=",{"$f":"J316/CO2_C","v":0}]
[null,"Total  ",null,null,null,null,null,{"$f":"SUM(H310:H316)","v":0},"=",{"$f":"H317*MethGWP*10^-6","v":0},"=",{"$f":"J317/CO2_C","v":0}]
[]
[null,"Natural Gas - Transmission",{"$f":"C306+1","v":2014}]
[]
[null,null,null,"Activity Data",null,"Emission Factor",null,"Metric Tons CH4",null,"MMTCO2E",null,"MMTCE"]
[null,null,null,null,null,"metric tons CH4 per year per activity unit"]
[null,"Miles of gathering pipeline ","-->",null,"x",{"$f":"Control!$H$20","v":0},"=",{"$f":"D323*F323","v":0},"=",{"$f":"H323*MethGWP*10^-6","v":0},"=",{"$f":"J323/CO2_C","v":0}]
[null,"Number of gas processing plants","-->",null,"x",{"$f":"Control!$H$21","v":0},"=",{"$f":"D324*F324","v":0},"=",{"$f":"H324*MethGWP*10^-6","v":0},"=",{"$f":"J324/CO2_C","v":0}]
[null,"Number of LNG storage compressor stations","-->",null,"x",{"$f":"Control!$H$25","v":0},"=",{"$f":"D325*F325","v":0},"=",{"$f":"H325*MethGWP*10^-6","v":0},"=",{"$f":"J325/CO2_C","v":0}]
[]
[null,"Miles of transmission pipeline","-->",null,"x",{"$f":"Control!$H$24","v":0},"=",{"$f":"D327*F327","v":0},"=",{"$f":"H327*MethGWP*10^-6","v":0},"=",{"$f":"J327/CO2_C","v":0}]
[null,"Number of gas transmission compressor stations","-->",null,"x",{"$f":"Control!$H$22","v":0},"=",{"$f":"D328*F328","v":0},"=",{"$f":"H328*MethGWP*10^-6","v":0},"=",{"$f":"J328/CO2_C","v":0}]
[null,"Number of gas storage compressor stations","-->",null,"x",{"$f":"Control!$H$23","v":0},"=",{"$f":"D329*F329","v":0},"=",{"$f":"H329*MethGWP*10^-6","v":0},"=",{"$f":"J329/CO2_C","v":0}]
[null,"Total  ",null,null,null,null,null,{"$f":"SUM(H323:H329)","v":0},"=",{"$f":"H330*MethGWP*10^-6","v":0},"=",{"$f":"J330/CO2_C","v":0}]
[]
[null,"Natural Gas - Transmission",{"$f":"C319+1","v":2015}]
[]
[null,null,null,"Activity Data",null,"Emission Factor",null,"Metric Tons CH4",null,"MMTCO2E",null,"MMTCE"]
[null,null,null,null,null,"metric tons CH4 per year per activity unit"]
[null,"Miles of gathering pipeline ","-->",null,"x",{"$f":"Control!$H$20","v":0},"=",{"$f":"D336*F336","v":0},"=",{"$f":"H336*MethGWP*10^-6","v":0},"=",{"$f":"J336/CO2_C","v":0}]
[null,"Number of gas processing plants","-->",null,"x",{"$f":"Control!$H$21","v":0},"=",{"$f":"D337*F337","v":0},"=",{"$f":"H337*MethGWP*10^-6","v":0},"=",{"$f":"J337/CO2_C","v":0}]
[null,"Number of LNG storage compressor stations","-->",null,"x",{"$f":"Control!$H$25","v":0},"=",{"$f":"D338*F338","v":0},"=",{"$f":"H338*MethGWP*10^-6","v":0},"=",{"$f":"J338/CO2_C","v":0}]
[]
[null,"Miles of transmission pipeline","-->",null,"x",{"$f":"Control!$H$24","v":0},"=",{"$f":"D340*F340","v":0},"=",{"$f":"H340*MethGWP*10^-6","v":0},"=",{"$f":"J340/CO2_C","v":0}]
[null,"Number of gas transmission compressor stations","-->",null,"x",{"$f":"Control!$H$22","v":0},"=",{"$f":"D341*F341","v":0},"=",{"$f":"H341*MethGWP*10^-6","v":0},"=",{"$f":"J341/CO2_C","v":0}]
[null,"Number of gas storage compressor stations","-->",null,"x",{"$f":"Control!$H$23","v":0},"=",{"$f":"D342*F342","v":0},"=",{"$f":"H342*MethGWP*10^-6","v":0},"=",{"$f":"J342/CO2_C","v":0}]
[null,"Total  ",null,null,null,null,null,{"$f":"SUM(H336:H342)","v":0},"=",{"$f":"H343*MethGWP*10^-6","v":0},"=",{"$f":"J343/CO2_C","v":0}]
[]
[null,"Natural Gas - Transmission",{"$f":"C332+1","v":2016}]
[]
[null,null,null,"Activity Data",null,"Emission Factor",null,"Metric Tons CH4",null,"MMTCO2E",null,"MMTCE"]
[null,null,null,null,null,"metric tons CH4 per year per activity unit"]
[null,"Miles of gathering pipeline ","-->",null,"x",{"$f":"Control!$H$20","v":0},"=",{"$f":"D349*F349","v":0},"=",{"$f":"H349*MethGWP*10^-6","v":0},"=",{"$f":"J349/CO2_C","v":0}]
[null,"Number of gas processing plants","-->",null,"x",{"$f":"Control!$H$21","v":0},"=",{"$f":"D350*F350","v":0},"=",{"$f":"H350*MethGWP*10^-6","v":0},"=",{"$f":"J350/CO2_C","v":0}]
[null,"Number of LNG storage compressor stations","-->",null,"x",{"$f":"Control!$H$25","v":0},"=",{"$f":"D351*F351","v":0},"=",{"$f":"H351*MethGWP*10^-6","v":0},"=",{"$f":"J351/CO2_C","v":0}]
[]
[null,"Miles of transmission pipeline","-->",null,"x",{"$f":"Control!$H$24","v":0},"=",{"$f":"D353*F353","v":0},"=",{"$f":"H353*MethGWP*10^-6","v":0},"=",{"$f":"J353/CO2_C","v":0}]
[null,"Number of gas transmission compressor stations","-->",null,"x",{"$f":"Control!$H$22","v":0},"=",{"$f":"D354*F354","v":0},"=",{"$f":"H354*MethGWP*10^-6","v":0},"=",{"$f":"J354/CO2_C","v":0}]
[null,"Number of gas storage compressor stations","-->",null,"x",{"$f":"Control!$H$23","v":0},"=",{"$f":"D355*F355","v":0},"=",{"$f":"H355*MethGWP*10^-6","v":0},"=",{"$f":"J355/CO2_C","v":0}]
[null,"Total  ",null,null,null,null,null,{"$f":"SUM(H349:H355)","v":0},"=",{"$f":"H356*MethGWP*10^-6","v":0},"=",{"$f":"J356/CO2_C","v":0}]
[]
[null,"Natural Gas - Transmission",{"$f":"C345+1","v":2017}]
[]
[null,null,null,"Activity Data",null,"Emission Factor",null,"Metric Tons CH4",null,"MMTCO2E",null,"MMTCE"]
[null,null,null,null,null,"metric tons CH4 per year per activity unit"]
[null,"Miles of gathering pipeline ","-->",null,"x",{"$f":"Control!$H$20","v":0},"=",{"$f":"D362*F362","v":0},"=",{"$f":"H362*MethGWP*10^-6","v":0},"=",{"$f":"J362/CO2_C","v":0}]
[null,"Number of gas processing plants","-->",null,"x",{"$f":"Control!$H$21","v":0},"=",{"$f":"D363*F363","v":0},"=",{"$f":"H363*MethGWP*10^-6","v":0},"=",{"$f":"J363/CO2_C","v":0}]
[null,"Number of LNG storage compressor stations","-->",null,"x",{"$f":"Control!$H$25","v":0},"=",{"$f":"D364*F364","v":0},"=",{"$f":"H364*MethGWP*10^-6","v":0},"=",{"$f":"J364/CO2_C","v":0}]
[]
[null,"Miles of transmission pipeline","-->",null,"x",{"$f":"Control!$H$24","v":0},"=",{"$f":"D366*F366","v":0},"=",{"$f":"H366*MethGWP*10^-6","v":0},"=",{"$f":"J366/CO2_C","v":0}]
[null,"Number of gas transmission compressor stations","-->",null,"x",{"$f":"Control!$H$22","v":0},"=",{"$f":"D367*F367","v":0},"=",{"$f":"H367*MethGWP*10^-6","v":0},"=",{"$f":"J367/CO2_C","v":0}]
[null,"Number of gas storage compressor stations","-->",null,"x",{"$f":"Control!$H$23","v":0},"=",{"$f":"D368*F368","v":0},"=",{"$f":"H368*MethGWP*10^-6","v":0},"=",{"$f":"J368/CO2_C","v":0}]
[null,"Total  ",null,null,null,null,null,{"$f":"SUM(H362:H368)","v":0},"=",{"$f":"H369*MethGWP*10^-6","v":0},"=",{"$f":"J369/CO2_C","v":0}]
[]
[null,"Natural Gas - Transmission",{"$f":"C358+1","v":2018}]
[]
[null,null,null,"Activity Data",null,"Emission Factor",null,"Metric Tons CH4",null,"MMTCO2E",null,"MMTCE"]
[null,null,null,null,null,"metric tons CH4 per year per activity unit"]
[null,"Miles of gathering pipeline ","-->",null,"x",{"$f":"Control!$H$20","v":0},"=",{"$f":"D375*F375","v":0},"=",{"$f":"H375*MethGWP*10^-6","v":0},"=",{"$f":"J375/CO2_C","v":0}]
[null,"Number of gas processing plants","-->",null,"x",{"$f":"Control!$H$21","v":0},"=",{"$f":"D376*F376","v":0},"=",{"$f":"H376*MethGWP*10^-6","v":0},"=",{"$f":"J376/CO2_C","v":0}]
[null,"Number of LNG storage compressor stations","-->",null,"x",{"$f":"Control!$H$25","v":0},"=",{"$f":"D377*F377","v":0},"=",{"$f":"H377*MethGWP*10^-6","v":0},"=",{"$f":"J377/CO2_C","v":0}]
[]
[null,"Miles of transmission pipeline","-->",null,"x",{"$f":"Control!$H$24","v":0},"=",{"$f":"D379*F379","v":0},"=",{"$f":"H379*MethGWP*10^-6","v":0},"=",{"$f":"J379/CO2_C","v":0}]
[null,"Number of gas transmission compressor stations","-->",null,"x",{"$f":"Control!$H$22","v":0},"=",{"$f":"D380*F380","v":0},"=",{"$f":"H380*MethGWP*10^-6","v":0},"=",{"$f":"J380/CO2_C","v":0}]
[null,"Number of gas storage compressor stations","-->",null,"x",{"$f":"Control!$H$23","v":0},"=",{"$f":"D381*F381","v":0},"=",{"$f":"H381*MethGWP*10^-6","v":0},"=",{"$f":"J381/CO2_C","v":0}]
[null,"Total  ",null,null,null,null,null,{"$f":"SUM(H375:H381)","v":0},"=",{"$f":"H382*MethGWP*10^-6","v":0},"=",{"$f":"J382/CO2_C","v":0}]
[]
[null,"Natural Gas - Transmission",{"$f":"C371+1","v":2019}]
[]
[null,null,null,"Activity Data",null,"Emission Factor",null,"Metric Tons CH4",null,"MMTCO2E",null,"MMTCE"]
[null,null,null,null,null,"metric tons CH4 per year per activity unit"]
[null,"Miles of gathering pipeline ","-->",null,"x",{"$f":"Control!$H$20","v":0},"=",{"$f":"D388*F388","v":0},"=",{"$f":"H388*MethGWP*10^-6","v":0},"=",{"$f":"J388/CO2_C","v":0}]
[null,"Number of gas processing plants","-->",null,"x",{"$f":"Control!$H$21","v":0},"=",{"$f":"D389*F389","v":0},"=",{"$f":"H389*MethGWP*10^-6","v":0},"=",{"$f":"J389/CO2_C","v":0}]
[null,"Number of LNG storage compressor stations","-->",null,"x",{"$f":"Control!$H$25","v":0},"=",{"$f":"D390*F390","v":0},"=",{"$f":"H390*MethGWP*10^-6","v":0},"=",{"$f":"J390/CO2_C","v":0}]
[]
[null,"Miles of transmission pipeline","-->",null,"x",{"$f":"Control!$H$24","v":0},"=",{"$f":"D392*F392","v":0},"=",{"$f":"H392*MethGWP*10^-6","v":0},"=",{"$f":"J392/CO2_C","v":0}]
[null,"Number of gas transmission compressor stations","-->",null,"x",{"$f":"Control!$H$22","v":0},"=",{"$f":"D393*F393","v":0},"=",{"$f":"H393*MethGWP*10^-6","v":0},"=",{"$f":"J393/CO2_C","v":0}]
[null,"Number of gas storage compressor stations","-->",null,"x",{"$f":"Control!$H$23","v":0},"=",{"$f":"D394*F394","v":0},"=",{"$f":"H394*MethGWP*10^-6","v":0},"=",{"$f":"J394/CO2_C","v":0}]
[null,"Total  ",null,null,null,null,null,{"$f":"SUM(H388:H394)","v":0},"=",{"$f":"H395*MethGWP*10^-6","v":0},"=",{"$f":"J395/CO2_C","v":0}]
[]
[null,"Natural Gas - Transmission",{"$f":"C384+1","v":2020}]
[]
[null,null,null,"Activity Data",null,"Emission Factor",null,"Metric Tons CH4",null,"MMTCO2E",null,"MMTCE"]
[null,null,null,null,null,"metric tons CH4 per year per activity unit"]
[null,"Miles of gathering pipeline ","-->",null,"x",{"$f":"Control!$H$20","v":0},"=",{"$f":"D401*F401","v":0},"=",{"$f":"H401*MethGWP*10^-6","v":0},"=",{"$f":"J401/CO2_C","v":0}]
[null,"Number of gas processing plants","-->",null,"x",{"$f":"Control!$H$21","v":0},"=",{"$f":"D402*F402","v":0},"=",{"$f":"H402*MethGWP*10^-6","v":0},"=",{"$f":"J402/CO2_C","v":0}]
[null,"Number of LNG storage compressor stations","-->",null,"x",{"$f":"Control!$H$25","v":0},"=",{"$f":"D403*F403","v":0},"=",{"$f":"H403*MethGWP*10^-6","v":0},"=",{"$f":"J403/CO2_C","v":0}]
[]
[null,"Miles of transmission pipeline","-->",null,"x",{"$f":"Control!$H$24","v":0},"=",{"$f":"D405*F405","v":0},"=",{"$f":"H405*MethGWP*10^-6","v":0},"=",{"$f":"J405/CO2_C","v":0}]
[null,"Number of gas transmission compressor stations","-->",null,"x",{"$f":"Control!$H$22","v":0},"=",{"$f":"D406*F406","v":0},"=",{"$f":"H406*MethGWP*10^-6","v":0},"=",{"$f":"J406/CO2_C","v":0}]
[null,"Number of gas storage compressor stations","-->",null,"x",{"$f":"Control!$H$23","v":0},"=",{"$f":"D407*F407","v":0},"=",{"$f":"H407*MethGWP*10^-6","v":0},"=",{"$f":"J407/CO2_C","v":0}]
[null,"Total  ",null,null,null,null,null,{"$f":"SUM(H401:H407)","v":0},"=",{"$f":"H408*MethGWP*10^-6","v":0},"=",{"$f":"J408/CO2_C","v":0}]
[]
[null,"Natural Gas - Transmission",{"$f":"C397+1","v":2021}]
[]
[null,null,null,"Activity Data",null,"Emission Factor",null,"Metric Tons CH4",null,"MMTCO2E",null,"MMTCE"]
[null,null,null,null,null,"metric tons CH4 per year per activity unit"]
[null,"Miles of gathering pipeline ","-->",null,"x",{"$f":"Control!$H$20","v":0},"=",{"$f":"D414*F414","v":0},"=",{"$f":"H414*MethGWP*10^-6","v":0},"=",{"$f":"J414/CO2_C","v":0}]
[null,"Number of gas processing plants","-->",null,"x",{"$f":"Control!$H$21","v":0},"=",{"$f":"D415*F415","v":0},"=",{"$f":"H415*MethGWP*10^-6","v":0},"=",{"$f":"J415/CO2_C","v":0}]
[null,"Number of LNG storage compressor stations","-->",null,"x",{"$f":"Control!$H$25","v":0},"=",{"$f":"D416*F416","v":0},"=",{"$f":"H416*MethGWP*10^-6","v":0},"=",{"$f":"J416/CO2_C","v":0}]
[]
[null,"Miles of transmission pipeline","-->",null,"x",{"$f":"Control!$H$24","v":0},"=",{"$f":"D418*F418","v":0},"=",{"$f":"H418*MethGWP*10^-6","v":0},"=",{"$f":"J418/CO2_C","v":0}]
[null,"Number of gas transmission compressor stations","-->",null,"x",{"$f":"Control!$H$22","v":0},"=",{"$f":"D419*F419","v":0},"=",{"$f":"H419*MethGWP*10^-6","v":0},"=",{"$f":"J419/CO2_C","v":0}]
[null,"Number of gas storage compressor stations","-->",null,"x",{"$f":"Control!$H$23","v":0},"=",{"$f":"D420*F420","v":0},"=",{"$f":"H420*MethGWP*10^-6","v":0},"=",{"$f":"J420/CO2_C","v":0}]
[null,"Total  ",null,null,null,null,null,{"$f":"SUM(H414:H420)","v":0},"=",{"$f":"H421*MethGWP*10^-6","v":0},"=",{"$f":"J421/CO2_C","v":0}]
[]
[null,"Natural Gas - Transmission",{"$f":"C410+1","v":2022}]
[]
[null,null,null,"Activity Data",null,"Emission Factor",null,"Metric Tons CH4",null,"MMTCO2E",null,"MMTCE"]
[null,null,null,null,null,"metric tons CH4 per year per activity unit"]
[null,"Miles of gathering pipeline ","-->",null,"x",{"$f":"Control!$H$20","v":0},"=",{"$f":"D427*F427","v":0},"=",{"$f":"H427*MethGWP*10^-6","v":0},"=",{"$f":"J427/CO2_C","v":0}]
[null,"Number of gas processing plants","-->",null,"x",{"$f":"Control!$H$21","v":0},"=",{"$f":"D428*F428","v":0},"=",{"$f":"H428*MethGWP*10^-6","v":0},"=",{"$f":"J428/CO2_C","v":0}]
[null,"Number of LNG storage compressor stations","-->",null,"x",{"$f":"Control!$H$25","v":0},"=",{"$f":"D429*F429","v":0},"=",{"$f":"H429*MethGWP*10^-6","v":0},"=",{"$f":"J429/CO2_C","v":0}]
[]
[null,"Miles of transmission pipeline","-->",null,"x",{"$f":"Control!$H$24","v":0},"=",{"$f":"D431*F431","v":0},"=",{"$f":"H431*MethGWP*10^-6","v":0},"=",{"$f":"J431/CO2_C","v":0}]
[null,"Number of gas transmission compressor stations","-->",null,"x",{"$f":"Control!$H$22","v":0},"=",{"$f":"D432*F432","v":0},"=",{"$f":"H432*MethGWP*10^-6","v":0},"=",{"$f":"J432/CO2_C","v":0}]
[null,"Number of gas storage compressor stations","-->",null,"x",{"$f":"Control!$H$23","v":0},"=",{"$f":"D433*F433","v":0},"=",{"$f":"H433*MethGWP*10^-6","v":0},"=",{"$f":"J433/CO2_C","v":0}]
[null,"Total  ",null,null,null,null,null,{"$f":"SUM(H427:H433)","v":0},"=",{"$f":"H434*MethGWP*10^-6","v":0},"=",{"$f":"J434/CO2_C","v":0}]
[]
[null,"Natural Gas - Transmission",{"$f":"C423+1","v":2023}]
[]
[null,null,null,"Activity Data",null,"Emission Factor",null,"Metric Tons CH4",null,"MMTCO2E",null,"MMTCE"]
[null,null,null,null,null,"metric tons CH4 per year per activity unit"]
[null,"Miles of gathering pipeline ","-->",null,"x",{"$f":"Control!$H$20","v":0},"=",{"$f":"D440*F440","v":0},"=",{"$f":"H440*MethGWP*10^-6","v":0},"=",{"$f":"J440/CO2_C","v":0}]
[null,"Number of gas processing plants","-->",null,"x",{"$f":"Control!$H$21","v":0},"=",{"$f":"D441*F441","v":0},"=",{"$f":"H441*MethGWP*10^-6","v":0},"=",{"$f":"J441/CO2_C","v":0}]
[null,"Number of LNG storage compressor stations","-->",null,"x",{"$f":"Control!$H$25","v":0},"=",{"$f":"D442*F442","v":0},"=",{"$f":"H442*MethGWP*10^-6","v":0},"=",{"$f":"J442/CO2_C","v":0}]
[]
[null,"Miles of transmission pipeline","-->",null,"x",{"$f":"Control!$H$24","v":0},"=",{"$f":"D444*F444","v":0},"=",{"$f":"H444*MethGWP*10^-6","v":0},"=",{"$f":"J444/CO2_C","v":0}]
[null,"Number of gas transmission compressor stations","-->",null,"x",{"$f":"Control!$H$22","v":0},"=",{"$f":"D445*F445","v":0},"=",{"$f":"H445*MethGWP*10^-6","v":0},"=",{"$f":"J445/CO2_C","v":0}]
[null,"Number of gas storage compressor stations","-->",null,"x",{"$f":"Control!$H$23","v":0},"=",{"$f":"D446*F446","v":0},"=",{"$f":"H446*MethGWP*10^-6","v":0},"=",{"$f":"J446/CO2_C","v":0}]
[null,"Total  ",null,null,null,null,null,{"$f":"SUM(H440:H446)","v":0},"=",{"$f":"H447*MethGWP*10^-6","v":0},"=",{"$f":"J447/CO2_C","v":0}]
[]
[null,"Natural Gas - Transmission",{"$f":"C436+1","v":2024}]
[]
[null,null,null,"Activity Data",null,"Emission Factor",null,"Metric Tons CH4",null,"MMTCO2E",null,"MMTCE"]
[null,null,null,null,null,"metric tons CH4 per year per activity unit"]
[null,"Miles of gathering pipeline ","-->",null,"x",{"$f":"Control!$H$20","v":0},"=",{"$f":"D453*F453","v":0},"=",{"$f":"H453*MethGWP*10^-6","v":0},"=",{"$f":"J453/CO2_C","v":0}]
[null,"Number of gas processing plants","-->",null,"x",{"$f":"Control!$H$21","v":0},"=",{"$f":"D454*F454","v":0},"=",{"$f":"H454*MethGWP*10^-6","v":0},"=",{"$f":"J454/CO2_C","v":0}]
[null,"Number of LNG storage compressor stations","-->",null,"x",{"$f":"Control!$H$25","v":0},"=",{"$f":"D455*F455","v":0},"=",{"$f":"H455*MethGWP*10^-6","v":0},"=",{"$f":"J455/CO2_C","v":0}]
[]
[null,"Miles of transmission pipeline","-->",null,"x",{"$f":"Control!$H$24","v":0},"=",{"$f":"D457*F457","v":0},"=",{"$f":"H457*MethGWP*10^-6","v":0},"=",{"$f":"J457/CO2_C","v":0}]
[null,"Number of gas transmission compressor stations","-->",null,"x",{"$f":"Control!$H$22","v":0},"=",{"$f":"D458*F458","v":0},"=",{"$f":"H458*MethGWP*10^-6","v":0},"=",{"$f":"J458/CO2_C","v":0}]
[null,"Number of gas storage compressor stations","-->",null,"x",{"$f":"Control!$H$23","v":0},"=",{"$f":"D459*F459","v":0},"=",{"$f":"H459*MethGWP*10^-6","v":0},"=",{"$f":"J459/CO2_C","v":0}]
[null,"Total  ",null,null,null,null,null,{"$f":"SUM(H453:H459)","v":0},"=",{"$f":"H460*MethGWP*10^-6","v":0},"=",{"$f":"J460/CO2_C","v":0}]
[]
[null,"Natural Gas - Transmission",{"$f":"C449+1","v":2025}]
[]
[null,null,null,"Activity Data",null,"Emission Factor",null,"Metric Tons CH4",null,"MMTCO2E",null,"MMTCE"]
[null,null,null,null,null,"metric tons CH4 per year per activity unit"]
[null,"Miles of gathering pipeline ","-->",null,"x",{"$f":"Control!$H$20","v":0},"=",{"$f":"D466*F466","v":0},"=",{"$f":"H466*MethGWP*10^-6","v":0},"=",{"$f":"J466/CO2_C","v":0}]
[null,"Number of gas processing plants","-->",null,"x",{"$f":"Control!$H$21","v":0},"=",{"$f":"D467*F467","v":0},"=",{"$f":"H467*MethGWP*10^-6","v":0},"=",{"$f":"J467/CO2_C","v":0}]
[null,"Number of LNG storage compressor stations","-->",null,"x",{"$f":"Control!$H$25","v":0},"=",{"$f":"D468*F468","v":0},"=",{"$f":"H468*MethGWP*10^-6","v":0},"=",{"$f":"J468/CO2_C","v":0}]
[]
[null,"Miles of transmission pipeline","-->",null,"x",{"$f":"Control!$H$24","v":0},"=",{"$f":"D470*F470","v":0},"=",{"$f":"H470*MethGWP*10^-6","v":0},"=",{"$f":"J470/CO2_C","v":0}]
[null,"Number of gas transmission compressor stations","-->",null,"x",{"$f":"Control!$H$22","v":0},"=",{"$f":"D471*F471","v":0},"=",{"$f":"H471*MethGWP*10^-6","v":0},"=",{"$f":"J471/CO2_C","v":0}]
[null,"Number of gas storage compressor stations","-->",null,"x",{"$f":"Control!$H$23","v":0},"=",{"$f":"D472*F472","v":0},"=",{"$f":"H472*MethGWP*10^-6","v":0},"=",{"$f":"J472/CO2_C","v":0}]
[null,"Total  ",null,null,null,null,null,{"$f":"SUM(H466:H472)","v":0},"=",{"$f":"H473*MethGWP*10^-6","v":0},"=",{"$f":"J473/CO2_C","v":0}]

{"sheet":"Natural Gas - Distribution","index":5,"n_rows":652,"n_cols":12,"rows_kept":652,"cut":false,"hidden":false,"merged":[[4,1,4,3]]}
[null,{"$f":"\"4. Emissions from Natural Gas Distribution Activities in \"&ListData!D2","v":"4. Emissions from Natural Gas Distribution Activities in Select a State . . ."}]
[]
[]
[]
[]
[null,"Natural Gas - Distribution",null,1990]
[]
[null,null,null,"Activity Data",null,"Emission Factor",null,"Metric Tons CH4",null,"MMTCO2E",null,"MMTCE"]
[null,"Distribution pipeline",null,null,null,"metric tons CH4 per year per activity unit"]
[null,"Preferred Method"]
[null,"Miles of cast iron distribution pipeline","-->",null,"x",{"$f":"Control!$H$28","v":0},"=",{"$f":"D11*F11","v":0},"=",{"$f":"H11*MethGWP*10^-6","v":0},"=",{"$f":"J11/CO2_C","v":0}]
[null,"Miles of unprotected steel distribution pipeline","-->",null,"x",{"$f":"Control!$H$29","v":0},"=",{"$f":"D12*F12","v":0},"=",{"$f":"H12*MethGWP*10^-6","v":0},"=",{"$f":"J12/CO2_C","v":0}]
[null,"Miles of protected steel distribution pipeline","-->",null,"x",{"$f":"Control!$H$30","v":0},"=",{"$f":"D13*F13","v":0},"=",{"$f":"H13*MethGWP*10^-6","v":0},"=",{"$f":"J13/CO2_C","v":0}]
[null,"Miles of plastic distribution pipeline","-->",null,"x",{"$f":"Control!$H$31","v":0},"=",{"$f":"D14*F14","v":0},"=",{"$f":"H14*MethGWP*10^-6","v":0},"=",{"$f":"J14/CO2_C","v":0}]
[null,"Alternate Method"]
[null,"Total miles of distribution pipeline",null,null,"x",{"$f":"Control!$H$33","v":0},"=",{"$f":"D16*F16","v":0},"=",{"$f":"H16*MethGWP*10^-6","v":0},"=",{"$f":"J16/CO2_C","v":0}]
[]
[null,"Services"]
[null,"Total number of services","-->",null,"x",{"$f":"Control!$H$35","v":0},"=",{"$f":"D19*F19","v":0},"=",{"$f":"H19*MethGWP*10^-6","v":0},"=",{"$f":"J19/CO2_C","v":0}]
[null,"Number of unprotected steel services","-->",null,"x",{"$f":"Control!$H$36","v":0},"=",{"$f":"D20*F20","v":0},"=",{"$f":"H20*MethGWP*10^-6","v":0},"=",{"$f":"J20/CO2_C","v":0}]
[null,"Number of protected steel services","-->",null,"x",{"$f":"Control!$H$37","v":0},"=",{"$f":"D21*F21","v":0},"=",{"$f":"H21*MethGWP*10^-6","v":0},"=",{"$f":"J21/CO2_C","v":0}]
[null,"Total  ",null,null,null,null,null,{"$f":"SUM(H11:H21)","v":0},"=",{"$f":"H22*MethGWP*10^-6","v":0},"=",{"$f":"J22/CO2_C","v":0}]
[]
[null,"Natural Gas - Distribution",null,{"$f":"D6+1","v":1991}]
[]
[null,null,null,"Activity Data",null,"Emission Factor",null,"Metric Tons CH4",null,"MMTCO2E",null,"MMTCE"]
[null,"Distribution pipeline",null,null,null,"metric tons CH4 per year per activity unit"]
[null,"Preferred Method"]
[null,"Miles of cast iron distribution pipeline","-->",null,"x",{"$f":"Control!$H$28","v":0},"=",{"$f":"D29*F29","v":0},"=",{"$f":"H29*MethGWP*10^-6","v":0},"=",{"$f":"J29/CO2_C","v":0}]
[null,"Miles of unprotected steel distribution pipeline","-->",null,"x",{"$f":"Control!$H$29","v":0},"=",{"$f":"D30*F30","v":0},"=",{"$f":"H30*MethGWP*10^-6","v":0},"=",{"$f":"J30/CO2_C","v":0}]
[null,"Miles of protected steel distribution pipeline","-->",null,"x",{"$f":"Control!$H$30","v":0},"=",{"$f":"D31*F31","v":0},"=",{"$f":"H31*MethGWP*10^-6","v":0},"=",{"$f":"J31/CO2_C","v":0}]
[null,"Miles of plastic distribution pipeline","-->",null,"x",{"$f":"Control!$H$31","v":0},"=",{"$f":"D32*F32","v":0},"=",{"$f":"H32*MethGWP*10^-6","v":0},"=",{"$f":"J32/CO2_C","v":0}]
[null,"Alternate Method"]
[null,"Total miles of distribution pipeline",null,null,"x",{"$f":"Control!$H$33","v":0},"=",{"$f":"D34*F34","v":0},"=",{"$f":"H34*MethGWP*10^-6","v":0},"=",{"$f":"J34/CO2_C","v":0}]
[]
[null,"Services"]
[null,"Total number of services","-->",null,"x",{"$f":"Control!$H$35","v":0},"=",{"$f":"D37*F37","v":0},"=",{"$f":"H37*MethGWP*10^-6","v":0},"=",{"$f":"J37/CO2_C","v":0}]
[null,"Number of unprotected steel services","-->",null,"x",{"$f":"Control!$H$36","v":0},"=",{"$f":"D38*F38","v":0},"=",{"$f":"H38*MethGWP*10^-6","v":0},"=",{"$f":"J38/CO2_C","v":0}]
[null,"Number of protected steel services","-->",null,"x",{"$f":"Control!$H$37","v":0},"=",{"$f":"D39*F39","v":0},"=",{"$f":"H39*MethGWP*10^-6","v":0},"=",{"$f":"J39/CO2_C","v":0}]
[null,"Total  ",null,null,null,null,null,{"$f":"SUM(H29:H39)","v":0},"=",{"$f":"H40*MethGWP*10^-6","v":0},"=",{"$f":"J40/CO2_C","v":0}]
[]
[null,"Natural Gas - Distribution",null,{"$f":"D24+1","v":1992}]
[]
[null,null,null,"Activity Data",null,"Emission Factor",null,"Metric Tons CH4",null,"MMTCO2E",null,"MMTCE"]
[null,"Distribution pipeline",null,null,null,"metric tons CH4 per year per activity unit"]
[null,"Preferred Method"]
[null,"Miles of cast iron distribution pipeline","-->",null,"x",{"$f":"Control!$H$28","v":0},"=",{"$f":"D47*F47","v":0},"=",{"$f":"H47*MethGWP*10^-6","v":0},"=",{"$f":"J47/CO2_C","v":0}]
[null,"Miles of unprotected steel distribution pipeline","-->",null,"x",{"$f":"Control!$H$29","v":0},"=",{"$f":"D48*F48","v":0},"=",{"$f":"H48*MethGWP*10^-6","v":0},"=",{"$f":"J48/CO2_C","v":0}]
[null,"Miles of protected steel distribution pipeline","-->",null,"x",{"$f":"Control!$H$30","v":0},"=",{"$f":"D49*F49","v":0},"=",{"$f":"H49*MethGWP*10^-6","v":0},"=",{"$f":"J49/CO2_C","v":0}]
[null,"Miles of plastic distribution pipeline","-->",null,"x",{"$f":"Control!$H$31","v":0},"=",{"$f":"D50*F50","v":0},"=",{"$f":"H50*MethGWP*10^-6","v":0},"=",{"$f":"J50/CO2_C","v":0}]
[null,"Alternate Method"]
[null,"Total miles of distribution pipeline",null,null,"x",{"$f":"Control!$H$33","v":0},"=",{"$f":"D52*F52","v":0},"=",{"$f":"H52*MethGWP*10^-6","v":0},"=",{"$f":"J52/CO2_C","v":0}]
[]
[null,"Services"]
[null,"Total number of services","-->",null,"x",{"$f":"Control!$H$35","v":0},"=",{"$f":"D55*F55","v":0},"=",{"$f":"H55*MethGWP*10^-6","v":0},"=",{"$f":"J55/CO2_C","v":0}]
[null,"Number of unprotected steel services","-->",null,"x",{"$f":"Control!$H$36","v":0},"=",{"$f":"D56*F56","v":0},"=",{"$f":"H56*MethGWP*10^-6","v":0},"=",{"$f":"J56/CO2_C","v":0}]
[null,"Number of protected steel services","-->",null,"x",{"$f":"Control!$H$37","v":0},"=",{"$f":"D57*F57","v":0},"=",{"$f":"H57*MethGWP*10^-6","v":0},"=",{"$f":"J57/CO2_C","v":0}]
[null,"Total  ",null,null,null,null,null,{"$f":"SUM(H47:H57)","v":0},"=",{"$f":"H58*MethGWP*10^-6","v":0},"=",{"$f":"J58/CO2_C","v":0}]
[]
[null,"Natural Gas - Distribution",null,{"$f":"D42+1","v":1993}]
[]
[null,null,null,"Activity Data",null,"Emission Factor",null,"Metric Tons CH4",null,"MMTCO2E",null,"MMTCE"]
[null,"Distribution pipeline",null,null,null,"metric tons CH4 per year per activity unit"]
[null,"Preferred Method"]
[null,"Miles of cast iron distribution pipeline","-->",null,"x",{"$f":"Control!$H$28","v":0},"=",{"$f":"D65*F65","v":0},"=",{"$f":"H65*MethGWP*10^-6","v":0},"=",{"$f":"J65/CO2_C","v":0}]
[null,"Miles of unprotected steel distribution pipeline","-->",null,"x",{"$f":"Control!$H$29","v":0},"=",{"$f":"D66*F66","v":0},"=",{"$f":"H66*MethGWP*10^-6","v":0},"=",{"$f":"J66/CO2_C","v":0}]
[null,"Miles of protected steel distribution pipeline","-->",null,"x",{"$f":"Control!$H$30","v":0},"=",{"$f":"D67*F67","v":0},"=",{"$f":"H67*MethGWP*10^-6","v":0},"=",{"$f":"J67/CO2_C","v":0}]
[null,"Miles of plastic distribution pipeline","-->",null,"x",{"$f":"Control!$H$31","v":0},"=",{"$f":"D68*F68","v":0},"=",{"$f":"H68*MethGWP*10^-6","v":0},"=",{"$f":"J68/CO2_C","v":0}]
[null,"Alternate Method"]
[null,"Total miles of distribution pipeline",null,null,"x",{"$f":"Control!$H$33","v":0},"=",{"$f":"D70*F70","v":0},"=",{"$f":"H70*MethGWP*10^-6","v":0},"=",{"$f":"J70/CO2_C","v":0}]
[]
[null,"Services"]
[null,"Total number of services","-->",null,"x",{"$f":"Control!$H$35","v":0},"=",{"$f":"D73*F73","v":0},"=",{"$f":"H73*MethGWP*10^-6","v":0},"=",{"$f":"J73/CO2_C","v":0}]
[null,"Number of unprotected steel services","-->",null,"x",{"$f":"Control!$H$36","v":0},"=",{"$f":"D74*F74","v":0},"=",{"$f":"H74*MethGWP*10^-6","v":0},"=",{"$f":"J74/CO2_C","v":0}]
[null,"Number of protected steel services","-->",null,"x",{"$f":"Control!$H$37","v":0},"=",{"$f":"D75*F75","v":0},"=",{"$f":"H75*MethGWP*10^-6","v":0},"=",{"$f":"J75/CO2_C","v":0}]
[null,"Total  ",null,null,null,null,null,{"$f":"SUM(H65:H75)","v":0},"=",{"$f":"H76*MethGWP*10^-6","v":0},"=",{"$f":"J76/CO2_C","v":0}]
[]
[null,"Natural Gas - Distribution",null,{"$f":"D60+1","v":1994}]
[]
[null,null,null,"Activity Data",null,"Emission Factor",null,"Metric Tons CH4",null,"MMTCO2E",null,"MMTCE"]
[null,"Distribution pipeline",null,null,null,"metric tons CH4 per year per activity unit"]
[null,"Preferred Method"]
[null,"Miles of cast iron distribution pipeline","-->",null,"x",{"$f":"Control!$H$28","v":0},"=",{"$f":"D83*F83","v":0},"=",{"$f":"H83*MethGWP*10^-6","v":0},"=",{"$f":"J83/CO2_C","v":0}]
[null,"Miles of unprotected steel distribution pipeline","-->",null,"x",{"$f":"Control!$H$29","v":0},"=",{"$f":"D84*F84","v":0},"=",{"$f":"H84*MethGWP*10^-6","v":0},"=",{"$f":"J84/CO2_C","v":0}]
[null,"Miles of protected steel distribution pipeline","-->",null,"x",{"$f":"Control!$H$30","v":0},"=",{"$f":"D85*F85","v":0},"=",{"$f":"H85*MethGWP*10^-6","v":0},"=",{"$f":"J85/CO2_C","v":0}]
[null,"Miles of plastic distribution pipeline","-->",null,"x",{"$f":"Control!$H$31","v":0},"=",{"$f":"D86*F86","v":0},"=",{"$f":"H86*MethGWP*10^-6","v":0},"=",{"$f":"J86/CO2_C","v":0}]
[null,"Alternate Method"]
[null,"Total miles of distribution pipeline",null,null,"x",{"$f":"Control!$H$33","v":0},"=",{"$f":"D88*F88","v":0},"=",{"$f":"H88*MethGWP*10^-6","v":0},"=",{"$f":"J88/CO2_C","v":0}]
[]
[null,"Services"]
[null,"Total number of services","-->",null,"x",{"$f":"Control!$H$35","v":0},"=",{"$f":"D91*F91","v":0},"=",{"$f":"H91*MethGWP*10^-6","v":0},"=",{"$f":"J91/CO2_C","v":0}]
[null,"Number of unprotected steel services","-->",null,"x",{"$f":"Control!$H$36","v":0},"=",{"$f":"D92*F92","v":0},"=",{"$f":"H92*MethGWP*10^-6","v":0},"=",{"$f":"J92/CO2_C","v":0}]
[null,"Number of protected steel services","-->",null,"x",{"$f":"Control!$H$37","v":0},"=",{"$f":"D93*F93","v":0},"=",{"$f":"H93*MethGWP*10^-6","v":0},"=",{"$f":"J93/CO2_C","v":0}]
[null,"Total  ",null,null,null,null,null,{"$f":"SUM(H83:H93)","v":0},"=",{"$f":"H94*MethGWP*10^-6","v":0},"=",{"$f":"J94/CO2_C","v":0}]
[]
[null,"Natural Gas - Distribution",null,{"$f":"D78+1","v":1995}]
[]
[null,null,null,"Activity Data",null,"Emission Factor",null,"Metric Tons CH4",null,"MMTCO2E",null,"MMTCE"]
[null,"Distribution pipeline",null,null,null,"metric tons CH4 per year per activity unit"]
[null,"Preferred Method"]
[null,"Miles of cast iron distribution pipeline","-->",null,"x",{"$f":"Control!$H$28","v":0},"=",{"$f":"D101*F101","v":0},"=",{"$f":"H101*MethGWP*10^-6","v":0},"=",{"$f":"J101/CO2_C","v":0}]
[null,"Miles of unprotected steel distribution pipeline","-->",null,"x",{"$f":"Control!$H$29","v":0},"=",{"$f":"D102*F102","v":0},"=",{"$f":"H102*MethGWP*10^-6","v":0},"=",{"$f":"J102/CO2_C","v":0}]
[null,"Miles of protected steel distribution pipeline","-->",null,"x",{"$f":"Control!$H$30","v":0},"=",{"$f":"D103*F103","v":0},"=",{"$f":"H103*MethGWP*10^-6","v":0},"=",{"$f":"J103/CO2_C","v":0}]
[null,"Miles of plastic distribution pipeline","-->",null,"x",{"$f":"Control!$H$31","v":0},"=",{"$f":"D104*F104","v":0},"=",{"$f":"H104*MethGWP*10^-6","v":0},"=",{"$f":"J104/CO2_C","v":0}]
[null,"Alternate Method"]
[null,"Total miles of distribution pipeline",null,null,"x",{"$f":"Control!$H$33","v":0},"=",{"$f":"D106*F106","v":0},"=",{"$f":"H106*MethGWP*10^-6","v":0},"=",{"$f":"J106/CO2_C","v":0}]
[]
[null,"Services"]
[null,"Total number of services","-->",null,"x",{"$f":"Control!$H$35","v":0},"=",{"$f":"D109*F109","v":0},"=",{"$f":"H109*MethGWP*10^-6","v":0},"=",{"$f":"J109/CO2_C","v":0}]
[null,"Number of unprotected steel services","-->",null,"x",{"$f":"Control!$H$36","v":0},"=",{"$f":"D110*F110","v":0},"=",{"$f":"H110*MethGWP*10^-6","v":0},"=",{"$f":"J110/CO2_C","v":0}]
[null,"Number of protected steel services","-->",null,"x",{"$f":"Control!$H$37","v":0},"=",{"$f":"D111*F111","v":0},"=",{"$f":"H111*MethGWP*10^-6","v":0},"=",{"$f":"J111/CO2_C","v":0}]
[null,"Total  ",null,null,null,null,null,{"$f":"SUM(H101:H111)","v":0},"=",{"$f":"H112*MethGWP*10^-6","v":0},"=",{"$f":"J112/CO2_C","v":0}]
[]
[null,"Natural Gas - Distribution",null,{"$f":"D96+1","v":1996}]
[]
[null,null,null,"Activity Data",null,"Emission Factor",null,"Metric Tons CH4",null,"MMTCO2E",null,"MMTCE"]
[null,"Distribution pipeline",null,null,null,"metric tons CH4 per year per activity unit"]
[null,"Preferred Method"]
[null,"Miles of cast iron distribution pipeline","-->",null,"x",{"$f":"Control!$H$28","v":0},"=",{"$f":"D119*F119","v":0},"=",{"$f":"H119*MethGWP*10^-6","v":0},"=",{"$f":"J119/CO2_C","v":0}]
[null,"Miles of unprotected steel distribution pipeline","-->",null,"x",{"$f":"Control!$H$29","v":0},"=",{"$f":"D120*F120","v":0},"=",{"$f":"H120*MethGWP*10^-6","v":0},"=",{"$f":"J120/CO2_C","v":0}]
[null,"Miles of protected steel distribution pipeline","-->",null,"x",{"$f":"Control!$H$30","v":0},"=",{"$f":"D121*F121","v":0},"=",{"$f":"H121*MethGWP*10^-6","v":0},"=",{"$f":"J121/CO2_C","v":0}]
[null,"Miles of plastic distribution pipeline","-->",null,"x",{"$f":"Control!$H$31","v":0},"=",{"$f":"D122*F122","v":0},"=",{"$f":"H122*MethGWP*10^-6","v":0},"=",{"$f":"J122/CO2_C","v":0}]
[null,"Alternate Method"]
[null,"Total miles of distribution pipeline",null,null,"x",{"$f":"Control!$H$33","v":0},"=",{"$f":"D124*F124","v":0},"=",{"$f":"H124*MethGWP*10^-6","v":0},"=",{"$f":"J124/CO2_C","v":0}]
[]
[null,"Services"]
[null,"Total number of services","-->",null,"x",{"$f":"Control!$H$35","v":0},"=",{"$f":"D127*F127","v":0},"=",{"$f":"H127*MethGWP*10^-6","v":0},"=",{"$f":"J127/CO2_C","v":0}]
[null,"Number of unprotected steel services","-->",null,"x",{"$f":"Control!$H$36","v":0},"=",{"$f":"D128*F128","v":0},"=",{"$f":"H128*MethGWP*10^-6","v":0},"=",{"$f":"J128/CO2_C","v":0}]
[null,"Number of protected steel services","-->",null,"x",{"$f":"Control!$H$37","v":0},"=",{"$f":"D129*F129","v":0},"=",{"$f":"H129*MethGWP*10^-6","v":0},"=",{"$f":"J129/CO2_C","v":0}]
[null,"Total  ",null,null,null,null,null,{"$f":"SUM(H119:H129)","v":0},"=",{"$f":"H130*MethGWP*10^-6","v":0},"=",{"$f":"J130/CO2_C","v":0}]
[]
[null,"Natural Gas - Distribution",null,{"$f":"D114+1","v":1997}]
[]
[null,null,null,"Activity Data",null,"Emission Factor",null,"Metric Tons CH4",null,"MMTCO2E",null,"MMTCE"]
[null,"Distribution pipeline",null,null,null,"metric tons CH4 per year per activity unit"]
[null,"Preferred Method"]
[null,"Miles of cast iron distribution pipeline","-->",null,"x",{"$f":"Control!$H$28","v":0},"=",{"$f":"D137*F137","v":0},"=",{"$f":"H137*MethGWP*10^-6","v":0},"=",{"$f":"J137/CO2_C","v":0}]
[null,"Miles of unprotected steel distribution pipeline","-->",null,"x",{"$f":"Control!$H$29","v":0},"=",{"$f":"D138*F138","v":0},"=",{"$f":"H138*MethGWP*10^-6","v":0},"=",{"$f":"J138/CO2_C","v":0}]
[null,"Miles of protected steel distribution pipeline","-->",null,"x",{"$f":"Control!$H$30","v":0},"=",{"$f":"D139*F139","v":0},"=",{"$f":"H139*MethGWP*10^-6","v":0},"=",{"$f":"J139/CO2_C","v":0}]
[null,"Miles of plastic distribution pipeline","-->",null,"x",{"$f":"Control!$H$31","v":0},"=",{"$f":"D140*F140","v":0},"=",{"$f":"H140*MethGWP*10^-6","v":0},"=",{"$f":"J140/CO2_C","v":0}]
[null,"Alternate Method"]
[null,"Total miles of distribution pipeline",null,null,"x",{"$f":"Control!$H$33","v":0},"=",{"$f":"D142*F142","v":0},"=",{"$f":"H142*MethGWP*10^-6","v":0},"=",{"$f":"J142/CO2_C","v":0}]
[]
[null,"Services"]
[null,"Total number of services","-->",null,"x",{"$f":"Control!$H$35","v":0},"=",{"$f":"D145*F145","v":0},"=",{"$f":"H145*MethGWP*10^-6","v":0},"=",{"$f":"J145/CO2_C","v":0}]
[null,"Number of unprotected steel services","-->",null,"x",{"$f":"Control!$H$36","v":0},"=",{"$f":"D146*F146","v":0},"=",{"$f":"H146*MethGWP*10^-6","v":0},"=",{"$f":"J146/CO2_C","v":0}]
[null,"Number of protected steel services","-->",null,"x",{"$f":"Control!$H$37","v":0},"=",{"$f":"D147*F147","v":0},"=",{"$f":"H147*MethGWP*10^-6","v":0},"=",{"$f":"J147/CO2_C","v":0}]
[null,"Total  ",null,null,null,null,null,{"$f":"SUM(H137:H147)","v":0},"=",{"$f":"H148*MethGWP*10^-6","v":0},"=",{"$f":"J148/CO2_C","v":0}]
[]
[null,"Natural Gas - Distribution",null,{"$f":"D132+1","v":1998}]
[]
[null,null,null,"Activity Data",null,"Emission Factor",null,"Metric Tons CH4",null,"MMTCO2E",null,"MMTCE"]
[null,"Distribution pipeline",null,null,null,"metric tons CH4 per year per activity unit"]
[null,"Preferred Method"]
[null,"Miles of cast iron distribution pipeline","-->",null,"x",{"$f":"Control!$H$28","v":0},"=",{"$f":"D155*F155","v":0},"=",{"$f":"H155*MethGWP*10^-6","v":0},"=",{"$f":"J155/CO2_C","v":0}]
[null,"Miles of unprotected steel distribution pipeline","-->",null,"x",{"$f":"Control!$H$29","v":0},"=",{"$f":"D156*F156","v":0},"=",{"$f":"H156*MethGWP*10^-6","v":0},"=",{"$f":"J156/CO2_C","v":0}]
[null,"Miles of protected steel distribution pipeline","-->",null,"x",{"$f":"Control!$H$30","v":0},"=",{"$f":"D157*F157","v":0},"=",{"$f":"H157*MethGWP*10^-6","v":0},"=",{"$f":"J157/CO2_C","v":0}]
[null,"Miles of plastic distribution pipeline","-->",null,"x",{"$f":"Control!$H$31","v":0},"=",{"$f":"D158*F158","v":0},"=",{"$f":"H158*MethGWP*10^-6","v":0},"=",{"$f":"J158/CO2_C","v":0}]
[null,"Alternate Method"]
[null,"Total miles of distribution pipeline",null,null,"x",{"$f":"Control!$H$33","v":0},"=",{"$f":"D160*F160","v":0},"=",{"$f":"H160*MethGWP*10^-6","v":0},"=",{"$f":"J160/CO2_C","v":0}]
[]
[null,"Services"]
[null,"Total number of services","-->",null,"x",{"$f":"Control!$H$35","v":0},"=",{"$f":"D163*F163","v":0},"=",{"$f":"H163*MethGWP*10^-6","v":0},"=",{"$f":"J163/CO2_C","v":0}]
[null,"Number of unprotected steel services","-->",null,"x",{"$f":"Control!$H$36","v":0},"=",{"$f":"D164*F164","v":0},"=",{"$f":"H164*MethGWP*10^-6","v":0},"=",{"$f":"J164/CO2_C","v":0}]
[null,"Number of protected steel services","-->",null,"x",{"$f":"Control!$H$37","v":0},"=",{"$f":"D165*F165","v":0},"=",{"$f":"H165*MethGWP*10^-6","v":0},"=",{"$f":"J165/CO2_C","v":0}]
[null,"Total  ",null,null,null,null,null,{"$f":"SUM(H155:H165)","v":0},"=",{"$f":"H166*MethGWP*10^-6","v":0},"=",{"$f":"J166/CO2_C","v":0}]
[]
[null,"Natural Gas - Distribution",null,{"$f":"D150+1","v":1999}]
[]
[null,null,null,"Activity Data",null,"Emission Factor",null,"Metric Tons CH4",null,"MMTCO2E",null,"MMTCE"]
[null,"Distribution pipeline",null,null,null,"metric tons CH4 per year per activity unit"]
[null,"Preferred Method"]
[null,"Miles of cast iron distribution pipeline","-->",null,"x",{"$f":"Control!$H$28","v":0},"=",{"$f":"D173*F173","v":0},"=",{"$f":"H173*MethGWP*10^-6","v":0},"=",{"$f":"J173/CO2_C","v":0}]
[null,"Miles of unprotected steel distribution pipeline","-->",null,"x",{"$f":"Control!$H$29","v":0},"=",{"$f":"D174*F174","v":0},"=",{"$f":"H174*MethGWP*10^-6","v":0},"=",{"$f":"J174/CO2_C","v":0}]
[null,"Miles of protected steel distribution pipeline","-->",null,"x",{"$f":"Control!$H$30","v":0},"=",{"$f":"D175*F175","v":0},"=",{"$f":"H175*MethGWP*10^-6","v":0},"=",{"$f":"J175/CO2_C","v":0}]
[null,"Miles of plastic distribution pipeline","-->",null,"x",{"$f":"Control!$H$31","v":0},"=",{"$f":"D176*F176","v":0},"=",{"$f":"H176*MethGWP*10^-6","v":0},"=",{"$f":"J176/CO2_C","v":0}]
[null,"Alternate Method"]
[null,"Total miles of distribution pipeline",null,null,"x",{"$f":"Control!$H$33","v":0},"=",{"$f":"D178*F178","v":0},"=",{"$f":"H178*MethGWP*10^-6","v":0},"=",{"$f":"J178/CO2_C","v":0}]
[]
[null,"Services"]
[null,"Total number of services","-->",null,"x",{"$f":"Control!$H$35","v":0},"=",{"$f":"D181*F181","v":0},"=",{"$f":"H181*MethGWP*10^-6","v":0},"=",{"$f":"J181/CO2_C","v":0}]
[null,"Number of unprotected steel services","-->",null,"x",{"$f":"Control!$H$36","v":0},"=",{"$f":"D182*F182","v":0},"=",{"$f":"H182*MethGWP*10^-6","v":0},"=",{"$f":"J182/CO2_C","v":0}]
[null,"Number of protected steel services","-->",null,"x",{"$f":"Control!$H$37","v":0},"=",{"$f":"D183*F183","v":0},"=",{"$f":"H183*MethGWP*10^-6","v":0},"=",{"$f":"J183/CO2_C","v":0}]
[null,"Total  ",null,null,null,null,null,{"$f":"SUM(H173:H183)","v":0},"=",{"$f":"H184*MethGWP*10^-6","v":0},"=",{"$f":"J184/CO2_C","v":0}]
[]
[null,"Natural Gas - Distribution",null,{"$f":"D168+1","v":2000}]
[]
[null,null,null,"Activity Data",null,"Emission Factor",null,"Metric Tons CH4",null,"MMTCO2E",null,"MMTCE"]
[null,"Distribution pipeline",null,null,null,"metric tons CH4 per year per activity unit"]
[null,"Preferred Method"]
[null,"Miles of cast iron distribution pipeline","-->",null,"x",{"$f":"Control!$H$28","v":0},"=",{"$f":"D191*F191","v":0},"=",{"$f":"H191*MethGWP*10^-6","v":0},"=",{"$f":"J191/CO2_C","v":0}]
[null,"Miles of unprotected steel distribution pipeline","-->",null,"x",{"$f":"Control!$H$29","v":0},"=",{"$f":"D192*F192","v":0},"=",{"$f":"H192*MethGWP*10^-6","v":0},"=",{"$f":"J192/CO2_C","v":0}]
[null,"Miles of protected steel distribution pipeline","-->",null,"x",{"$f":"Control!$H$30","v":0},"=",{"$f":"D193*F193","v":0},"=",{"$f":"H193*MethGWP*10^-6","v":0},"=",{"$f":"J193/CO2_C","v":0}]
[null,"Miles of plastic distribution pipeline","-->",null,"x",{"$f":"Control!$H$31","v":0},"=",{"$f":"D194*F194","v":0},"=",{"$f":"H194*MethGWP*10^-6","v":0},"=",{"$f":"J194/CO2_C","v":0}]
[null,"Alternate Method"]
[null,"Total miles of distribution pipeline",null,null,"x",{"$f":"Control!$H$33","v":0},"=",{"$f":"D196*F196","v":0},"=",{"$f":"H196*MethGWP*10^-6","v":0},"=",{"$f":"J196/CO2_C","v":0}]
[]
[null,"Services"]
[null,"Total number of services","-->",null,"x",{"$f":"Control!$H$35","v":0},"=",{"$f":"D199*F199","v":0},"=",{"$f":"H199*MethGWP*10^-6","v":0},"=",{"$f":"J199/CO2_C","v":0}]
[null,"Number of unprotected steel services","-->",null,"x",{"$f":"Control!$H$36","v":0},"=",{"$f":"D200*F200","v":0},"=",{"$f":"H200*MethGWP*10^-6","v":0},"=",{"$f":"J200/CO2_C","v":0}]
[null,"Number of protected steel services","-->",null,"x",{"$f":"Control!$H$37","v":0},"=",{"$f":"D201*F201","v":0},"=",{"$f":"H201*MethGWP*10^-6","v":0},"=",{"$f":"J201/CO2_C","v":0}]
[null,"Total  ",null,null,null,null,null,{"$f":"SUM(H191:H201)","v":0},"=",{"$f":"H202*MethGWP*10^-6","v":0},"=",{"$f":"J202/CO2_C","v":0}]
[]
[null,"Natural Gas - Distribution",null,{"$f":"D186+1","v":2001}]
[]
[null,null,null,"Activity Data",null,"Emission Factor",null,"Metric Tons CH4",null,"MMTCO2E",null,"MMTCE"]
[null,"Distribution pipeline",null,null,null,"metric tons CH4 per year per activity unit"]
[null,"Preferred Method"]
[null,"Miles of cast iron distribution pipeline","-->",null,"x",{"$f":"Control!$H$28","v":0},"=",{"$f":"D209*F209","v":0},"=",{"$f":"H209*MethGWP*10^-6","v":0},"=",{"$f":"J209/CO2_C","v":0}]
[null,"Miles of unprotected steel distribution pipeline","-->",null,"x",{"$f":"Control!$H$29","v":0},"=",{"$f":"D210*F210","v":0},"=",{"$f":"H210*MethGWP*10^-6","v":0},"=",{"$f":"J210/CO2_C","v":0}]
[null,"Miles of protected steel distribution pipeline","-->",null,"x",{"$f":"Control!$H$30","v":0},"=",{"$f":"D211*F211","v":0},"=",{"$f":"H211*MethGWP*10^-6","v":0},"=",{"$f":"J211/CO2_C","v":0}]
[null,"Miles of plastic distribution pipeline","-->",null,"x",{"$f":"Control!$H$31","v":0},"=",{"$f":"D212*F212","v":0},"=",{"$f":"H212*MethGWP*10^-6","v":0},"=",{"$f":"J212/CO2_C","v":0}]
[null,"Alternate Method"]
[null,"Total miles of distribution pipeline",null,null,"x",{"$f":"Control!$H$33","v":0},"=",{"$f":"D214*F214","v":0},"=",{"$f":"H214*MethGWP*10^-6","v":0},"=",{"$f":"J214/CO2_C","v":0}]
[]
[null,"Services"]
[null,"Total number of services","-->",null,"x",{"$f":"Control!$H$35","v":0},"=",{"$f":"D217*F217","v":0},"=",{"$f":"H217*MethGWP*10^-6","v":0},"=",{"$f":"J217/CO2_C","v":0}]
[null,"Number of unprotected steel services","-->",null,"x",{"$f":"Control!$H$36","v":0},"=",{"$f":"D218*F218","v":0},"=",{"$f":"H218*MethGWP*10^-6","v":0},"=",{"$f":"J218/CO2_C","v":0}]
[null,"Number of protected steel services","-->",null,"x",{"$f":"Control!$H$37","v":0},"=",{"$f":"D219*F219","v":0},"=",{"$f":"H219*MethGWP*10^-6","v":0},"=",{"$f":"J219/CO2_C","v":0}]
[null,"Total  ",null,null,null,null,null,{"$f":"SUM(H209:H219)","v":0},"=",{"$f":"H220*MethGWP*10^-6","v":0},"=",{"$f":"J220/CO2_C","v":0}]
[]
[null,"Natural Gas - Distribution",null,{"$f":"D204+1","v":2002}]
[]
[null,null,null,"Activity Data",null,"Emission Factor",null,"Metric Tons CH4",null,"MMTCO2E",null,"MMTCE"]
[null,"Distribution pipeline",null,null,null,"metric tons CH4 per year per activity unit"]
[null,"Preferred Method"]
[null,"Miles of cast iron distribution pipeline","-->",null,"x",{"$f":"Control!$H$28","v":0},"=",{"$f":"D227*F227","v":0},"=",{"$f":"H227*MethGWP*10^-6","v":0},"=",{"$f":"J227/CO2_C","v":0}]
[null,"Miles of unprotected steel distribution pipeline","-->",null,"x",{"$f":"Control!$H$29","v":0},"=",{"$f":"D228*F228","v":0},"=",{"$f":"H228*MethGWP*10^-6","v":0},"=",{"$f":"J228/CO2_C","v":0}]
[null,"Miles of protected steel distribution pipeline","-->",null,"x",{"$f":"Control!$H$30","v":0},"=",{"$f":"D229*F229","v":0},"=",{"$f":"H229*MethGWP*10^-6","v":0},"=",{"$f":"J229/CO2_C","v":0}]
[null,"Miles of plastic distribution pipeline","-->",null,"x",{"$f":"Control!$H$31","v":0},"=",{"$f":"D230*F230","v":0},"=",{"$f":"H230*MethGWP*10^-6","v":0},"=",{"$f":"J230/CO2_C","v":0}]
[null,"Alternate Method"]
[null,"Total miles of distribution pipeline",null,null,"x",{"$f":"Control!$H$33","v":0},"=",{"$f":"D232*F232","v":0},"=",{"$f":"H232*MethGWP*10^-6","v":0},"=",{"$f":"J232/CO2_C","v":0}]
[]
[null,"Services"]
[null,"Total number of services","-->",null,"x",{"$f":"Control!$H$35","v":0},"=",{"$f":"D235*F235","v":0},"=",{"$f":"H235*MethGWP*10^-6","v":0},"=",{"$f":"J235/CO2_C","v":0}]
[null,"Number of unprotected steel services","-->",null,"x",{"$f":"Control!$H$36","v":0},"=",{"$f":"D236*F236","v":0},"=",{"$f":"H236*MethGWP*10^-6","v":0},"=",{"$f":"J236/CO2_C","v":0}]
[null,"Number of protected steel services","-->",null,"x",{"$f":"Control!$H$37","v":0},"=",{"$f":"D237*F237","v":0},"=",{"$f":"H237*MethGWP*10^-6","v":0},"=",{"$f":"J237/CO2_C","v":0}]
[null,"Total  ",null,null,null,null,null,{"$f":"SUM(H227:H237)","v":0},"=",{"$f":"H238*MethGWP*10^-6","v":0},"=",{"$f":"J238/CO2_C","v":0}]
[]
[null,"Natural Gas - Distribution",null,{"$f":"D222+1","v":2003}]
[]
[null,null,null,"Activity Data",null,"Emission Factor",null,"Metric Tons CH4",null,"MMTCO2E",null,"MMTCE"]
[null,"Distribution pipeline",null,null,null,"metric tons CH4 per year per activity unit"]
[null,"Preferred Method"]
[null,"Miles of cast iron distribution pipeline","-->",null,"x",{"$f":"Control!$H$28","v":0},"=",{"$f":"D245*F245","v":0},"=",{"$f":"H245*MethGWP*10^-6","v":0},"=",{"$f":"J245/CO2_C","v":0}]
[null,"Miles of unprotected steel distribution pipeline","-->",null,"x",{"$f":"Control!$H$29","v":0},"=",{"$f":"D246*F246","v":0},"=",{"$f":"H246*MethGWP*10^-6","v":0},"=",{"$f":"J246/CO2_C","v":0}]
[null,"Miles of protected steel distribution pipeline","-->",null,"x",{"$f":"Control!$H$30","v":0},"=",{"$f":"D247*F247","v":0},"=",{"$f":"H247*MethGWP*10^-6","v":0},"=",{"$f":"J247/CO2_C","v":0}]
[null,"Miles of plastic distribution pipeline","-->",null,"x",{"$f":"Control!$H$31","v":0},"=",{"$f":"D248*F248","v":0},"=",{"$f":"H248*MethGWP*10^-6","v":0},"=",{"$f":"J248/CO2_C","v":0}]
[null,"Alternate Method"]
[null,"Total miles of distribution pipeline",null,null,"x",{"$f":"Control!$H$33","v":0},"=",{"$f":"D250*F250","v":0},"=",{"$f":"H250*MethGWP*10^-6","v":0},"=",{"$f":"J250/CO2_C","v":0}]
[]
[null,"Services"]
[null,"Total number of services","-->",null,"x",{"$f":"Control!$H$35","v":0},"=",{"$f":"D253*F253","v":0},"=",{"$f":"H253*MethGWP*10^-6","v":0},"=",{"$f":"J253/CO2_C","v":0}]
[null,"Number of unprotected steel services","-->",null,"x",{"$f":"Control!$H$36","v":0},"=",{"$f":"D254*F254","v":0},"=",{"$f":"H254*MethGWP*10^-6","v":0},"=",{"$f":"J254/CO2_C","v":0}]
[null,"Number of protected steel services","-->",null,"x",{"$f":"Control!$H$37","v":0},"=",{"$f":"D255*F255","v":0},"=",{"$f":"H255*MethGWP*10^-6","v":0},"=",{"$f":"J255/CO2_C","v":0}]
[null,"Total  ",null,null,null,null,null,{"$f":"SUM(H245:H255)","v":0},"=",{"$f":"H256*MethGWP*10^-6","v":0},"=",{"$f":"J256/CO2_C","v":0}]
[]
[null,"Natural Gas - Distribution",null,{"$f":"D240+1","v":2004}]
[]
[null,null,null,"Activity Data",null,"Emission Factor",null,"Metric Tons CH4",null,"MMTCO2E",null,"MMTCE"]
[null,"Distribution pipeline",null,null,null,"metric tons CH4 per year per activity unit"]
[null,"Preferred Method"]
[null,"Miles of cast iron distribution pipeline","-->",null,"x",{"$f":"Control!$H$28","v":0},"=",{"$f":"D263*F263","v":0},"=",{"$f":"H263*MethGWP*10^-6","v":0},"=",{"$f":"J263/CO2_C","v":0}]
[null,"Miles of unprotected steel distribution pipeline","-->",null,"x",{"$f":"Control!$H$29","v":0},"=",{"$f":"D264*F264","v":0},"=",{"$f":"H264*MethGWP*10^-6","v":0},"=",{"$f":"J264/CO2_C","v":0}]
[null,"Miles of protected steel distribution pipeline","-->",null,"x",{"$f":"Control!$H$30","v":0},"=",{"$f":"D265*F265","v":0},"=",{"$f":"H265*MethGWP*10^-6","v":0},"=",{"$f":"J265/CO2_C","v":0}]
[null,"Miles of plastic distribution pipeline","-->",null,"x",{"$f":"Control!$H$31","v":0},"=",{"$f":"D266*F266","v":0},"=",{"$f":"H266*MethGWP*10^-6","v":0},"=",{"$f":"J266/CO2_C","v":0}]
[null,"Alternate Method"]
[null,"Total miles of distribution pipeline",null,null,"x",{"$f":"Control!$H$33","v":0},"=",{"$f":"D268*F268","v":0},"=",{"$f":"H268*MethGWP*10^-6","v":0},"=",{"$f":"J268/CO2_C","v":0}]
[]
[null,"Services"]
[null,"Total number of services","-->",null,"x",{"$f":"Control!$H$35","v":0},"=",{"$f":"D271*F271","v":0},"=",{"$f":"H271*MethGWP*10^-6","v":0},"=",{"$f":"J271/CO2_C","v":0}]
[null,"Number of unprotected steel services","-->",null,"x",{"$f":"Control!$H$36","v":0},"=",{"$f":"D272*F272","v":0},"=",{"$f":"H272*MethGWP*10^-6","v":0},"=",{"$f":"J272/CO2_C","v":0}]
[null,"Number of protected steel services","-->",null,"x",{"$f":"Control!$H$37","v":0},"=",{"$f":"D273*F273","v":0},"=",{"$f":"H273*MethGWP*10^-6","v":0},"=",{"$f":"J273/CO2_C","v":0}]
[null,"Total  ",null,null,null,null,null,{"$f":"SUM(H263:H273)","v":0},"=",{"$f":"H274*MethGWP*10^-6","v":0},"=",{"$f":"J274/CO2_C","v":0}]
[]
[null,"Natural Gas - Distribution",null,{"$f":"D258+1","v":2005}]
[]
[null,null,null,"Activity Data",null,"Emission Factor",null,"Metric Tons CH4",null,"MMTCO2E",null,"MMTCE"]
[null,"Distribution pipeline",null,null,null,"metric tons CH4 per year per activity unit"]
[null,"Preferred Method"]
[null,"Miles of cast iron distribution pipeline","-->",null,"x",{"$f":"Control!$H$28","v":0},"=",{"$f":"D281*F281","v":0},"=",{"$f":"H281*MethGWP*10^-6","v":0},"=",{"$f":"J281/CO2_C","v":0}]
[null,"Miles of unprotected steel distribution pipeline","-->",null,"x",{"$f":"Control!$H$29","v":0},"=",{"$f":"D282*F282","v":0},"=",{"$f":"H282*MethGWP*10^-6","v":0},"=",{"$f":"J282/CO2_C","v":0}]
[null,"Miles of protected steel distribution pipeline","-->",null,"x",{"$f":"Control!$H$30","v":0},"=",{"$f":"D283*F283","v":0},"=",{"$f":"H283*MethGWP*10^-6","v":0},"=",{"$f":"J283/CO2_C","v":0}]
[null,"Miles of plastic distribution pipeline","-->",null,"x",{"$f":"Control!$H$31","v":0},"=",{"$f":"D284*F284","v":0},"=",{"$f":"H284*MethGWP*10^-6","v":0},"=",{"$f":"J284/CO2_C","v":0}]
[null,"Alternate Method"]
[null,"Total miles of distribution pipeline",null,null,"x",{"$f":"Control!$H$33","v":0},"=",{"$f":"D286*F286","v":0},"=",{"$f":"H286*MethGWP*10^-6","v":0},"=",{"$f":"J286/CO2_C","v":0}]
[]
[null,"Services"]
[null,"Total number of services","-->",null,"x",{"$f":"Control!$H$35","v":0},"=",{"$f":"D289*F289","v":0},"=",{"$f":"H289*MethGWP*10^-6","v":0},"=",{"$f":"J289/CO2_C","v":0}]
[null,"Number of unprotected steel services","-->",null,"x",{"$f":"Control!$H$36","v":0},"=",{"$f":"D290*F290","v":0},"=",{"$f":"H290*MethGWP*10^-6","v":0},"=",{"$f":"J290/CO2_C","v":0}]
[null,"Number of protected steel services","-->",null,"x",{"$f":"Control!$H$37","v":0},"=",{"$f":"D291*F291","v":0},"=",{"$f":"H291*MethGWP*10^-6","v":0},"=",{"$f":"J291/CO2_C","v":0}]
[null,"Total  ",null,null,null,null,null,{"$f":"SUM(H281:H291)","v":0},"=",{"$f":"H292*MethGWP*10^-6","v":0},"=",{"$f":"J292/CO2_C","v":0}]
[]
[null,"Natural Gas - Distribution",null,{"$f":"D276+1","v":2006}]
[]
[null,null,null,"Activity Data",null,"Emission Factor",null,"Metric Tons CH4",null,"MMTCO2E",null,"MMTCE"]
[null,"Distribution pipeline",null,null,null,"metric tons CH4 per year per activity unit"]
[null,"Preferred Method"]
[null,"Miles of cast iron distribution pipeline","-->",null,"x",{"$f":"Control!$H$28","v":0},"=",{"$f":"D299*F299","v":0},"=",{"$f":"H299*MethGWP*10^-6","v":0},"=",{"$f":"J299/CO2_C","v":0}]
[null,"Miles of unprotected steel distribution pipeline","-->",null,"x",{"$f":"Control!$H$29","v":0},"=",{"$f":"D300*F300","v":0},"=",{"$f":"H300*MethGWP*10^-6","v":0},"=",{"$f":"J300/CO2_C","v":0}]
[null,"Miles of protected steel distribution pipeline","-->",null,"x",{"$f":"Control!$H$30","v":0},"=",{"$f":"D301*F301","v":0},"=",{"$f":"H301*MethGWP*10^-6","v":0},"=",{"$f":"J301/CO2_C","v":0}]
[null,"Miles of plastic distribution pipeline","-->",null,"x",{"$f":"Control!$H$31","v":0},"=",{"$f":"D302*F302","v":0},"=",{"$f":"H302*MethGWP*10^-6","v":0},"=",{"$f":"J302/CO2_C","v":0}]
[null,"Alternate Method"]
[null,"Total miles of distribution pipeline",null,null,"x",{"$f":"Control!$H$33","v":0},"=",{"$f":"D304*F304","v":0},"=",{"$f":"H304*MethGWP*10^-6","v":0},"=",{"$f":"J304/CO2_C","v":0}]
[]
[null,"Services"]
[null,"Total number of services","-->",null,"x",{"$f":"Control!$H$35","v":0},"=",{"$f":"D307*F307","v":0},"=",{"$f":"H307*MethGWP*10^-6","v":0},"=",{"$f":"J307/CO2_C","v":0}]
[null,"Number of unprotected steel services","-->",null,"x",{"$f":"Control!$H$36","v":0},"=",{"$f":"D308*F308","v":0},"=",{"$f":"H308*MethGWP*10^-6","v":0},"=",{"$f":"J308/CO2_C","v":0}]
[null,"Number of protected steel services","-->",null,"x",{"$f":"Control!$H$37","v":0},"=",{"$f":"D309*F309","v":0},"=",{"$f":"H309*MethGWP*10^-6","v":0},"=",{"$f":"J309/CO2_C","v":0}]
[null,"Total  ",null,null,null,null,null,{"$f":"SUM(H299:H309)","v":0},"=",{"$f":"H310*MethGWP*10^-6","v":0},"=",{"$f":"J310/CO2_C","v":0}]
[]
[null,"Natural Gas - Distribution",null,{"$f":"D294+1","v":2007}]
[]
[null,null,null,"Activity Data",null,"Emission Factor",null,"Metric Tons CH4",null,"MMTCO2E",null,"MMTCE"]
[null,"Distribution pipeline",null,null,null,"metric tons CH4 per year per activity unit"]
[null,"Preferred Method"]
[null,"Miles of cast iron distribution pipeline","-->",null,"x",{"$f":"Control!$H$28","v":0},"=",{"$f":"D317*F317","v":0},"=",{"$f":"H317*MethGWP*10^-6","v":0},"=",{"$f":"J317/CO2_C","v":0}]
[null,"Miles of unprotected steel distribution pipeline","-->",null,"x",{"$f":"Control!$H$29","v":0},"=",{"$f":"D318*F318","v":0},"=",{"$f":"H318*MethGWP*10^-6","v":0},"=",{"$f":"J318/CO2_C","v":0}]
[null,"Miles of protected steel distribution pipeline","-->",null,"x",{"$f":"Control!$H$30","v":0},"=",{"$f":"D319*F319","v":0},"=",{"$f":"H319*MethGWP*10^-6","v":0},"=",{"$f":"J319/CO2_C","v":0}]
[null,"Miles of plastic distribution pipeline","-->",null,"x",{"$f":"Control!$H$31","v":0},"=",{"$f":"D320*F320","v":0},"=",{"$f":"H320*MethGWP*10^-6","v":0},"=",{"$f":"J320/CO2_C","v":0}]
[null,"Alternate Method"]
[null,"Total miles of distribution pipeline",null,null,"x",{"$f":"Control!$H$33","v":0},"=",{"$f":"D322*F322","v":0},"=",{"$f":"H322*MethGWP*10^-6","v":0},"=",{"$f":"J322/CO2_C","v":0}]
[]
[null,"Services"]
[null,"Total number of services","-->",null,"x",{"$f":"Control!$H$35","v":0},"=",{"$f":"D325*F325","v":0},"=",{"$f":"H325*MethGWP*10^-6","v":0},"=",{"$f":"J325/CO2_C","v":0}]
[null,"Number of unprotected steel services","-->",null,"x",{"$f":"Control!$H$36","v":0},"=",{"$f":"D326*F326","v":0},"=",{"$f":"H326*MethGWP*10^-6","v":0},"=",{"$f":"J326/CO2_C","v":0}]
[null,"Number of protected steel services","-->",null,"x",{"$f":"Control!$H$37","v":0},"=",{"$f":"D327*F327","v":0},"=",{"$f":"H327*MethGWP*10^-6","v":0},"=",{"$f":"J327/CO2_C","v":0}]
[null,"Total  ",null,null,null,null,null,{"$f":"SUM(H317:H327)","v":0},"=",{"$f":"H328*MethGWP*10^-6","v":0},"=",{"$f":"J328/CO2_C","v":0}]
[]
[null,"Natural Gas - Distribution",null,{"$f":"D312+1","v":2008}]
[]
[null,null,null,"Activity Data",null,"Emission Factor",null,"Metric Tons CH4",null,"MMTCO2E",null,"MMTCE"]
[null,"Distribution pipeline",null,null,null,"metric tons CH4 per year per activity unit"]
[null,"Preferred Method"]
[null,"Miles of cast iron distribution pipeline","-->",null,"x",{"$f":"Control!$H$28","v":0},"=",{"$f":"D335*F335","v":0},"=",{"$f":"H335*MethGWP*10^-6","v":0},"=",{"$f":"J335/CO2_C","v":0}]
[null,"Miles of unprotected steel distribution pipeline","-->",null,"x",{"$f":"Control!$H$29","v":0},"=",{"$f":"D336*F336","v":0},"=",{"$f":"H336*MethGWP*10^-6","v":0},"=",{"$f":"J336/CO2_C","v":0}]
[null,"Miles of protected steel distribution pipeline","-->",null,"x",{"$f":"Control!$H$30","v":0},"=",{"$f":"D337*F337","v":0},"=",{"$f":"H337*MethGWP*10^-6","v":0},"=",{"$f":"J337/CO2_C","v":0}]
[null,"Miles of plastic distribution pipeline","-->",null,"x",{"$f":"Control!$H$31","v":0},"=",{"$f":"D338*F338","v":0},"=",{"$f":"H338*MethGWP*10^-6","v":0},"=",{"$f":"J338/CO2_C","v":0}]
[null,"Alternate Method"]
[null,"Total miles of distribution pipeline",null,null,"x",{"$f":"Control!$H$33","v":0},"=",{"$f":"D340*F340","v":0},"=",{"$f":"H340*MethGWP*10^-6","v":0},"=",{"$f":"J340/CO2_C","v":0}]
[]
[null,"Services"]
[null,"Total number of services","-->",null,"x",{"$f":"Control!$H$35","v":0},"=",{"$f":"D343*F343","v":0},"=",{"$f":"H343*MethGWP*10^-6","v":0},"=",{"$f":"J343/CO2_C","v":0}]
[null,"Number of unprotected steel services","-->",null,"x",{"$f":"Control!$H$36","v":0},"=",{"$f":"D344*F344","v":0},"=",{"$f":"H344*MethGWP*10^-6","v":0},"=",{"$f":"J344/CO2_C","v":0}]
[null,"Number of protected steel services","-->",null,"x",{"$f":"Control!$H$37","v":0},"=",{"$f":"D345*F345","v":0},"=",{"$f":"H345*MethGWP*10^-6","v":0},"=",{"$f":"J345/CO2_C","v":0}]
[null,"Total  ",null,null,null,null,null,{"$f":"SUM(H335:H345)","v":0},"=",{"$f":"H346*MethGWP*10^-6","v":0},"=",{"$f":"J346/CO2_C","v":0}]
[]
[null,"Natural Gas - Distribution",null,{"$f":"D330+1","v":2009}]
[]
[null,null,null,"Activity Data",null,"Emission Factor",null,"Metric Tons CH4",null,"MMTCO2E",null,"MMTCE"]
[null,"Distribution pipeline",null,null,null,"metric tons CH4 per year per activity unit"]
[null,"Preferred Method"]
[null,"Miles of cast iron distribution pipeline","-->",null,"x",{"$f":"Control!$H$28","v":0},"=",{"$f":"D353*F353","v":0},"=",{"$f":"H353*MethGWP*10^-6","v":0},"=",{"$f":"J353/CO2_C","v":0}]
[null,"Miles of unprotected steel distribution pipeline","-->",null,"x",{"$f":"Control!$H$29","v":0},"=",{"$f":"D354*F354","v":0},"=",{"$f":"H354*MethGWP*10^-6","v":0},"=",{"$f":"J354/CO2_C","v":0}]
[null,"Miles of protected steel distribution pipeline","-->",null,"x",{"$f":"Control!$H$30","v":0},"=",{"$f":"D355*F355","v":0},"=",{"$f":"H355*MethGWP*10^-6","v":0},"=",{"$f":"J355/CO2_C","v":0}]
[null,"Miles of plastic distribution pipeline","-->",null,"x",{"$f":"Control!$H$31","v":0},"=",{"$f":"D356*F356","v":0},"=",{"$f":"H356*MethGWP*10^-6","v":0},"=",{"$f":"J356/CO2_C","v":0}]
[null,"Alternate Method"]
[null,"Total miles of distribution pipeline",null,null,"x",{"$f":"Control!$H$33","v":0},"=",{"$f":"D358*F358","v":0},"=",{"$f":"H358*MethGWP*10^-6","v":0},"=",{"$f":"J358/CO2_C","v":0}]
[]
[null,"Services"]
[null,"Total number of services","-->",null,"x",{"$f":"Control!$H$35","v":0},"=",{"$f":"D361*F361","v":0},"=",{"$f":"H361*MethGWP*10^-6","v":0},"=",{"$f":"J361/CO2_C","v":0}]
[null,"Number of unprotected steel services","-->",null,"x",{"$f":"Control!$H$36","v":0},"=",{"$f":"D362*F362","v":0},"=",{"$f":"H362*MethGWP*10^-6","v":0},"=",{"$f":"J362/CO2_C","v":0}]
[null,"Number of protected steel services","-->",null,"x",{"$f":"Control!$H$37","v":0},"=",{"$f":"D363*F363","v":0},"=",{"$f":"H363*MethGWP*10^-6","v":0},"=",{"$f":"J363/CO2_C","v":0}]
[null,"Total  ",null,null,null,null,null,{"$f":"SUM(H353:H363)","v":0},"=",{"$f":"H364*MethGWP*10^-6","v":0},"=",{"$f":"J364/CO2_C","v":0}]
[]
[null,"Natural Gas - Distribution",null,{"$f":"D348+1","v":2010}]
[]
[null,null,null,"Activity Data",null,"Emission Factor",null,"Metric Tons CH4",null,"MMTCO2E",null,"MMTCE"]
[null,"Distribution pipeline",null,null,null,"metric tons CH4 per year per activity unit"]
[null,"Preferred Method"]
[null,"Miles of cast iron distribution pipeline","-->",null,"x",{"$f":"Control!$H$28","v":0},"=",{"$f":"D371*F371","v":0},"=",{"$f":"H371*MethGWP*10^-6","v":0},"=",{"$f":"J371/CO2_C","v":0}]
[null,"Miles of unprotected steel distribution pipeline","-->",null,"x",{"$f":"Control!$H$29","v":0},"=",{"$f":"D372*F372","v":0},"=",{"$f":"H372*MethGWP*10^-6","v":0},"=",{"$f":"J372/CO2_C","v":0}]
[null,"Miles of protected steel distribution pipeline","-->",null,"x",{"$f":"Control!$H$30","v":0},"=",{"$f":"D373*F373","v":0},"=",{"$f":"H373*MethGWP*10^-6","v":0},"=",{"$f":"J373/CO2_C","v":0}]
[null,"Miles of plastic distribution pipeline","-->",null,"x",{"$f":"Control!$H$31","v":0},"=",{"$f":"D374*F374","v":0},"=",{"$f":"H374*MethGWP*10^-6","v":0},"=",{"$f":"J374/CO2_C","v":0}]
[null,"Alternate Method"]
[null,"Total miles of distribution pipeline",null,null,"x",{"$f":"Control!$H$33","v":0},"=",{"$f":"D376*F376","v":0},"=",{"$f":"H376*MethGWP*10^-6","v":0},"=",{"$f":"J376/CO2_C","v":0}]
[]
[null,"Services"]
[null,"Total number of services","-->",null,"x",{"$f":"Control!$H$35","v":0},"=",{"$f":"D379*F379","v":0},"=",{"$f":"H379*MethGWP*10^-6","v":0},"=",{"$f":"J379/CO2_C","v":0}]
[null,"Number of unprotected steel services","-->",null,"x",{"$f":"Control!$H$36","v":0},"=",{"$f":"D380*F380","v":0},"=",{"$f":"H380*MethGWP*10^-6","v":0},"=",{"$f":"J380/CO2_C","v":0}]
[null,"Number of protected steel services","-->",null,"x",{"$f":"Control!$H$37","v":0},"=",{"$f":"D381*F381","v":0},"=",{"$f":"H381*MethGWP*10^-6","v":0},"=",{"$f":"J381/CO2_C","v":0}]
[null,"Total  ",null,null,null,null,null,{"$f":"SUM(H371:H381)","v":0},"=",{"$f":"H382*MethGWP*10^-6","v":0},"=",{"$f":"J382/CO2_C","v":0}]
[]
[null,"Natural Gas - Distribution",null,{"$f":"D366+1","v":2011}]
[]
[null,null,null,"Activity Data",null,"Emission Factor",null,"Metric Tons CH4",null,"MMTCO2E",null,"MMTCE"]
[null,"Distribution pipeline",null,null,null,"metric tons CH4 per year per activity unit"]
[null,"Preferred Method"]
[null,"Miles of cast iron distribution pipeline","-->",null,"x",{"$f":"Control!$H$28","v":0},"=",{"$f":"D389*F389","v":0},"=",{"$f":"H389*MethGWP*10^-6","v":0},"=",{"$f":"J389/CO2_C","v":0}]
[null,"Miles of unprotected steel distribution pipeline","-->",null,"x",{"$f":"Control!$H$29","v":0},"=",{"$f":"D390*F390","v":0},"=",{"$f":"H390*MethGWP*10^-6","v":0},"=",{"$f":"J390/CO2_C","v":0}]
[null,"Miles of protected steel distribution pipeline","-->",null,"x",{"$f":"Control!$H$30","v":0},"=",{"$f":"D391*F391","v":0},"=",{"$f":"H391*MethGWP*10^-6","v":0},"=",{"$f":"J391/CO2_C","v":0}]
[null,"Miles of plastic distribution pipeline","-->",null,"x",{"$f":"Control!$H$31","v":0},"=",{"$f":"D392*F392","v":0},"=",{"$f":"H392*MethGWP*10^-6","v":0},"=",{"$f":"J392/CO2_C","v":0}]
[null,"Alternate Method"]
[null,"Total miles of distribution pipeline",null,null,"x",{"$f":"Control!$H$33","v":0},"=",{"$f":"D394*F394","v":0},"=",{"$f":"H394*MethGWP*10^-6","v":0},"=",{"$f":"J394/CO2_C","v":0}]
[]
[null,"Services"]
[null,"Total number of services","-->",null,"x",{"$f":"Control!$H$35","v":0},"=",{"$f":"D397*F397","v":0},"=",{"$f":"H397*MethGWP*10^-6","v":0},"=",{"$f":"J397/CO2_C","v":0}]
[null,"Number of unprotected steel services","-->",null,"x",{"$f":"Control!$H$36","v":0},"=",{"$f":"D398*F398","v":0},"=",{"$f":"H398*MethGWP*10^-6","v":0},"=",{"$f":"J398/CO2_C","v":0}]
[null,"Number of protected steel services","-->",null,"x",{"$f":"Control!$H$37","v":0},"=",{"$f":"D399*F399","v":0},"=",{"$f":"H399*MethGWP*10^-6","v":0},"=",{"$f":"J399/CO2_C","v":0}]
[null,"Total  ",null,null,null,null,null,{"$f":"SUM(H389:H399)","v":0},"=",{"$f":"H400*MethGWP*10^-6","v":0},"=",{"$f":"J400/CO2_C","v":0}]
[]
[null,"Natural Gas - Distribution",null,{"$f":"D384+1","v":2012}]
[]
[null,null,null,"Activity Data",null,"Emission Factor",null,"Metric Tons CH4",null,"MMTCO2E",null,"MMTCE"]
[null,"Distribution pipeline",null,null,null,"metric tons CH4 per year per activity unit"]
[null,"Preferred Method"]
[null,"Miles of cast iron distribution pipeline","-->",null,"x",{"$f":"Control!$H$28","v":0},"=",{"$f":"D407*F407","v":0},"=",{"$f":"H407*MethGWP*10^-6","v":0},"=",{"$f":"J407/CO2_C","v":0}]
[null,"Miles of unprotected steel distribution pipeline","-->",null,"x",{"$f":"Control!$H$29","v":0},"=",{"$f":"D408*F408","v":0},"=",{"$f":"H408*MethGWP*10^-6","v":0},"=",{"$f":"J408/CO2_C","v":0}]
[null,"Miles of protected steel distribution pipeline","-->",null,"x",{"$f":"Control!$H$30","v":0},"=",{"$f":"D409*F409","v":0},"=",{"$f":"H409*MethGWP*10^-6","v":0},"=",{"$f":"J409/CO2_C","v":0}]
[null,"Miles of plastic distribution pipeline","-->",null,"x",{"$f":"Control!$H$31","v":0},"=",{"$f":"D410*F410","v":0},"=",{"$f":"H410*MethGWP*10^-6","v":0},"=",{"$f":"J410/CO2_C","v":0}]
[null,"Alternate Method"]
[null,"Total miles of distribution pipeline",null,null,"x",{"$f":"Control!$H$33","v":0},"=",{"$f":"D412*F412","v":0},"=",{"$f":"H412*MethGWP*10^-6","v":0},"=",{"$f":"J412/CO2_C","v":0}]
[]
[null,"Services"]
[null,"Total number of services","-->",null,"x",{"$f":"Control!$H$35","v":0},"=",{"$f":"D415*F415","v":0},"=",{"$f":"H415*MethGWP*10^-6","v":0},"=",{"$f":"J415/CO2_C","v":0}]
[null,"Number of unprotected steel services","-->",null,"x",{"$f":"Control!$H$36","v":0},"=",{"$f":"D416*F416","v":0},"=",{"$f":"H416*MethGWP*10^-6","v":0},"=",{"$f":"J416/CO2_C","v":0}]
[null,"Number of protected steel services","-->",null,"x",{"$f":"Control!$H$37","v":0},"=",{"$f":"D417*F417","v":0},"=",{"$f":"H417*MethGWP*10^-6","v":0},"=",{"$f":"J417/CO2_C","v":0}]
[null,"Total  ",null,null,null,null,null,{"$f":"SUM(H407:H417)","v":0},"=",{"$f":"H418*MethGWP*10^-6","v":0},"=",{"$f":"J418/CO2_C","v":0}]
[]
[null,"Natural Gas - Distribution",null,{"$f":"D402+1","v":2013}]
[]
[null,null,null,"Activity Data",null,"Emission Factor",null,"Metric Tons CH4",null,"MMTCO2E",null,"MMTCE"]
[null,"Distribution pipeline",null,null,null,"metric tons CH4 per year per activity unit"]
[null,"Preferred Method"]
[null,"Miles of cast iron distribution pipeline","-->",null,"x",{"$f":"Control!$H$28","v":0},"=",{"$f":"D425*F425","v":0},"=",{"$f":"H425*MethGWP*10^-6","v":0},"=",{"$f":"J425/CO2_C","v":0}]
[null,"Miles of unprotected steel distribution pipeline","-->",null,"x",{"$f":"Control!$H$29","v":0},"=",{"$f":"D426*F426","v":0},"=",{"$f":"H426*MethGWP*10^-6","v":0},"=",{"$f":"J426/CO2_C","v":0}]
[null,"Miles of protected steel distribution pipeline","-->",null,"x",{"$f":"Control!$H$30","v":0},"=",{"$f":"D427*F427","v":0},"=",{"$f":"H427*MethGWP*10^-6","v":0},"=",{"$f":"J427/CO2_C","v":0}]
[null,"Miles of plastic distribution pipeline","-->",null,"x",{"$f":"Control!$H$31","v":0},"=",{"$f":"D428*F428","v":0},"=",{"$f":"H428*MethGWP*10^-6","v":0},"=",{"$f":"J428/CO2_C","v":0}]
[null,"Alternate Method"]
[null,"Total miles of distribution pipeline",null,null,"x",{"$f":"Control!$H$33","v":0},"=",{"$f":"D430*F430","v":0},"=",{"$f":"H430*MethGWP*10^-6","v":0},"=",{"$f":"J430/CO2_C","v":0}]
[]
[null,"Services"]
[null,"Total number of services","-->",null,"x",{"$f":"Control!$H$35","v":0},"=",{"$f":"D433*F433","v":0},"=",{"$f":"H433*MethGWP*10^-6","v":0},"=",{"$f":"J433/CO2_C","v":0}]
[null,"Number of unprotected steel services","-->",null,"x",{"$f":"Control!$H$36","v":0},"=",{"$f":"D434*F434","v":0},"=",{"$f":"H434*MethGWP*10^-6","v":0},"=",{"$f":"J434/CO2_C","v":0}]
[null,"Number of protected steel services","-->",null,"x",{"$f":"Control!$H$37","v":0},"=",{"$f":"D435*F435","v":0},"=",{"$f":"H435*MethGWP*10^-6","v":0},"=",{"$f":"J435/CO2_C","v":0}]
[null,"Total  ",null,null,null,null,null,{"$f":"SUM(H425:H435)","v":0},"=",{"$f":"H436*MethGWP*10^-6","v":0},"=",{"$f":"J436/CO2_C","v":0}]
[]
[null,"Natural Gas - Distribution",null,{"$f":"D420+1","v":2014}]
[]
[null,null,null,"Activity Data",null,"Emission Factor",null,"Metric Tons CH4",null,"MMTCO2E",null,"MMTCE"]
[null,"Distribution pipeline",null,null,null,"metric tons CH4 per year per activity unit"]
[null,"Preferred Method"]
[null,"Miles of cast iron distribution pipeline","-->",null,"x",{"$f":"Control!$H$28","v":0},"=",{"$f":"D443*F443","v":0},"=",{"$f":"H443*MethGWP*10^-6","v":0},"=",{"$f":"J443/CO2_C","v":0}]
[null,"Miles of unprotected steel distribution pipeline","-->",null,"x",{"$f":"Control!$H$29","v":0},"=",{"$f":"D444*F444","v":0},"=",{"$f":"H444*MethGWP*10^-6","v":0},"=",{"$f":"J444/CO2_C","v":0}]
[null,"Miles of protected steel distribution pipeline","-->",null,"x",{"$f":"Control!$H$30","v":0},"=",{"$f":"D445*F445","v":0},"=",{"$f":"H445*MethGWP*10^-6","v":0},"=",{"$f":"J445/CO2_C","v":0}]
[null,"Miles of plastic distribution pipeline","-->",null,"x",{"$f":"Control!$H$31","v":0},"=",{"$f":"D446*F446","v":0},"=",{"$f":"H446*MethGWP*10^-6","v":0},"=",{"$f":"J446/CO2_C","v":0}]
[null,"Alternate Method"]
[null,"Total miles of distribution pipeline",null,null,"x",{"$f":"Control!$H$33","v":0},"=",{"$f":"D448*F448","v":0},"=",{"$f":"H448*MethGWP*10^-6","v":0},"=",{"$f":"J448/CO2_C","v":0}]
[]
[null,"Services"]
[null,"Total number of services","-->",null,"x",{"$f":"Control!$H$35","v":0},"=",{"$f":"D451*F451","v":0},"=",{"$f":"H451*MethGWP*10^-6","v":0},"=",{"$f":"J451/CO2_C","v":0}]
[null,"Number of unprotected steel services","-->",null,"x",{"$f":"Control!$H$36","v":0},"=",{"$f":"D452*F452","v":0},"=",{"$f":"H452*MethGWP*10^-6","v":0},"=",{"$f":"J452/CO2_C","v":0}]
[null,"Number of protected steel services","-->",null,"x",{"$f":"Control!$H$37","v":0},"=",{"$f":"D453*F453","v":0},"=",{"$f":"H453*MethGWP*10^-6","v":0},"=",{"$f":"J453/CO2_C","v":0}]
[null,"Total  ",null,null,null,null,null,{"$f":"SUM(H443:H453)","v":0},"=",{"$f":"H454*MethGWP*10^-6","v":0},"=",{"$f":"J454/CO2_C","v":0}]
[]
[null,"Natural Gas - Distribution",null,{"$f":"D438+1","v":2015}]
[]
[null,null,null,"Activity Data",null,"Emission Factor",null,"Metric Tons CH4",null,"MMTCO2E",null,"MMTCE"]
[null,"Distribution pipeline",null,null,null,"metric tons CH4 per year per activity unit"]
[null,"Preferred Method"]
[null,"Miles of cast iron distribution pipeline","-->",null,"x",{"$f":"Control!$H$28","v":0},"=",{"$f":"D461*F461","v":0},"=",{"$f":"H461*MethGWP*10^-6","v":0},"=",{"$f":"J461/CO2_C","v":0}]
[null,"Miles of unprotected steel distribution pipeline","-->",null,"x",{"$f":"Control!$H$29","v":0},"=",{"$f":"D462*F462","v":0},"=",{"$f":"H462*MethGWP*10^-6","v":0},"=",{"$f":"J462/CO2_C","v":0}]
[null,"Miles of protected steel distribution pipeline","-->",null,"x",{"$f":"Control!$H$30","v":0},"=",{"$f":"D463*F463","v":0},"=",{"$f":"H463*MethGWP*10^-6","v":0},"=",{"$f":"J463/CO2_C","v":0}]
[null,"Miles of plastic distribution pipeline","-->",null,"x",{"$f":"Control!$H$31","v":0},"=",{"$f":"D464*F464","v":0},"=",{"$f":"H464*MethGWP*10^-6","v":0},"=",{"$f":"J464/CO2_C","v":0}]
[null,"Alternate Method"]
[null,"Total miles of distribution pipeline",null,null,"x",{"$f":"Control!$H$33","v":0},"=",{"$f":"D466*F466","v":0},"=",{"$f":"H466*MethGWP*10^-6","v":0},"=",{"$f":"J466/CO2_C","v":0}]
[]
[null,"Services"]
[null,"Total number of services","-->",null,"x",{"$f":"Control!$H$35","v":0},"=",{"$f":"D469*F469","v":0},"=",{"$f":"H469*MethGWP*10^-6","v":0},"=",{"$f":"J469/CO2_C","v":0}]
[null,"Number of unprotected steel services","-->",null,"x",{"$f":"Control!$H$36","v":0},"=",{"$f":"D470*F470","v":0},"=",{"$f":"H470*MethGWP*10^-6","v":0},"=",{"$f":"J470/CO2_C","v":0}]
[null,"Number of protected steel services","-->",null,"x",{"$f":"Control!$H$37","v":0},"=",{"$f":"D471*F471","v":0},"=",{"$f":"H471*MethGWP*10^-6","v":0},"=",{"$f":"J471/CO2_C","v":0}]
[null,"Total  ",null,null,null,null,null,{"$f":"SUM(H461:H471)","v":0},"=",{"$f":"H472*MethGWP*10^-6","v":0},"=",{"$f":"J472/CO2_C","v":0}]
[]
[null,"Natural Gas - Distribution",null,{"$f":"D456+1","v":2016}]
[]
[null,null,null,"Activity Data",null,"Emission Factor",null,"Metric Tons CH4",null,"MMTCO2E",null,"MMTCE"]
[null,"Distribution pipeline",null,null,null,"metric tons CH4 per year per activity unit"]
[null,"Preferred Method"]
[null,"Miles of cast iron distribution pipeline","-->",null,"x",{"$f":"Control!$H$28","v":0},"=",{"$f":"D479*F479","v":0},"=",{"$f":"H479*MethGWP*10^-6","v":0},"=",{"$f":"J479/CO2_C","v":0}]
[null,"Miles of unprotected steel distribution pipeline","-->",null,"x",{"$f":"Control!$H$29","v":0},"=",{"$f":"D480*F480","v":0},"=",{"$f":"H480*MethGWP*10^-6","v":0},"=",{"$f":"J480/CO2_C","v":0}]
[null,"Miles of protected steel distribution pipeline","-->",null,"x",{"$f":"Control!$H$30","v":0},"=",{"$f":"D481*F481","v":0},"=",{"$f":"H481*MethGWP*10^-6","v":0},"=",{"$f":"J481/CO2_C","v":0}]
[null,"Miles of plastic distribution pipeline","-->",null,"x",{"$f":"Control!$H$31","v":0},"=",{"$f":"D482*F482","v":0},"=",{"$f":"H482*MethGWP*10^-6","v":0},"=",{"$f":"J482/CO2_C","v":0}]
[null,"Alternate Method"]
[null,"Total miles of distribution pipeline",null,null,"x",{"$f":"Control!$H$33","v":0},"=",{"$f":"D484*F484","v":0},"=",{"$f":"H484*MethGWP*10^-6","v":0},"=",{"$f":"J484/CO2_C","v":0}]
[]
[null,"Services"]
[null,"Total number of services","-->",null,"x",{"$f":"Control!$H$35","v":0},"=",{"$f":"D487*F487","v":0},"=",{"$f":"H487*MethGWP*10^-6","v":0},"=",{"$f":"J487/CO2_C","v":0}]
[null,"Number of unprotected steel services","-->",null,"x",{"$f":"Control!$H$36","v":0},"=",{"$f":"D488*F488","v":0},"=",{"$f":"H488*MethGWP*10^-6","v":0},"=",{"$f":"J488/CO2_C","v":0}]
[null,"Number of protected steel services","-->",null,"x",{"$f":"Control!$H$37","v":0},"=",{"$f":"D489*F489","v":0},"=",{"$f":"H489*MethGWP*10^-6","v":0},"=",{"$f":"J489/CO2_C","v":0}]
[null,"Total  ",null,null,null,null,null,{"$f":"SUM(H479:H489)","v":0},"=",{"$f":"H490*MethGWP*10^-6","v":0},"=",{"$f":"J490/CO2_C","v":0}]
[]
[null,"Natural Gas - Distribution",null,{"$f":"D474+1","v":2017}]
[]
[null,null,null,"Activity Data",null,"Emission Factor",null,"Metric Tons CH4",null,"MMTCO2E",null,"MMTCE"]
[null,"Distribution pipeline",null,null,null,"metric tons CH4 per year per activity unit"]
[null,"Preferred Method"]
[null,"Miles of cast iron distribution pipeline","-->",null,"x",{"$f":"Control!$H$28","v":0},"=",{"$f":"D497*F497","v":0},"=",{"$f":"H497*MethGWP*10^-6","v":0},"=",{"$f":"J497/CO2_C","v":0}]
[null,"Miles of unprotected steel distribution pipeline","-->",null,"x",{"$f":"Control!$H$29","v":0},"=",{"$f":"D498*F498","v":0},"=",{"$f":"H498*MethGWP*10^-6","v":0},"=",{"$f":"J498/CO2_C","v":0}]
[null,"Miles of protected steel distribution pipeline","-->",null,"x",{"$f":"Control!$H$30","v":0},"=",{"$f":"D499*F499","v":0},"=",{"$f":"H499*MethGWP*10^-6","v":0},"=",{"$f":"J499/CO2_C","v":0}]
[null,"Miles of plastic distribution pipeline","-->",null,"x",{"$f":"Control!$H$31","v":0},"=",{"$f":"D500*F500","v":0},"=",{"$f":"H500*MethGWP*10^-6","v":0},"=",{"$f":"J500/CO2_C","v":0}]
[null,"Alternate Method"]
[null,"Total miles of distribution pipeline",null,null,"x",{"$f":"Control!$H$33","v":0},"=",{"$f":"D502*F502","v":0},"=",{"$f":"H502*MethGWP*10^-6","v":0},"=",{"$f":"J502/CO2_C","v":0}]
[]
[null,"Services"]
[null,"Total number of services","-->",null,"x",{"$f":"Control!$H$35","v":0},"=",{"$f":"D505*F505","v":0},"=",{"$f":"H505*MethGWP*10^-6","v":0},"=",{"$f":"J505/CO2_C","v":0}]
[null,"Number of unprotected steel services","-->",null,"x",{"$f":"Control!$H$36","v":0},"=",{"$f":"D506*F506","v":0},"=",{"$f":"H506*MethGWP*10^-6","v":0},"=",{"$f":"J506/CO2_C","v":0}]
[null,"Number of protected steel services","-->",null,"x",{"$f":"Control!$H$37","v":0},"=",{"$f":"D507*F507","v":0},"=",{"$f":"H507*MethGWP*10^-6","v":0},"=",{"$f":"J507/CO2_C","v":0}]
[null,"Total  ",null,null,null,null,null,{"$f":"SUM(H497:H507)","v":0},"=",{"$f":"H508*MethGWP*10^-6","v":0},"=",{"$f":"J508/CO2_C","v":0}]
[]
[null,"Natural Gas - Distribution",null,{"$f":"D492+1","v":2018}]
[]
[null,null,null,"Activity Data",null,"Emission Factor",null,"Metric Tons CH4",null,"MMTCO2E",null,"MMTCE"]
[null,"Distribution pipeline",null,null,null,"metric tons CH4 per year per activity unit"]
[null,"Preferred Method"]
[null,"Miles of cast iron distribution pipeline","-->",null,"x",{"$f":"Control!$H$28","v":0},"=",{"$f":"D515*F515","v":0},"=",{"$f":"H515*MethGWP*10^-6","v":0},"=",{"$f":"J515/CO2_C","v":0}]
[null,"Miles of unprotected steel distribution pipeline","-->",null,"x",{"$f":"Control!$H$29","v":0},"=",{"$f":"D516*F516","v":0},"=",{"$f":"H516*MethGWP*10^-6","v":0},"=",{"$f":"J516/CO2_C","v":0}]
[null,"Miles of protected steel distribution pipeline","-->",null,"x",{"$f":"Control!$H$30","v":0},"=",{"$f":"D517*F517","v":0},"=",{"$f":"H517*MethGWP*10^-6","v":0},"=",{"$f":"J517/CO2_C","v":0}]
[null,"Miles of plastic distribution pipeline","-->",null,"x",{"$f":"Control!$H$31","v":0},"=",{"$f":"D518*F518","v":0},"=",{"$f":"H518*MethGWP*10^-6","v":0},"=",{"$f":"J518/CO2_C","v":0}]
[null,"Alternate Method"]
[null,"Total miles of distribution pipeline",null,null,"x",{"$f":"Control!$H$33","v":0},"=",{"$f":"D520*F520","v":0},"=",{"$f":"H520*MethGWP*10^-6","v":0},"=",{"$f":"J520/CO2_C","v":0}]
[]
[null,"Services"]
[null,"Total number of services","-->",null,"x",{"$f":"Control!$H$35","v":0},"=",{"$f":"D523*F523","v":0},"=",{"$f":"H523*MethGWP*10^-6","v":0},"=",{"$f":"J523/CO2_C","v":0}]
[null,"Number of unprotected steel services","-->",null,"x",{"$f":"Control!$H$36","v":0},"=",{"$f":"D524*F524","v":0},"=",{"$f":"H524*MethGWP*10^-6","v":0},"=",{"$f":"J524/CO2_C","v":0}]
[null,"Number of protected steel services","-->",null,"x",{"$f":"Control!$H$37","v":0},"=",{"$f":"D525*F525","v":0},"=",{"$f":"H525*MethGWP*10^-6","v":0},"=",{"$f":"J525/CO2_C","v":0}]
[null,"Total  ",null,null,null,null,null,{"$f":"SUM(H515:H525)","v":0},"=",{"$f":"H526*MethGWP*10^-6","v":0},"=",{"$f":"J526/CO2_C","v":0}]
[]
[null,"Natural Gas - Distribution",null,{"$f":"D510+1","v":2019}]
[]
[null,null,null,"Activity Data",null,"Emission Factor",null,"Metric Tons CH4",null,"MMTCO2E",null,"MMTCE"]
[null,"Distribution pipeline",null,null,null,"metric tons CH4 per year per activity unit"]
[null,"Preferred Method"]
[null,"Miles of cast iron distribution pipeline","-->",null,"x",{"$f":"Control!$H$28","v":0},"=",{"$f":"D533*F533","v":0},"=",{"$f":"H533*MethGWP*10^-6","v":0},"=",{"$f":"J533/CO2_C","v":0}]
[null,"Miles of unprotected steel distribution pipeline","-->",null,"x",{"$f":"Control!$H$29","v":0},"=",{"$f":"D534*F534","v":0},"=",{"$f":"H534*MethGWP*10^-6","v":0},"=",{"$f":"J534/CO2_C","v":0}]
[null,"Miles of protected steel distribution pipeline","-->",null,"x",{"$f":"Control!$H$30","v":0},"=",{"$f":"D535*F535","v":0},"=",{"$f":"H535*MethGWP*10^-6","v":0},"=",{"$f":"J535/CO2_C","v":0}]
[null,"Miles of plastic distribution pipeline","-->",null,"x",{"$f":"Control!$H$31","v":0},"=",{"$f":"D536*F536","v":0},"=",{"$f":"H536*MethGWP*10^-6","v":0},"=",{"$f":"J536/CO2_C","v":0}]
[null,"Alternate Method"]
[null,"Total miles of distribution pipeline",null,null,"x",{"$f":"Control!$H$33","v":0},"=",{"$f":"D538*F538","v":0},"=",{"$f":"H538*MethGWP*10^-6","v":0},"=",{"$f":"J538/CO2_C","v":0}]
[]
[null,"Services"]
[null,"Total number of services","-->",null,"x",{"$f":"Control!$H$35","v":0},"=",{"$f":"D541*F541","v":0},"=",{"$f":"H541*MethGWP*10^-6","v":0},"=",{"$f":"J541/CO2_C","v":0}]
[null,"Number of unprotected steel services","-->",null,"x",{"$f":"Control!$H$36","v":0},"=",{"$f":"D542*F542","v":0},"=",{"$f":"H542*MethGWP*10^-6","v":0},"=",{"$f":"J542/CO2_C","v":0}]
[null,"Number of protected steel services","-->",null,"x",{"$f":"Control!$H$37","v":0},"=",{"$f":"D543*F543","v":0},"=",{"$f":"H543*MethGWP*10^-6","v":0},"=",{"$f":"J543/CO2_C","v":0}]
[null,"Total  ",null,null,null,null,null,{"$f":"SUM(H533:H543)","v":0},"=",{"$f":"H544*MethGWP*10^-6","v":0},"=",{"$f":"J544/CO2_C","v":0}]
[]
[null,"Natural Gas - Distribution",null,{"$f":"D528+1","v":2020}]
[]
[null,null,null,"Activity Data",null,"Emission Factor",null,"Metric Tons CH4",null,"MMTCO2E",null,"MMTCE"]
[null,"Distribution pipeline",null,null,null,"metric tons CH4 per year per activity unit"]
[null,"Preferred Method"]
[null,"Miles of cast iron distribution pipeline","-->",null,"x",{"$f":"Control!$H$28","v":0},"=",{"$f":"D551*F551","v":0},"=",{"$f":"H551*MethGWP*10^-6","v":0},"=",{"$f":"J551/CO2_C","v":0}]
[null,"Miles of unprotected steel distribution pipeline","-->",null,"x",{"$f":"Control!$H$29","v":0},"=",{"$f":"D552*F552","v":0},"=",{"$f":"H552*MethGWP*10^-6","v":0},"=",{"$f":"J552/CO2_C","v":0}]
[null,"Miles of protected steel distribution pipeline","-->",null,"x",{"$f":"Control!$H$30","v":0},"=",{"$f":"D553*F553","v":0},"=",{"$f":"H553*MethGWP*10^-6","v":0},"=",{"$f":"J553/CO2_C","v":0}]
[null,"Miles of plastic distribution pipeline","-->",null,"x",{"$f":"Control!$H$31","v":0},"=",{"$f":"D554*F554","v":0},"=",{"$f":"H554*MethGWP*10^-6","v":0},"=",{"$f":"J554/CO2_C","v":0}]
[null,"Alternate Method"]
[null,"Total miles of distribution pipeline",null,null,"x",{"$f":"Control!$H$33","v":0},"=",{"$f":"D556*F556","v":0},"=",{"$f":"H556*MethGWP*10^-6","v":0},"=",{"$f":"J556/CO2_C","v":0}]
[]
[null,"Services"]
[null,"Total number of services","-->",null,"x",{"$f":"Control!$H$35","v":0},"=",{"$f":"D559*F559","v":0},"=",{"$f":"H559*MethGWP*10^-6","v":0},"=",{"$f":"J559/CO2_C","v":0}]
[null,"Number of unprotected steel services","-->",null,"x",{"$f":"Control!$H$36","v":0},"=",{"$f":"D560*F560","v":0},"=",{"$f":"H560*MethGWP*10^-6","v":0},"=",{"$f":"J560/CO2_C","v":0}]
[null,"Number of protected steel services","-->",null,"x",{"$f":"Control!$H$37","v":0},"=",{"$f":"D561*F561","v":0},"=",{"$f":"H561*MethGWP*10^-6","v":0},"=",{"$f":"J561/CO2_C","v":0}]
[null,"Total  ",null,null,null,null,null,{"$f":"SUM(H551:H561)","v":0},"=",{"$f":"H562*MethGWP*10^-6","v":0},"=",{"$f":"J562/CO2_C","v":0}]
[]
[null,"Natural Gas - Distribution",null,{"$f":"D546+1","v":2021}]
[]
[null,null,null,"Activity Data",null,"Emission Factor",null,"Metric Tons CH4",null,"MMTCO2E",null,"MMTCE"]
[null,"Distribution pipeline",null,null,null,"metric tons CH4 per year per activity unit"]
[null,"Preferred Method"]
[null,"Miles of cast iron distribution pipeline","-->",null,"x",{"$f":"Control!$H$28","v":0},"=",{"$f":"D569*F569","v":0},"=",{"$f":"H569*MethGWP*10^-6","v":0},"=",{"$f":"J569/CO2_C","v":0}]
[null,"Miles of unprotected steel distribution pipeline","-->",null,"x",{"$f":"Control!$H$29","v":0},"=",{"$f":"D570*F570","v":0},"=",{"$f":"H570*MethGWP*10^-6","v":0},"=",{"$f":"J570/CO2_C","v":0}]
[null,"Miles of protected steel distribution pipeline","-->",null,"x",{"$f":"Control!$H$30","v":0},"=",{"$f":"D571*F571","v":0},"=",{"$f":"H571*MethGWP*10^-6","v":0},"=",{"$f":"J571/CO2_C","v":0}]
[null,"Miles of plastic distribution pipeline","-->",null,"x",{"$f":"Control!$H$31","v":0},"=",{"$f":"D572*F572","v":0},"=",{"$f":"H572*MethGWP*10^-6","v":0},"=",{"$f":"J572/CO2_C","v":0}]
[null,"Alternate Method"]
[null,"Total miles of distribution pipeline","-->",null,"x",{"$f":"Control!$H$33","v":0},"=",{"$f":"D574*F574","v":0},"=",{"$f":"H574*MethGWP*10^-6","v":0},"=",{"$f":"J574/CO2_C","v":0}]
[]
[null,"Services"]
[null,"Total number of services","-->",null,"x",{"$f":"Control!$H$35","v":0},"=",{"$f":"D577*F577","v":0},"=",{"$f":"H577*MethGWP*10^-6","v":0},"=",{"$f":"J577/CO2_C","v":0}]
[null,"Number of unprotected steel services","-->",null,"x",{"$f":"Control!$H$36","v":0},"=",{"$f":"D578*F578","v":0},"=",{"$f":"H578*MethGWP*10^-6","v":0},"=",{"$f":"J578/CO2_C","v":0}]
[null,"Number of protected steel services","-->",null,"x",{"$f":"Control!$H$37","v":0},"=",{"$f":"D579*F579","v":0},"=",{"$f":"H579*MethGWP*10^-6","v":0},"=",{"$f":"J579/CO2_C","v":0}]
[null,"Total  ",null,null,null,null,null,{"$f":"SUM(H569:H579)","v":0},"=",{"$f":"H580*MethGWP*10^-6","v":0},"=",{"$f":"J580/CO2_C","v":0}]
[]
[null,"Natural Gas - Distribution",null,{"$f":"D564+1","v":2022}]
[]
[null,null,null,"Activity Data",null,"Emission Factor",null,"Metric Tons CH4",null,"MMTCO2E",null,"MMTCE"]
[null,"Distribution pipeline",null,null,null,"metric tons CH4 per year per activity unit"]
[null,"Preferred Method"]
[null,"Miles of cast iron distribution pipeline","-->",null,"x",{"$f":"Control!$H$28","v":0},"=",{"$f":"D587*F587","v":0},"=",{"$f":"H587*MethGWP*10^-6","v":0},"=",{"$f":"J587/CO2_C","v":0}]
[null,"Miles of unprotected steel distribution pipeline","-->",null,"x",{"$f":"Control!$H$29","v":0},"=",{"$f":"D588*F588","v":0},"=",{"$f":"H588*MethGWP*10^-6","v":0},"=",{"$f":"J588/CO2_C","v":0}]
[null,"Miles of protected steel distribution pipeline","-->",null,"x",{"$f":"Control!$H$30","v":0},"=",{"$f":"D589*F589","v":0},"=",{"$f":"H589*MethGWP*10^-6","v":0},"=",{"$f":"J589/CO2_C","v":0}]
[null,"Miles of plastic distribution pipeline","-->",null,"x",{"$f":"Control!$H$31","v":0},"=",{"$f":"D590*F590","v":0},"=",{"$f":"H590*MethGWP*10^-6","v":0},"=",{"$f":"J590/CO2_C","v":0}]
[null,"Alternate Method"]
[null,"Total miles of distribution pipeline","-->",null,"x",{"$f":"Control!$H$33","v":0},"=",{"$f":"D592*F592","v":0},"=",{"$f":"H592*MethGWP*10^-6","v":0},"=",{"$f":"J592/CO2_C","v":0}]
[]
[null,"Services"]
[null,"Total number of services","-->",null,"x",{"$f":"Control!$H$35","v":0},"=",{"$f":"D595*F595","v":0},"=",{"$f":"H595*MethGWP*10^-6","v":0},"=",{"$f":"J595/CO2_C","v":0}]
[null,"Number of unprotected steel services","-->",null,"x",{"$f":"Control!$H$36","v":0},"=",{"$f":"D596*F596","v":0},"=",{"$f":"H596*MethGWP*10^-6","v":0},"=",{"$f":"J596/CO2_C","v":0}]
[null,"Number of protected steel services","-->",null,"x",{"$f":"Control!$H$37","v":0},"=",{"$f":"D597*F597","v":0},"=",{"$f":"H597*MethGWP*10^-6","v":0},"=",{"$f":"J597/CO2_C","v":0}]
[null,"Total  ",null,null,null,null,null,{"$f":"SUM(H587:H597)","v":0},"=",{"$f":"H598*MethGWP*10^-6","v":0},"=",{"$f":"J598/CO2_C","v":0}]
[]
[null,"Natural Gas - Distribution",null,{"$f":"D582+1","v":2023}]
[]
[null,null,null,"Activity Data",null,"Emission Factor",null,"Metric Tons CH4",null,"MMTCO2E",null,"MMTCE"]
[null,"Distribution pipeline",null,null,null,"metric tons CH4 per year per activity unit"]
[null,"Preferred Method"]
[null,"Miles of cast iron distribution pipeline","-->",null,"x",{"$f":"Control!$H$28","v":0},"=",{"$f":"D605*F605","v":0},"=",{"$f":"H605*MethGWP*10^-6","v":0},"=",{"$f":"J605/CO2_C","v":0}]
[null,"Miles of unprotected steel distribution pipeline","-->",null,"x",{"$f":"Control!$H$29","v":0},"=",{"$f":"D606*F606","v":0},"=",{"$f":"H606*MethGWP*10^-6","v":0},"=",{"$f":"J606/CO2_C","v":0}]
[null,"Miles of protected steel distribution pipeline","-->",null,"x",{"$f":"Control!$H$30","v":0},"=",{"$f":"D607*F607","v":0},"=",{"$f":"H607*MethGWP*10^-6","v":0},"=",{"$f":"J607/CO2_C","v":0}]
[null,"Miles of plastic distribution pipeline","-->",null,"x",{"$f":"Control!$H$31","v":0},"=",{"$f":"D608*F608","v":0},"=",{"$f":"H608*MethGWP*10^-6","v":0},"=",{"$f":"J608/CO2_C","v":0}]
[null,"Alternate Method"]
[null,"Total miles of distribution pipeline","-->",null,"x",{"$f":"Control!$H$33","v":0},"=",{"$f":"D610*F610","v":0},"=",{"$f":"H610*MethGWP*10^-6","v":0},"=",{"$f":"J610/CO2_C","v":0}]
[]
[null,"Services"]
[null,"Total number of services","-->",null,"x",{"$f":"Control!$H$35","v":0},"=",{"$f":"D613*F613","v":0},"=",{"$f":"H613*MethGWP*10^-6","v":0},"=",{"$f":"J613/CO2_C","v":0}]
[null,"Number of unprotected steel services","-->",null,"x",{"$f":"Control!$H$36","v":0},"=",{"$f":"D614*F614","v":0},"=",{"$f":"H614*MethGWP*10^-6","v":0},"=",{"$f":"J614/CO2_C","v":0}]
[null,"Number of protected steel services","-->",null,"x",{"$f":"Control!$H$37","v":0},"=",{"$f":"D615*F615","v":0},"=",{"$f":"H615*MethGWP*10^-6","v":0},"=",{"$f":"J615/CO2_C","v":0}]
[null,"Total  ",null,null,null,null,null,{"$f":"SUM(H605:H615)","v":0},"=",{"$f":"H616*MethGWP*10^-6","v":0},"=",{"$f":"J616/CO2_C","v":0}]
[]
[null,"Natural Gas - Distribution",null,{"$f":"D600+1","v":2024}]
[]
[null,null,null,"Activity Data",null,"Emission Factor",null,"Metric Tons CH4",null,"MMTCO2E",null,"MMTCE"]
[null,"Distribution pipeline",null,null,null,"metric tons CH4 per year per activity unit"]
[null,"Preferred Method"]
[null,"Miles of cast iron distribution pipeline","-->",null,"x",{"$f":"Control!$H$28","v":0},"=",{"$f":"D623*F623","v":0},"=",{"$f":"H623*MethGWP*10^-6","v":0},"=",{"$f":"J623/CO2_C","v":0}]
[null,"Miles of unprotected steel distribution pipeline","-->",null,"x",{"$f":"Control!$H$29","v":0},"=",{"$f":"D624*F624","v":0},"=",{"$f":"H624*MethGWP*10^-6","v":0},"=",{"$f":"J624/CO2_C","v":0}]
[null,"Miles of protected steel distribution pipeline","-->",null,"x",{"$f":"Control!$H$30","v":0},"=",{"$f":"D625*F625","v":0},"=",{"$f":"H625*MethGWP*10^-6","v":0},"=",{"$f":"J625/CO2_C","v":0}]
[null,"Miles of plastic distribution pipeline","-->",null,"x",{"$f":"Control!$H$31","v":0},"=",{"$f":"D626*F626","v":0},"=",{"$f":"H626*MethGWP*10^-6","v":0},"=",{"$f":"J626/CO2_C","v":0}]
[null,"Alternate Method"]
[null,"Total miles of distribution pipeline","-->",null,"x",{"$f":"Control!$H$33","v":0},"=",{"$f":"D628*F628","v":0},"=",{"$f":"H628*MethGWP*10^-6","v":0},"=",{"$f":"J628/CO2_C","v":0}]
[]
[null,"Services"]
[null,"Total number of services","-->",null,"x",{"$f":"Control!$H$35","v":0},"=",{"$f":"D631*F631","v":0},"=",{"$f":"H631*MethGWP*10^-6","v":0},"=",{"$f":"J631/CO2_C","v":0}]
[null,"Number of unprotected steel services","-->",null,"x",{"$f":"Control!$H$36","v":0},"=",{"$f":"D632*F632","v":0},"=",{"$f":"H632*MethGWP*10^-6","v":0},"=",{"$f":"J632/CO2_C","v":0}]
[null,"Number of protected steel services","-->",null,"x",{"$f":"Control!$H$37","v":0},"=",{"$f":"D633*F633","v":0},"=",{"$f":"H633*MethGWP*10^-6","v":0},"=",{"$f":"J633/CO2_C","v":0}]
[null,"Total  ",null,null,null,null,null,{"$f":"SUM(H623:H633)","v":0},"=",{"$f":"H634*MethGWP*10^-6","v":0},"=",{"$f":"J634/CO2_C","v":0}]
[]
[null,"Natural Gas - Distribution",null,{"$f":"D618+1","v":2025}]
[]
[null,null,null,"Activity Data",null,"Emission Factor",null,"Metric Tons CH4",null,"MMTCO2E",null,"MMTCE"]
[null,"Distribution pipeline",null,null,null,"metric tons CH4 per year per activity unit"]
[null,"Preferred Method"]
[null,"Miles of cast iron distribution pipeline","-->",null,"x",{"$f":"Control!$H$28","v":0},"=",{"$f":"D641*F641","v":0},"=",{"$f":"H641*MethGWP*10^-6","v":0},"=",{"$f":"J641/CO2_C","v":0}]
[null,"Miles of unprotected steel distribution pipeline","-->",null,"x",{"$f":"Control!$H$29","v":0},"=",{"$f":"D642*F642","v":0},"=",{"$f":"H642*MethGWP*10^-6","v":0},"=",{"$f":"J642/CO2_C","v":0}]
[null,"Miles of protected steel distribution pipeline","-->",null,"x",{"$f":"Control!$H$30","v":0},"=",{"$f":"D643*F643","v":0},"=",{"$f":"H643*MethGWP*10^-6","v":0},"=",{"$f":"J643/CO2_C","v":0}]
[null,"Miles of plastic distribution pipeline","-->",null,"x",{"$f":"Control!$H$31","v":0},"=",{"$f":"D644*F644","v":0},"=",{"$f":"H644*MethGWP*10^-6","v":0},"=",{"$f":"J644/CO2_C","v":0}]
[null,"Alternate Method"]
[null,"Total miles of distribution pipeline","-->",null,"x",{"$f":"Control!$H$33","v":0},"=",{"$f":"D646*F646","v":0},"=",{"$f":"H646*MethGWP*10^-6","v":0},"=",{"$f":"J646/CO2_C","v":0}]
[]
[null,"Services"]
[null,"Total number of services","-->",null,"x",{"$f":"Control!$H$35","v":0},"=",{"$f":"D649*F649","v":0},"=",{"$f":"H649*MethGWP*10^-6","v":0},"=",{"$f":"J649/CO2_C","v":0}]
[null,"Number of unprotected steel services","-->",null,"x",{"$f":"Control!$H$36","v":0},"=",{"$f":"D650*F650","v":0},"=",{"$f":"H650*MethGWP*10^-6","v":0},"=",{"$f":"J650/CO2_C","v":0}]
[null,"Number of protected steel services","-->",null,"x",{"$f":"Control!$H$37","v":0},"=",{"$f":"D651*F651","v":0},"=",{"$f":"H651*MethGWP*10^-6","v":0},"=",{"$f":"J651/CO2_C","v":0}]
[null,"Total  ",null,null,null,null,null,{"$f":"SUM(H641:H651)","v":0},"=",{"$f":"H652*MethGWP*10^-6","v":0},"=",{"$f":"J652/CO2_C","v":0}]

{"sheet":"Natural Gas - Venting_Flaring","index":6,"n_rows":254,"n_cols":14,"rows_kept":254,"cut":false,"hidden":false,"merged":[]}
[null,{"$f":"\"5. Emissions from Natural Gas Venting and Flaring Activities in \"&ListData!D2","v":"5. Emissions from Natural Gas Venting and Flaring Activities in Select a State . . ."}]
[null,{"$f":"ListData!D2","v":"Select a State . . ."}]
[]
[null,"Natural Gas - Vented and Flared",null,1990]
[]
[null,null,null,"Activity Data",null,"Emission Factor",null,"Metric Tons CO2",null,"Percent Flared",null,"MMTCO2E",null,"MMTCE"]
[null,null,null,"Billion BTU",null,"metric tons CO2 per year billion BTU"]
[null,"Natural Gas Vented and Flared",null,null,"x",{"$f":"Control!$H$40","v":0},"=",{"$f":"D8*F8","v":0},"x",null,"=",{"$f":"N8*CO2_C","v":0},"=",{"$f":"(J8*H8*10^-6)/CO2_C","v":0}]
[null,"Total  "]
[]
[null,"Natural Gas - Vented and Flared",null,{"$f":"D4+1","v":1991}]
[]
[null,null,null,"Activity Data",null,"Emission Factor",null,"Metric Tons CO2",null,"Percent Flared",null,"MMTCO2E",null,"MMTCE"]
[null,null,null,"Billion BTU",null,"metric tons CO2 per year billion BTU"]
[null,"Natural Gas Vented and Flared",null,null,"x",{"$f":"Control!$H$40","v":0},"=",{"$f":"D15*F15","v":0},"x",null,"=",{"$f":"N15*CO2_C","v":0},"=",{"$f":"(J15*H15*10^-6)/CO2_C","v":0}]
[null,"Total  "]
[]
[null,"Natural Gas - Vented and Flared",null,1992]
[]
[null,null,null,"Activity Data",null,"Emission Factor",null,"Metric Tons CO2",null,"Percent Flared",null,"MMTCO2E",null,"MMTCE"]
[null,null,null,"Billion BTU",null,"metric tons CO2 per year billion BTU"]
[null,"Natural Gas Vented and Flared",null,null,"x",{"$f":"Control!$H$40","v":0},"=",{"$f":"D22*F22","v":0},"x",null,"=",{"$f":"N22*CO2_C","v":0},"=",{"$f":"(J22*H22*10^-6)/CO2_C","v":0}]
[null,"Total  "]
[]
[null,"Natural Gas - Vented and Flared",null,{"$f":"D18+1","v":1993}]
[]
[null,null,null,"Activity Data",null,"Emission Factor",null,"Metric Tons CO2",null,"Percent Flared",null,"MMTCO2E",null,"MMTCE"]
[null,null,null,"Billion BTU",null,"metric tons CO2 per year billion BTU"]
[null,"Natural Gas Vented and Flared",null,null,"x",{"$f":"Control!$H$40","v":0},"=",{"$f":"D29*F29","v":0},"x",null,"=",{"$f":"N29*CO2_C","v":0},"=",{"$f":"(J29*H29*10^-6)/CO2_C","v":0}]
[null,"Total  "]
[]
[null,"Natural Gas - Vented and Flared",null,{"$f":"D25+1","v":1994}]
[]
[null,null,null,"Activity Data",null,"Emission Factor",null,"Metric Tons CO2",null,"Percent Flared",null,"MMTCO2E",null,"MMTCE"]
[null,null,null,"Billion BTU",null,"metric tons CO2 per year billion BTU"]
[null,"Natural Gas Vented and Flared",null,null,"x",{"$f":"Control!$H$40","v":0},"=",{"$f":"D36*F36","v":0},"x",null,"=",{"$f":"N36*CO2_C","v":0},"=",{"$f":"(J36*H36*10^-6)/CO2_C","v":0}]
[null,"Total  "]
[]
[null,"Natural Gas - Vented and Flared",null,{"$f":"D32+1","v":1995}]
[]
[null,null,null,"Activity Data",null,"Emission Factor",null,"Metric Tons CO2",null,"Percent Flared",null,"MMTCO2E",null,"MMTCE"]
[null,null,null,"Billion BTU",null,"metric tons CO2 per year billion BTU"]
[null,"Natural Gas Vented and Flared",null,null,"x",{"$f":"Control!$H$40","v":0},"=",{"$f":"D43*F43","v":0},"x",null,"=",{"$f":"N43*CO2_C","v":0},"=",{"$f":"(J43*H43*10^-6)/CO2_C","v":0}]
[null,"Total  "]
[]
[null,"Natural Gas - Vented and Flared",null,{"$f":"D39+1","v":1996}]
[]
[null,null,null,"Activity Data",null,"Emission Factor",null,"Metric Tons CO2",null,"Percent Flared",null,"MMTCO2E",null,"MMTCE"]
[null,null,null,"Billion BTU",null,"metric tons CO2 per year billion BTU"]
[null,"Natural Gas Vented and Flared",null,null,"x",{"$f":"Control!$H$40","v":0},"=",{"$f":"D50*F50","v":0},"x",null,"=",{"$f":"N50*CO2_C","v":0},"=",{"$f":"(J50*H50*10^-6)/CO2_C","v":0}]
[null,"Total  "]
[]
[null,"Natural Gas - Vented and Flared",null,{"$f":"D46+1","v":1997}]
[]
[null,null,null,"Activity Data",null,"Emission Factor",null,"Metric Tons CO2",null,"Percent Flared",null,"MMTCO2E",null,"MMTCE"]
[null,null,null,"Billion BTU",null,"metric tons CO2 per year billion BTU"]
[null,"Natural Gas Vented and Flared",null,null,"x",{"$f":"Control!$H$40","v":0},"=",{"$f":"D57*F57","v":0},"x",null,"=",{"$f":"N57*CO2_C","v":0},"=",{"$f":"(J57*H57*10^-6)/CO2_C","v":0}]
[null,"Total  "]
[]
[null,"Natural Gas - Vented and Flared",null,{"$f":"D53+1","v":1998}]
[]
[null,null,null,"Activity Data",null,"Emission Factor",null,"Metric Tons CO2",null,"Percent Flared",null,"MMTCO2E",null,"MMTCE"]
[null,null,null,"Billion BTU",null,"metric tons CO2 per year billion BTU"]
[null,"Natural Gas Vented and Flared",null,null,"x",{"$f":"Control!$H$40","v":0},"=",{"$f":"D64*F64","v":0},"x",null,"=",{"$f":"N64*CO2_C","v":0},"=",{"$f":"(J64*H64*10^-6)/CO2_C","v":0}]
[null,"Total  "]
[]
[null,"Natural Gas - Vented and Flared",null,{"$f":"D60+1","v":1999}]
[]
[null,null,null,"Activity Data",null,"Emission Factor",null,"Metric Tons CO2",null,"Percent Flared",null,"MMTCO2E",null,"MMTCE"]
[null,null,null,"Billion BTU",null,"metric tons CO2 per year billion BTU"]
[null,"Natural Gas Vented and Flared",null,null,"x",{"$f":"Control!$H$40","v":0},"=",{"$f":"D71*F71","v":0},"x",null,"=",{"$f":"N71*CO2_C","v":0},"=",{"$f":"(J71*H71*10^-6)/CO2_C","v":0}]
[null,"Total  "]
[]
[null,"Natural Gas - Vented and Flared",null,{"$f":"D67+1","v":2000}]
[]
[null,null,null,"Activity Data",null,"Emission Factor",null,"Metric Tons CO2",null,"Percent Flared",null,"MMTCO2E",null,"MMTCE"]
[null,null,null,"Billion BTU",null,"metric tons CO2 per year billion BTU"]
[null,"Natural Gas Vented and Flared",null,null,"x",{"$f":"Control!$H$40","v":0},"=",{"$f":"D78*F78","v":0},"x",null,"=",{"$f":"N78*CO2_C","v":0},"=",{"$f":"(J78*H78*10^-6)/CO2_C","v":0}]
[null,"Total  "]
[]
[null,"Natural Gas - Vented and Flared",null,{"$f":"D74+1","v":2001}]
[]
[null,null,null,"Activity Data",null,"Emission Factor",null,"Metric Tons CO2",null,"Percent Flared",null,"MMTCO2E",null,"MMTCE"]
[null,null,null,"Billion BTU",null,"metric tons CO2 per year billion BTU"]
[null,"Natural Gas Vented and Flared",null,null,"x",{"$f":"Control!$H$40","v":0},"=",{"$f":"D85*F85","v":0},"x",null,"=",{"$f":"N85*CO2_C","v":0},"=",{"$f":"(J85*H85*10^-6)/CO2_C","v":0}]
[null,"Total  "]
[]
[null,"Natural Gas - Vented and Flared",null,{"$f":"D81+1","v":2002}]
[]
[null,null,null,"Activity Data",null,"Emission Factor",null,"Metric Tons CO2",null,"Percent Flared",null,"MMTCO2E",null,"MMTCE"]
[null,null,null,"Billion BTU",null,"metric tons CO2 per year billion BTU"]
[null,"Natural Gas Vented and Flared",null,null,"x",{"$f":"Control!$H$40","v":0},"=",{"$f":"D92*F92","v":0},"x",null,"=",{"$f":"N92*CO2_C","v":0},"=",{"$f":"(J92*H92*10^-6)/CO2_C","v":0}]
[null,"Total  "]
[]
[null,"Natural Gas - Vented and Flared",null,{"$f":"D88+1","v":2003}]
[]
[null,null,null,"Activity Data",null,"Emission Factor",null,"Metric Tons CO2",null,"Percent Flared",null,"MMTCO2E",null,"MMTCE"]
[null,null,null,"Billion BTU",null,"metric tons CO2 per year billion BTU"]
[null,"Natural Gas Vented and Flared",null,null,"x",{"$f":"Control!$H$40","v":0},"=",{"$f":"D99*F99","v":0},"x",null,"=",{"$f":"N99*CO2_C","v":0},"=",{"$f":"(J99*H99*10^-6)/CO2_C","v":0}]
[null,"Total  "]
[]
[null,"Natural Gas - Vented and Flared",null,{"$f":"D95+1","v":2004}]
[]
[null,null,null,"Activity Data",null,"Emission Factor",null,"Metric Tons CO2",null,"Percent Flared",null,"MMTCO2E",null,"MMTCE"]
[null,null,null,"Billion BTU",null,"metric tons CO2 per year billion BTU"]
[null,"Natural Gas Vented and Flared",null,null,"x",{"$f":"Control!$H$40","v":0},"=",{"$f":"D106*F106","v":0},"x",null,"=",{"$f":"N106*CO2_C","v":0},"=",{"$f":"(J106*H106*10^-6)/CO2_C","v":0}]
[null,"Total  "]
[]
[null,"Natural Gas - Vented and Flared",null,{"$f":"D102+1","v":2005}]
[]
[null,null,null,"Activity Data",null,"Emission Factor",null,"Metric Tons CO2",null,"Percent Flared",null,"MMTCO2E",null,"MMTCE"]
[null,null,null,"Billion BTU",null,"metric tons CO2 per year billion BTU"]
[null,"Natural Gas Vented and Flared",null,null,"x",{"$f":"Control!$H$40","v":0},"=",{"$f":"D113*F113","v":0},"x",null,"=",{"$f":"N113*CO2_C","v":0},"=",{"$f":"(J113*H113*10^-6)/CO2_C","v":0}]
[null,"Total  "]
[]
[null,"Natural Gas - Vented and Flared",null,{"$f":"D109+1","v":2006}]
[]
[null,null,null,"Activity Data",null,"Emission Factor",null,"Metric Tons CO2",null,"Percent Flared",null,"MMTCO2E",null,"MMTCE"]
[null,null,null,"Billion BTU",null,"metric tons CO2 per year billion BTU"]
[null,"Natural Gas Vented and Flared",null,null,"x",{"$f":"Control!$H$40","v":0},"=",{"$f":"D120*F120","v":0},"x",null,"=",{"$f":"N120*CO2_C","v":0},"=",{"$f":"(J120*H120*10^-6)/CO2_C","v":0}]
[null,"Total  "]
[]
[null,"Natural Gas - Vented and Flared",null,{"$f":"D116+1","v":2007}]
[]
[null,null,null,"Activity Data",null,"Emission Factor",null,"Metric Tons CO2",null,"Percent Flared",null,"MMTCO2E",null,"MMTCE"]
[null,null,null,"Billion BTU",null,"metric tons CO2 per year billion BTU"]
[null,"Natural Gas Vented and Flared",null,null,"x",{"$f":"Control!$H$40","v":0},"=",{"$f":"D127*F127","v":0},"x",null,"=",{"$f":"N127*CO2_C","v":0},"=",{"$f":"(J127*H127*10^-6)/CO2_C","v":0}]
[null,"Total  "]
[]
[null,"Natural Gas - Vented and Flared",null,{"$f":"D123+1","v":2008}]
[]
[null,null,null,"Activity Data",null,"Emission Factor",null,"Metric Tons CO2",null,"Percent Flared",null,"MMTCO2E",null,"MMTCE"]
[null,null,null,"Billion BTU",null,"metric tons CO2 per year billion BTU"]
[null,"Natural Gas Vented and Flared",null,null,"x",{"$f":"Control!$H$40","v":0},"=",{"$f":"D134*F134","v":0},"x",null,"=",{"$f":"N134*CO2_C","v":0},"=",{"$f":"(J134*H134*10^-6)/CO2_C","v":0}]
[null,"Total  "]
[]
[null,"Natural Gas - Vented and Flared",null,{"$f":"D130+1","v":2009}]
[]
[null,null,null,"Activity Data",null,"Emission Factor",null,"Metric Tons CO2",null,"Percent Flared",null,"MMTCO2E",null,"MMTCE"]
[null,null,null,"Billion BTU",null,"metric tons CO2 per year billion BTU"]
[null,"Natural Gas Vented and Flared",null,null,"x",{"$f":"Control!$H$40","v":0},"=",{"$f":"D141*F141","v":0},"x",null,"=",{"$f":"N141*CO2_C","v":0},"=",{"$f":"(J141*H141*10^-6)/CO2_C","v":0}]
[null,"Total  "]
[]
[null,"Natural Gas - Vented and Flared",null,{"$f":"D137+1","v":2010}]
[]
[null,null,null,"Activity Data",null,"Emission Factor",null,"Metric Tons CO2",null,"Percent Flared",null,"MMTCO2E",null,"MMTCE"]
[null,null,null,"Billion BTU",null,"metric tons CO2 per year billion BTU"]
[null,"Natural Gas Vented and Flared",null,null,"x",{"$f":"Control!$H$40","v":0},"=",{"$f":"D148*F148","v":0},"x",null,"=",{"$f":"N148*CO2_C","v":0},"=",{"$f":"(J148*H148*10^-6)/CO2_C","v":0}]
[null,"Total  "]
[]
[null,"Natural Gas - Vented and Flared",null,{"$f":"D144+1","v":2011}]
[]
[null,null,null,"Activity Data",null,"Emission Factor",null,"Metric Tons CO2",null,"Percent Flared",null,"MMTCO2E",null,"MMTCE"]
[null,null,null,"Billion BTU",null,"metric tons CO2 per year billion BTU"]
[null,"Natural Gas Vented and Flared",null,null,"x",{"$f":"Control!$H$40","v":0},"=",{"$f":"D155*F155","v":0},"x",null,"=",{"$f":"N155*CO2_C","v":0},"=",{"$f":"(J155*H155*10^-6)/CO2_C","v":0}]
[null,"Total  "]
[]
[null,"Natural Gas - Vented and Flared",null,{"$f":"D151+1","v":2012}]
[]
[null,null,null,"Activity Data",null,"Emission Factor",null,"Metric Tons CO2",null,"Percent Flared",null,"MMTCO2E",null,"MMTCE"]
[null,null,null,"Billion BTU",null,"metric tons CO2 per year billion BTU"]
[null,"Natural Gas Vented and Flared",null,null,"x",{"$f":"Control!$H$40","v":0},"=",{"$f":"D162*F162","v":0},"x",null,"=",{"$f":"N162*CO2_C","v":0},"=",{"$f":"(J162*H162*10^-6)/CO2_C","v":0}]
[null,"Total  "]
[]
[null,"Natural Gas - Vented and Flared",null,{"$f":"D158+1","v":2013}]
[]
[null,null,null,"Activity Data",null,"Emission Factor",null,"Metric Tons CO2",null,"Percent Flared",null,"MMTCO2E",null,"MMTCE"]
[null,null,null,"Billion BTU",null,"metric tons CO2 per year billion BTU"]
[null,"Natural Gas Vented and Flared",null,null,"x",{"$f":"Control!$H$40","v":0},"=",{"$f":"D169*F169","v":0},"x",null,"=",{"$f":"N169*CO2_C","v":0},"=",{"$f":"(J169*H169*10^-6)/CO2_C","v":0}]
[null,"Total  "]
[]
[null,"Natural Gas - Vented and Flared",null,{"$f":"D165+1","v":2014}]
[]
[null,null,null,"Activity Data",null,"Emission Factor",null,"Metric Tons CO2",null,"Percent Flared",null,"MMTCO2E",null,"MMTCE"]
[null,null,null,"Billion BTU",null,"metric tons CO2 per year billion BTU"]
[null,"Natural Gas Vented and Flared",null,null,"x",{"$f":"Control!$H$40","v":0},"=",{"$f":"D176*F176","v":0},"x",null,"=",{"$f":"N176*CO2_C","v":0},"=",{"$f":"(J176*H176*10^-6)/CO2_C","v":0}]
[null,"Total  "]
[]
[null,"Natural Gas - Vented and Flared",null,{"$f":"D172+1","v":2015}]
[]
[null,null,null,"Activity Data",null,"Emission Factor",null,"Metric Tons CO2",null,"Percent Flared",null,"MMTCO2E",null,"MMTCE"]
[null,null,null,"Billion BTU",null,"metric tons CO2 per year billion BTU"]
[null,"Natural Gas Vented and Flared",null,null,"x",{"$f":"Control!$H$40","v":0},"=",{"$f":"D183*F183","v":0},"x",null,"=",{"$f":"N183*CO2_C","v":0},"=",{"$f":"(J183*H183*10^-6)/CO2_C","v":0}]
[null,"Total  "]
[]
[null,"Natural Gas - Vented and Flared",null,{"$f":"D179+1","v":2016}]
[]
[null,null,null,"Activity Data",null,"Emission Factor",null,"Metric Tons CO2",null,"Percent Flared",null,"MMTCO2E",null,"MMTCE"]
[null,null,null,"Billion BTU",null,"metric tons CO2 per year billion BTU"]
[null,"Natural Gas Vented and Flared",null,null,"x",{"$f":"Control!$H$40","v":0},"=",{"$f":"D190*F190","v":0},"x",null,"=",{"$f":"N190*CO2_C","v":0},"=",{"$f":"(J190*H190*10^-6)/CO2_C","v":0}]
[null,"Total  "]
[]
[null,"Natural Gas - Vented and Flared",null,{"$f":"D186+1","v":2017}]
[]
[null,null,null,"Activity Data",null,"Emission Factor",null,"Metric Tons CO2",null,"Percent Flared",null,"MMTCO2E",null,"MMTCE"]
[null,null,null,"Billion BTU",null,"metric tons CO2 per year billion BTU"]
[null,"Natural Gas Vented and Flared",null,null,"x",{"$f":"Control!$H$40","v":0},"=",{"$f":"D197*F197","v":0},"x",null,"=",{"$f":"N197*CO2_C","v":0},"=",{"$f":"(J197*H197*10^-6)/CO2_C","v":0}]
[null,"Total  "]
[]
[null,"Natural Gas - Vented and Flared",null,{"$f":"D193+1","v":2018}]
[]
[null,null,null,"Activity Data",null,"Emission Factor",null,"Metric Tons CO2",null,"Percent Flared",null,"MMTCO2E",null,"MMTCE"]
[null,null,null,"Billion BTU",null,"metric tons CO2 per year billion BTU"]
[null,"Natural Gas Vented and Flared",null,null,"x",{"$f":"Control!$H$40","v":0},"=",{"$f":"D204*F204","v":0},"x",null,"=",{"$f":"N204*CO2_C","v":0},"=",{"$f":"(J204*H204*10^-6)/CO2_C","v":0}]
[null,"Total  "]
[]
[null,"Natural Gas - Vented and Flared",null,{"$f":"D200+1","v":2019}]
[]
[null,null,null,"Activity Data",null,"Emission Factor",null,"Metric Tons CO2",null,"Percent Flared",null,"MMTCO2E",null,"MMTCE"]
[null,null,null,"Billion BTU",null,"metric tons CO2 per year billion BTU"]
[null,"Natural Gas Vented and Flared",null,null,"x",{"$f":"Control!$H$40","v":0},"=",{"$f":"D211*F211","v":0},"x",null,"=",{"$f":"N211*CO2_C","v":0},"=",{"$f":"(J211*H211*10^-6)/CO2_C","v":0}]
[null,"Total  "]
[]
[null,"Natural Gas - Vented and Flared",null,{"$f":"D207+1","v":2020}]
[]
[null,null,null,"Activity Data",null,"Emission Factor",null,"Metric Tons CO2",null,"Percent Flared",null,"MMTCO2E",null,"MMTCE"]
[null,null,null,"Billion BTU",null,"metric tons CO2 per year billion BTU"]
[null,"Natural Gas Vented and Flared",null,null,"x",{"$f":"Control!$H$40","v":0},"=",{"$f":"D218*F218","v":0},"x",null,"=",{"$f":"N218*CO2_C","v":0},"=",{"$f":"(J218*H218*10^-6)/CO2_C","v":0}]
[null,"Total  "]
[]
[null,"Natural Gas - Vented and Flared",null,{"$f":"D214+1","v":2021}]
[]
[null,null,null,"Activity Data",null,"Emission Factor",null,"Metric Tons CO2",null,"Percent Flared",null,"MMTCO2E",null,"MMTCE"]
[null,null,null,"Billion BTU",null,"metric tons CO2 per year billion BTU"]
[null,"Natural Gas Vented and Flared",null,null,"x",{"$f":"Control!$H$40","v":0},"=",{"$f":"D225*F225","v":0},"x",null,"=",{"$f":"N225*CO2_C","v":0},"=",{"$f":"(J225*H225*10^-6)/CO2_C","v":0}]
[null,"Total  "]
[]
[null,"Natural Gas - Vented and Flared",null,{"$f":"D221+1","v":2022}]
[]
[null,null,null,"Activity Data",null,"Emission Factor",null,"Metric Tons CO2",null,"Percent Flared",null,"MMTCO2E",null,"MMTCE"]
[null,null,null,"Billion BTU",null,"metric tons CO2 per year billion BTU"]
[null,"Natural Gas Vented and Flared",null,null,"x",{"$f":"Control!$H$40","v":0},"=",{"$f":"D232*F232","v":0},"x",null,"=",{"$f":"N232*CO2_C","v":0},"=",{"$f":"(J232*H232*10^-6)/CO2_C","v":0}]
[null,"Total  "]
[]
[null,"Natural Gas - Vented and Flared",null,{"$f":"D228+1","v":2023}]
[]
[null,null,null,"Activity Data",null,"Emission Factor",null,"Metric Tons CO2",null,"Percent Flared",null,"MMTCO2E",null,"MMTCE"]
[null,null,null,"Billion BTU",null,"metric tons CO2 per year billion BTU"]
[null,"Natural Gas Vented and Flared",null,null,"x",{"$f":"Control!$H$40","v":0},"=",{"$f":"D239*F239","v":0},"x",null,"=",{"$f":"N239*CO2_C","v":0},"=",{"$f":"(J239*H239*10^-6)/CO2_C","v":0}]
[null,"Total  "]
[]
[null,"Natural Gas - Vented and Flared",null,{"$f":"D235+1","v":2024}]
[]
[null,null,null,"Activity Data",null,"Emission Factor",null,"Metric Tons CO2",null,"Percent Flared",null,"MMTCO2E",null,"MMTCE"]
[null,null,null,"Billion BTU",null,"metric tons CO2 per year billion BTU"]
[null,"Natural Gas Vented and Flared",null,null,"x",{"$f":"Control!$H$40","v":0},"=",{"$f":"D246*F246","v":0},"x",null,"=",{"$f":"N246*CO2_C","v":0},"=",{"$f":"(J246*H246*10^-6)/CO2_C","v":0}]
[null,"Total  "]
[]
[null,"Natural Gas - Vented and Flared",null,{"$f":"D242+1","v":2025}]
[]
[null,null,null,"Activity Data",null,"Emission Factor",null,"Metric Tons CO2",null,"Percent Flared",null,"MMTCO2E",null,"MMTCE"]
[null,null,null,"Billion BTU",null,"metric tons CO2 per year billion BTU"]
[null,"Natural Gas Vented and Flared",null,null,"x",{"$f":"Control!$H$40","v":0},"=",{"$f":"D253*F253","v":0},"x",null,"=",{"$f":"N253*CO2_C","v":0},"=",{"$f":"(J253*H253*10^-6)/CO2_C","v":0}]
[null,"Total  "]

{"sheet":"Petroleum Systems","index":7,"n_rows":326,"n_cols":12,"rows_kept":326,"cut":false,"hidden":false,"merged":[[2,1,2,2]]}
[null,{"$f":"\"6. Emissions from Petroleum Production, Refining, and Transportation in \"&ListData!D2","v":"6. Emissions from Petroleum Production, Refining, and Transportation in Select a State . . ."}]
[null,{"$f":"VLOOKUP(StateID,ListData!$B$3:$D$53,3,FALSE)","v":"XX"}]
[]
[null,"Petroleum Systems",null,1990]
[]
[null,null,null,"Activity Data",null,"Emission Factor",null,"Metric Tons CH4",null,"MMTCO2E",null,"MMTCE"]
[null,null,null,"'000 barrels",null,"kg CH4 per year per 1000 bbl"]
[null,"Oil Production",null,null,"x",{"$f":"IF(ISNUMBER(OilProdFactor),OilProdFactor,VLOOKUP(D4,OilEFs,8,FALSE))","v":605.78295265085467},"=",{"$f":"D8*F8/Control!$D$75","v":0},"=",{"$f":"H8*MethGWP*10^-6","v":0},"=",{"$f":"J8/CO2_C","v":0}]
[null,"Oil Refining",null,null,"x",{"$f":"IF(ISNUMBER(OilRefFactor),OilRefFactor,VLOOKUP(D4,OilEFs,9,FALSE))","v":5.2595377052268848},"=",{"$f":"D9*F9/Control!$D$75","v":0},"=",{"$f":"H9*MethGWP*10^-6","v":0},"=",{"$f":"J9/CO2_C","v":0}]
[null,"Oil Transportation",null,null,"x",{"$f":"IF(ISNUMBER(OilTransFactor),OilTransFactor,VLOOKUP(D4,OilEFs,10,FALSE))","v":1.3383836852029414},"=",{"$f":"D10*F10/Control!$D$75","v":0},"=",{"$f":"H10*MethGWP*10^-6","v":0},"=",{"$f":"J10/CO2_C","v":0}]
[null,"Total  ",null,null,null,null,null,{"$f":"SUM(H8:H10)","v":0},null,{"$f":"H11*MethGWP*10^-6","v":0},"=",{"$f":"J11/CO2_C","v":0}]
[]
[null,"Petroleum Systems",null,{"$f":"D4+1","v":1991}]
[]
[null,null,null,"Activity Data",null,"Emission Factor",null,"Metric Tons CH4",null,"MMTCO2E",null,"MMTCE"]
[null,null,null,"'000 barrels",null,"kg CH4 per year per 1000 bbl"]
[null,"Oil Production",null,null,"x",{"$f":"IF(ISNUMBER(OilProdFactor),OilProdFactor,VLOOKUP(D13,OilEFs,8,FALSE))","v":602.04275402612427},"=",{"$f":"D17*F17/Control!$D$75","v":0},"=",{"$f":"H17*MethGWP*10^-6","v":0},"=",{"$f":"J17/CO2_C","v":0}]
[null,"Oil Refining",null,null,"x",{"$f":"IF(ISNUMBER(OilRefFactor),OilRefFactor,VLOOKUP(D13,OilEFs,9,FALSE))","v":5.2595377052268857},"=",{"$f":"D18*F18/Control!$D$75","v":0},"=",{"$f":"H18*MethGWP*10^-6","v":0},"=",{"$f":"J18/CO2_C","v":0}]
[null,"Oil Transportation",null,null,"x",{"$f":"IF(ISNUMBER(OilTransFactor),OilTransFactor,VLOOKUP(D13,OilEFs,10,FALSE))","v":1.3406876546932398},"=",{"$f":"D19*F19/Control!$D$75","v":0},"=",{"$f":"H19*MethGWP*10^-6","v":0},"=",{"$f":"J19/CO2_C","v":0}]
[null,"Total  ",null,null,null,null,null,{"$f":"SUM(H17:H19)","v":0},null,{"$f":"H20*MethGWP*10^-6","v":0},"=",{"$f":"J20/CO2_C","v":0}]
[]
[null,"Petroleum Systems",null,{"$f":"D13+1","v":1992}]
[]
[null,null,null,"Activity Data",null,"Emission Factor",null,"Metric Tons CH4",null,"MMTCO2E",null,"MMTCE"]
[null,null,null,"'000 barrels",null,"kg CH4 per year per 1000 bbl"]
[null,"Oil Production",null,null,"x",{"$f":"IF(ISNUMBER(OilProdFactor),OilProdFactor,VLOOKUP(D22,OilEFs,8,FALSE))","v":608.67113510403794},"=",{"$f":"D26*F26/Control!$D$75","v":0},"=",{"$f":"H26*MethGWP*10^-6","v":0},"=",{"$f":"J26/CO2_C","v":0}]
[null,"Oil Refining",null,null,"x",{"$f":"IF(ISNUMBER(OilRefFactor),OilRefFactor,VLOOKUP(D22,OilEFs,9,FALSE))","v":5.2595377052268848},"=",{"$f":"D27*F27/Control!$D$75","v":0},"=",{"$f":"H27*MethGWP*10^-6","v":0},"=",{"$f":"J27/CO2_C","v":0}]
[null,"Oil Transportation",null,null,"x",{"$f":"IF(ISNUMBER(OilTransFactor),OilTransFactor,VLOOKUP(D22,OilEFs,10,FALSE))","v":1.2860180485953423},"=",{"$f":"D28*F28/Control!$D$75","v":0},"=",{"$f":"H28*MethGWP*10^-6","v":0},"=",{"$f":"J28/CO2_C","v":0}]
[null,"Total  ",null,null,null,null,null,{"$f":"SUM(H26:H28)","v":0},null,{"$f":"H29*MethGWP*10^-6","v":0},"=",{"$f":"J29/CO2_C","v":0}]
[]
[null,"Petroleum Systems",null,{"$f":"D22+1","v":1993}]
[]
[null,null,null,"Activity Data",null,"Emission Factor",null,"Metric Tons CH4",null,"MMTCO2E",null,"MMTCE"]
[null,null,null,"'000 barrels",null,"kg CH4 per year per 1000 bbl"]
[null,"Oil Production",null,null,"x",{"$f":"IF(ISNUMBER(OilProdFactor),OilProdFactor,VLOOKUP(D31,OilEFs,8,FALSE))","v":638.53562528645875},"=",{"$f":"D35*F35/Control!$D$75","v":0},"=",{"$f":"H35*MethGWP*10^-6","v":0},"=",{"$f":"J35/CO2_C","v":0}]
[null,"Oil Refining",null,null,"x",{"$f":"IF(ISNUMBER(OilRefFactor),OilRefFactor,VLOOKUP(D31,OilEFs,9,FALSE))","v":5.2595377052268839},"=",{"$f":"D36*F36/Control!$D$75","v":0},"=",{"$f":"H36*MethGWP*10^-6","v":0},"=",{"$f":"J36/CO2_C","v":0}]
[null,"Oil Transportation",null,null,"x",{"$f":"IF(ISNUMBER(OilTransFactor),OilTransFactor,VLOOKUP(D31,OilEFs,10,FALSE))","v":1.2452533999508593},"=",{"$f":"D37*F37/Control!$D$75","v":0},"=",{"$f":"H37*MethGWP*10^-6","v":0},"=",{"$f":"J37/CO2_C","v":0}]
[null,"Total  ",null,null,null,null,null,{"$f":"SUM(H35:H37)","v":0},null,{"$f":"H38*MethGWP*10^-6","v":0},"=",{"$f":"J38/CO2_C","v":0}]
[]
[null,"Petroleum Systems",null,{"$f":"D31+1","v":1994}]
[]
[null,null,null,"Activity Data",null,"Emission Factor",null,"Metric Tons CH4",null,"MMTCO2E",null,"MMTCE"]
[null,null,null,"'000 barrels",null,"kg CH4 per year per 1000 bbl"]
[null,"Oil Production",null,null,"x",{"$f":"IF(ISNUMBER(OilProdFactor),OilProdFactor,VLOOKUP(D40,OilEFs,8,FALSE))","v":652.59851059595644},"=",{"$f":"D44*F44/Control!$D$75","v":0},"=",{"$f":"H44*MethGWP*10^-6","v":0},"=",{"$f":"J44/CO2_C","v":0}]
[null,"Oil Refining",null,null,"x",{"$f":"IF(ISNUMBER(OilRefFactor),OilRefFactor,VLOOKUP(D40,OilEFs,9,FALSE))","v":5.2595377052268839},"=",{"$f":"D45*F45/Control!$D$75","v":0},"=",{"$f":"H45*MethGWP*10^-6","v":0},"=",{"$f":"J45/CO2_C","v":0}]
[null,"Oil Transportation",null,null,"x",{"$f":"IF(ISNUMBER(OilTransFactor),OilTransFactor,VLOOKUP(D40,OilEFs,10,FALSE))","v":1.2001862457906649},"=",{"$f":"D46*F46/Control!$D$75","v":0},"=",{"$f":"H46*MethGWP*10^-6","v":0},"=",{"$f":"J46/CO2_C","v":0}]
[null,"Total  ",null,null,null,null,null,{"$f":"SUM(H44:H46)","v":0},null,{"$f":"H47*MethGWP*10^-6","v":0},"=",{"$f":"J47/CO2_C","v":0}]
[]
[null,"Petroleum Systems",null,{"$f":"D40+1","v":1995}]
[]
[null,null,null,"Activity Data",null,"Emission Factor",null,"Metric Tons CH4",null,"MMTCO2E",null,"MMTCE"]
[null,null,null,"'000 barrels",null,"kg CH4 per year per 1000 bbl"]
[null,"Oil Production",null,null,"x",{"$f":"IF(ISNUMBER(OilProdFactor),OilProdFactor,VLOOKUP(D49,OilEFs,8,FALSE))","v":668.0481097384278},"=",{"$f":"D53*F53/Control!$D$75","v":0},"=",{"$f":"H53*MethGWP*10^-6","v":0},"=",{"$f":"J53/CO2_C","v":0}]
[null,"Oil Refining",null,null,"x",{"$f":"IF(ISNUMBER(OilRefFactor),OilRefFactor,VLOOKUP(D49,OilEFs,9,FALSE))","v":5.2595377052268857},"=",{"$f":"D54*F54/Control!$D$75","v":0},"=",{"$f":"H54*MethGWP*10^-6","v":0},"=",{"$f":"J54/CO2_C","v":0}]
[null,"Oil Transportation",null,null,"x",{"$f":"IF(ISNUMBER(OilTransFactor),OilTransFactor,VLOOKUP(D49,OilEFs,10,FALSE))","v":1.1705425668747527},"=",{"$f":"D55*F55/Control!$D$75","v":0},"=",{"$f":"H55*MethGWP*10^-6","v":0},"=",{"$f":"J55/CO2_C","v":0}]
[null,"Total  ",null,null,null,null,null,{"$f":"SUM(H53:H55)","v":0},null,{"$f":"H56*MethGWP*10^-6","v":0},"=",{"$f":"J56/CO2_C","v":0}]
[]
[null,"Petroleum Systems",null,{"$f":"D49+1","v":1996}]
[]
[null,null,null,"Activity Data",null,"Emission Factor",null,"Metric Tons CH4",null,"MMTCO2E",null,"MMTCE"]
[null,null,null,"'000 barrels",null,"kg CH4 per year per 1000 bbl"]
[null,"Oil Production",null,null,"x",{"$f":"IF(ISNUMBER(OilProdFactor),OilProdFactor,VLOOKUP(D58,OilEFs,8,FALSE))","v":697.53983358910534},"=",{"$f":"D62*F62/Control!$D$75","v":0},"=",{"$f":"H62*MethGWP*10^-6","v":0},"=",{"$f":"J62/CO2_C","v":0}]
[null,"Oil Refining",null,null,"x",{"$f":"IF(ISNUMBER(OilRefFactor),OilRefFactor,VLOOKUP(D58,OilEFs,9,FALSE))","v":5.2595377052268857},"=",{"$f":"D63*F63/Control!$D$75","v":0},"=",{"$f":"H63*MethGWP*10^-6","v":0},"=",{"$f":"J63/CO2_C","v":0}]
[null,"Oil Transportation",null,null,"x",{"$f":"IF(ISNUMBER(OilTransFactor),OilTransFactor,VLOOKUP(D58,OilEFs,10,FALSE))","v":1.1433421118873865},"=",{"$f":"D64*F64/Control!$D$75","v":0},"=",{"$f":"H64*MethGWP*10^-6","v":0},"=",{"$f":"J64/CO2_C","v":0}]
[null,"Total  ",null,null,null,null,null,{"$f":"SUM(H62:H64)","v":0},null,{"$f":"H65*MethGWP*10^-6","v":0},"=",{"$f":"J65/CO2_C","v":0}]
[]
[null,"Petroleum Systems",null,{"$f":"D58+1","v":1997}]
[]
[null,null,null,"Activity Data",null,"Emission Factor",null,"Metric Tons CH4",null,"MMTCO2E",null,"MMTCE"]
[null,null,null,"'000 barrels",null,"kg CH4 per year per 1000 bbl"]
[null,"Oil Production",null,null,"x",{"$f":"IF(ISNUMBER(OilProdFactor),OilProdFactor,VLOOKUP(D67,OilEFs,8,FALSE))","v":703.4508083082618},"=",{"$f":"D71*F71/Control!$D$75","v":0},"=",{"$f":"H71*MethGWP*10^-6","v":0},"=",{"$f":"J71/CO2_C","v":0}]
[null,"Oil Refining",null,null,"x",{"$f":"IF(ISNUMBER(OilRefFactor),OilRefFactor,VLOOKUP(D67,OilEFs,9,FALSE))","v":5.2595377052268848},"=",{"$f":"D72*F72/Control!$D$75","v":0},"=",{"$f":"H72*MethGWP*10^-6","v":0},"=",{"$f":"J72/CO2_C","v":0}]
[null,"Oil Transportation",null,null,"x",{"$f":"IF(ISNUMBER(OilTransFactor),OilTransFactor,VLOOKUP(D67,OilEFs,10,FALSE))","v":1.1040938570455034},"=",{"$f":"D73*F73/Control!$D$75","v":0},"=",{"$f":"H73*MethGWP*10^-6","v":0},"=",{"$f":"J73/CO2_C","v":0}]
[null,"Total  ",null,null,null,null,null,{"$f":"SUM(H71:H73)","v":0},null,{"$f":"H74*MethGWP*10^-6","v":0},"=",{"$f":"J74/CO2_C","v":0}]
[]
[null,"Petroleum Systems",null,{"$f":"D67+1","v":1998}]
[]
[null,null,null,"Activity Data",null,"Emission Factor",null,"Metric Tons CH4",null,"MMTCO2E",null,"MMTCE"]
[null,null,null,"'000 barrels",null,"kg CH4 per year per 1000 bbl"]
[null,"Oil Production",null,null,"x",{"$f":"IF(ISNUMBER(OilProdFactor),OilProdFactor,VLOOKUP(D76,OilEFs,8,FALSE))","v":709.44658155563343},"=",{"$f":"D80*F80/Control!$D$75","v":0},"=",{"$f":"H80*MethGWP*10^-6","v":0},"=",{"$f":"J80/CO2_C","v":0}]
[null,"Oil Refining",null,null,"x",{"$f":"IF(ISNUMBER(OilRefFactor),OilRefFactor,VLOOKUP(D76,OilEFs,9,FALSE))","v":5.2595377052268839},"=",{"$f":"D81*F81/Control!$D$75","v":0},"=",{"$f":"H81*MethGWP*10^-6","v":0},"=",{"$f":"J81/CO2_C","v":0}]
[null,"Oil Transportation",null,null,"x",{"$f":"IF(ISNUMBER(OilTransFactor),OilTransFactor,VLOOKUP(D76,OilEFs,10,FALSE))","v":1.0940785391995074},"=",{"$f":"D82*F82/Control!$D$75","v":0},"=",{"$f":"H82*MethGWP*10^-6","v":0},"=",{"$f":"J82/CO2_C","v":0}]
[null,"Total  ",null,null,null,null,null,{"$f":"SUM(H80:H82)","v":0},null,{"$f":"H83*MethGWP*10^-6","v":0},"=",{"$f":"J83/CO2_C","v":0}]
[]
[null,"Petroleum Systems",null,{"$f":"D76+1","v":1999}]
[]
[null,null,null,"Activity Data",null,"Emission Factor",null,"Metric Tons CH4",null,"MMTCO2E",null,"MMTCE"]
[null,null,null,"'000 barrels",null,"kg CH4 per year per 1000 bbl"]
[null,"Oil Production",null,null,"x",{"$f":"IF(ISNUMBER(OilProdFactor),OilProdFactor,VLOOKUP(D85,OilEFs,8,FALSE))","v":734.87410177474283},"=",{"$f":"D89*F89/Control!$D$75","v":0},"=",{"$f":"H89*MethGWP*10^-6","v":0},"=",{"$f":"J89/CO2_C","v":0}]
[null,"Oil Refining",null,null,"x",{"$f":"IF(ISNUMBER(OilRefFactor),OilRefFactor,VLOOKUP(D85,OilEFs,9,FALSE))","v":5.2595377052268848},"=",{"$f":"D90*F90/Control!$D$75","v":0},"=",{"$f":"H90*MethGWP*10^-6","v":0},"=",{"$f":"J90/CO2_C","v":0}]
[null,"Oil Transportation",null,null,"x",{"$f":"IF(ISNUMBER(OilTransFactor),OilTransFactor,VLOOKUP(D85,OilEFs,10,FALSE))","v":1.0245807835615286},"=",{"$f":"D91*F91/Control!$D$75","v":0},"=",{"$f":"H91*MethGWP*10^-6","v":0},"=",{"$f":"J91/CO2_C","v":0}]
[null,"Total  ",null,null,null,null,null,{"$f":"SUM(H89:H91)","v":0},null,{"$f":"H92*MethGWP*10^-6","v":0},"=",{"$f":"J92/CO2_C","v":0}]
[]
[null,"Petroleum Systems",null,{"$f":"D85+1","v":2000}]
[]
[null,null,null,"Activity Data",null,"Emission Factor",null,"Metric Tons CH4",null,"MMTCO2E",null,"MMTCE"]
[null,null,null,"'000 barrels",null,"kg CH4 per year per 1000 bbl"]
[null,"Oil Production",null,null,"x",{"$f":"IF(ISNUMBER(OilProdFactor),OilProdFactor,VLOOKUP(D94,OilEFs,8,FALSE))","v":744.22591161868638},"=",{"$f":"D98*F98/Control!$D$75","v":0},"=",{"$f":"H98*MethGWP*10^-6","v":0},"=",{"$f":"J98/CO2_C","v":0}]
[null,"Oil Refining",null,null,"x",{"$f":"IF(ISNUMBER(OilRefFactor),OilRefFactor,VLOOKUP(D94,OilEFs,9,FALSE))","v":5.2595377052268848},"=",{"$f":"D99*F99/Control!$D$75","v":0},"=",{"$f":"H99*MethGWP*10^-6","v":0},"=",{"$f":"J99/CO2_C","v":0}]
[null,"Oil Transportation",null,null,"x",{"$f":"IF(ISNUMBER(OilTransFactor),OilTransFactor,VLOOKUP(D94,OilEFs,10,FALSE))","v":0.94212558271218494},"=",{"$f":"D100*F100/Control!$D$75","v":0},"=",{"$f":"H100*MethGWP*10^-6","v":0},"=",{"$f":"J100/CO2_C","v":0}]
[null,"Total  ",null,null,null,null,null,{"$f":"SUM(H98:H100)","v":0},null,{"$f":"H101*MethGWP*10^-6","v":0},"=",{"$f":"J101/CO2_C","v":0}]
[]
[null,"Petroleum Systems",null,{"$f":"D94+1","v":2001}]
[]
[null,null,null,"Activity Data",null,"Emission Factor",null,"Metric Tons CH4",null,"MMTCO2E",null,"MMTCE"]
[null,null,null,"'000 barrels",null,"kg CH4 per year per 1000 bbl"]
[null,"Oil Production",null,null,"x",{"$f":"IF(ISNUMBER(OilProdFactor),OilProdFactor,VLOOKUP(D103,OilEFs,8,FALSE))","v":748.17449277209619},"=",{"$f":"D107*F107/Control!$D$75","v":0},"=",{"$f":"H107*MethGWP*10^-6","v":0},"=",{"$f":"J107/CO2_C","v":0}]
[null,"Oil Refining",null,null,"x",{"$f":"IF(ISNUMBER(OilRefFactor),OilRefFactor,VLOOKUP(D103,OilEFs,9,FALSE))","v":5.2595377052268839},"=",{"$f":"D108*F108/Control!$D$75","v":0},"=",{"$f":"H108*MethGWP*10^-6","v":0},"=",{"$f":"J108/CO2_C","v":0}]
[null,"Oil Transportation",null,null,"x",{"$f":"IF(ISNUMBER(OilTransFactor),OilTransFactor,VLOOKUP(D103,OilEFs,10,FALSE))","v":0.93433485101854596},"=",{"$f":"D109*F109/Control!$D$75","v":0},"=",{"$f":"H109*MethGWP*10^-6","v":0},"=",{"$f":"J109/CO2_C","v":0}]
[null,"Total  ",null,null,null,null,null,{"$f":"SUM(H107:H109)","v":0},null,{"$f":"H110*MethGWP*10^-6","v":0},"=",{"$f":"J110/CO2_C","v":0}]
[]
[null,"Petroleum Systems",null,{"$f":"D103+1","v":2002}]
[]
[null,null,null,"Activity Data",null,"Emission Factor",null,"Metric Tons CH4",null,"MMTCO2E",null,"MMTCE"]
[null,null,null,"'000 barrels",null,"kg CH4 per year per 1000 bbl"]
[null,"Oil Production",null,null,"x",{"$f":"IF(ISNUMBER(OilProdFactor),OilProdFactor,VLOOKUP(D112,OilEFs,8,FALSE))","v":752.41414681501533},"=",{"$f":"D116*F116/Control!$D$75","v":0},"=",{"$f":"H116*MethGWP*10^-6","v":0},"=",{"$f":"J116/CO2_C","v":0}]
[null,"Oil Refining",null,null,"x",{"$f":"IF(ISNUMBER(OilRefFactor),OilRefFactor,VLOOKUP(D112,OilEFs,9,FALSE))","v":5.2595377052268848},"=",{"$f":"D117*F117/Control!$D$75","v":0},"=",{"$f":"H117*MethGWP*10^-6","v":0},"=",{"$f":"J117/CO2_C","v":0}]
[null,"Oil Transportation",null,null,"x",{"$f":"IF(ISNUMBER(OilTransFactor),OilTransFactor,VLOOKUP(D112,OilEFs,10,FALSE))","v":0.94938761558153928},"=",{"$f":"D118*F118/Control!$D$75","v":0},"=",{"$f":"H118*MethGWP*10^-6","v":0},"=",{"$f":"J118/CO2_C","v":0}]
[null,"Total  ",null,null,null,null,null,{"$f":"SUM(H116:H118)","v":0},null,{"$f":"H119*MethGWP*10^-6","v":0},"=",{"$f":"J119/CO2_C","v":0}]
[]
[null,"Petroleum Systems",null,{"$f":"D112+1","v":2003}]
[]
[null,null,null,"Activity Data",null,"Emission Factor",null,"Metric Tons CH4",null,"MMTCO2E",null,"MMTCE"]
[null,null,null,"'000 barrels",null,"kg CH4 per year per 1000 bbl"]
[null,"Oil Production",null,null,"x",{"$f":"IF(ISNUMBER(OilProdFactor),OilProdFactor,VLOOKUP(D121,OilEFs,8,FALSE))","v":770.92370298775893},"=",{"$f":"D125*F125/Control!$D$75","v":0},"=",{"$f":"H125*MethGWP*10^-6","v":0},"=",{"$f":"J125/CO2_C","v":0}]
[null,"Oil Refining",null,null,"x",{"$f":"IF(ISNUMBER(OilRefFactor),OilRefFactor,VLOOKUP(D121,OilEFs,9,FALSE))","v":5.2595377052268839},"=",{"$f":"D126*F126/Control!$D$75","v":0},"=",{"$f":"H126*MethGWP*10^-6","v":0},"=",{"$f":"J126/CO2_C","v":0}]
[null,"Oil Transportation",null,null,"x",{"$f":"IF(ISNUMBER(OilTransFactor),OilTransFactor,VLOOKUP(D121,OilEFs,10,FALSE))","v":0.94341556991278186},"=",{"$f":"D127*F127/Control!$D$75","v":0},"=",{"$f":"H127*MethGWP*10^-6","v":0},"=",{"$f":"J127/CO2_C","v":0}]
[null,"Total  ",null,null,null,null,null,{"$f":"SUM(H125:H127)","v":0},null,{"$f":"H128*MethGWP*10^-6","v":0},"=",{"$f":"J128/CO2_C","v":0}]
[]
[null,"Petroleum Systems",null,{"$f":"D121+1","v":2004}]
[]
[null,null,null,"Activity Data",null,"Emission Factor",null,"Metric Tons CH4",null,"MMTCO2E",null,"MMTCE"]
[null,null,null,"'000 barrels",null,"kg CH4 per year per 1000 bbl"]
[null,"Oil Production",null,null,"x",{"$f":"IF(ISNUMBER(OilProdFactor),OilProdFactor,VLOOKUP(D130,OilEFs,8,FALSE))","v":799.29994258333875},"=",{"$f":"D134*F134/Control!$D$75","v":0},"=",{"$f":"H134*MethGWP*10^-6","v":0},"=",{"$f":"J134/CO2_C","v":0}]
[null,"Oil Refining",null,null,"x",{"$f":"IF(ISNUMBER(OilRefFactor),OilRefFactor,VLOOKUP(D130,OilEFs,9,FALSE))","v":5.2595377052268839},"=",{"$f":"D135*F135/Control!$D$75","v":0},"=",{"$f":"H135*MethGWP*10^-6","v":0},"=",{"$f":"J135/CO2_C","v":0}]
[null,"Oil Transportation",null,null,"x",{"$f":"IF(ISNUMBER(OilTransFactor),OilTransFactor,VLOOKUP(D130,OilEFs,10,FALSE))","v":0.92028124508123088},"=",{"$f":"D136*F136/Control!$D$75","v":0},"=",{"$f":"H136*MethGWP*10^-6","v":0},"=",{"$f":"J136/CO2_C","v":0}]
[null,"Total  ",null,null,null,null,null,{"$f":"SUM(H134:H136)","v":0},null,{"$f":"H137*MethGWP*10^-6","v":0},"=",{"$f":"J137/CO2_C","v":0}]
[]
[null,"Petroleum Systems",null,{"$f":"D130+1","v":2005}]
[]
[null,null,null,"Activity Data",null,"Emission Factor",null,"Metric Tons CH4",null,"MMTCO2E",null,"MMTCE"]
[null,null,null,"'000 barrels",null,"kg CH4 per year per 1000 bbl"]
[null,"Oil Production",null,null,"x",{"$f":"IF(ISNUMBER(OilProdFactor),OilProdFactor,VLOOKUP(D139,OilEFs,8,FALSE))","v":792.52214007176246},"=",{"$f":"D143*F143/Control!$D$75","v":0},"=",{"$f":"H143*MethGWP*10^-6","v":0},"=",{"$f":"J143/CO2_C","v":0}]
[null,"Oil Refining",null,null,"x",{"$f":"IF(ISNUMBER(OilRefFactor),OilRefFactor,VLOOKUP(D139,OilEFs,9,FALSE))","v":5.2595377052268857},"=",{"$f":"D144*F144/Control!$D$75","v":0},"=",{"$f":"H144*MethGWP*10^-6","v":0},"=",{"$f":"J144/CO2_C","v":0}]
[null,"Oil Transportation",null,null,"x",{"$f":"IF(ISNUMBER(OilTransFactor),OilTransFactor,VLOOKUP(D139,OilEFs,10,FALSE))","v":0.92211994289467358},"=",{"$f":"D145*F145/Control!$D$75","v":0},"=",{"$f":"H145*MethGWP*10^-6","v":0},"=",{"$f":"J145/CO2_C","v":0}]
[null,"Total  ",null,null,null,null,null,{"$f":"SUM(H143:H145)","v":0},null,{"$f":"H146*MethGWP*10^-6","v":0},"=",{"$f":"J146/CO2_C","v":0}]
[]
[null,"Petroleum Systems",null,{"$f":"D139+1","v":2006}]
[]
[null,null,null,"Activity Data",null,"Emission Factor",null,"Metric Tons CH4",null,"MMTCO2E",null,"MMTCE"]
[null,null,null,"'000 barrels",null,"kg CH4 per year per 1000 bbl"]
[null,"Oil Production",null,null,"x",{"$f":"IF(ISNUMBER(OilProdFactor),OilProdFactor,VLOOKUP(D148,OilEFs,8,FALSE))","v":857.23833244177013},"=",{"$f":"D152*F152/Control!$D$75","v":0},"=",{"$f":"H152*MethGWP*10^-6","v":0},"=",{"$f":"J152/CO2_C","v":0}]
[null,"Oil Refining",null,null,"x",{"$f":"IF(ISNUMBER(OilRefFactor),OilRefFactor,VLOOKUP(D148,OilEFs,9,FALSE))","v":5.2595377052268839},"=",{"$f":"D153*F153/Control!$D$75","v":0},"=",{"$f":"H153*MethGWP*10^-6","v":0},"=",{"$f":"J153/CO2_C","v":0}]
[null,"Oil Transportation",null,null,"x",{"$f":"IF(ISNUMBER(OilTransFactor),OilTransFactor,VLOOKUP(D148,OilEFs,10,FALSE))","v":0.90477830020018868},"=",{"$f":"D154*F154/Control!$D$75","v":0},"=",{"$f":"H154*MethGWP*10^-6","v":0},"=",{"$f":"J154/CO2_C","v":0}]
[null,"Total  ",null,null,null,null,null,{"$f":"SUM(H152:H154)","v":0},null,{"$f":"H155*MethGWP*10^-6","v":0},"=",{"$f":"J155/CO2_C","v":0}]
[]
[null,"Petroleum Systems",null,{"$f":"D148+1","v":2007}]
[]
[null,null,null,"Activity Data",null,"Emission Factor",null,"Metric Tons CH4",null,"MMTCO2E",null,"MMTCE"]
[null,null,null,"'000 barrels",null,"kg CH4 per year per 1000 bbl"]
[null,"Oil Production",null,null,"x",{"$f":"IF(ISNUMBER(OilProdFactor),OilProdFactor,VLOOKUP(D157,OilEFs,8,FALSE))","v":849.6323927644562},"=",{"$f":"D161*F161/Control!$D$75","v":0},"=",{"$f":"H161*MethGWP*10^-6","v":0},"=",{"$f":"J161/CO2_C","v":0}]
[null,"Oil Refining",null,null,"x",{"$f":"IF(ISNUMBER(OilRefFactor),OilRefFactor,VLOOKUP(D157,OilEFs,9,FALSE))","v":5.2595377052268839},"=",{"$f":"D162*F162/Control!$D$75","v":0},"=",{"$f":"H162*MethGWP*10^-6","v":0},"=",{"$f":"J162/CO2_C","v":0}]
[null,"Oil Transportation",null,null,"x",{"$f":"IF(ISNUMBER(OilTransFactor),OilTransFactor,VLOOKUP(D157,OilEFs,10,FALSE))","v":0.92392951303272108},"=",{"$f":"D163*F163/Control!$D$75","v":0},"=",{"$f":"H163*MethGWP*10^-6","v":0},"=",{"$f":"J163/CO2_C","v":0}]
[null,"Total  ",null,null,null,null,null,{"$f":"SUM(H161:H163)","v":0},null,{"$f":"H164*MethGWP*10^-6","v":0},"=",{"$f":"J164/CO2_C","v":0}]
[]
[null,"Petroleum Systems",null,{"$f":"D157+1","v":2008}]
[]
[null,null,null,"Activity Data",null,"Emission Factor",null,"Metric Tons CH4",null,"MMTCO2E",null,"MMTCE"]
[null,null,null,"'000 barrels",null,"kg CH4 per year per 1000 bbl"]
[null,"Oil Production",null,null,"x",{"$f":"IF(ISNUMBER(OilProdFactor),OilProdFactor,VLOOKUP(D166,OilEFs,8,FALSE))","v":888.61329290293963},"=",{"$f":"D170*F170/Control!$D$75","v":0},"=",{"$f":"H170*MethGWP*10^-6","v":0},"=",{"$f":"J170/CO2_C","v":0}]
[null,"Oil Refining",null,null,"x",{"$f":"IF(ISNUMBER(OilRefFactor),OilRefFactor,VLOOKUP(D166,OilEFs,9,FALSE))","v":5.2595377052268848},"=",{"$f":"D171*F171/Control!$D$75","v":0},"=",{"$f":"H171*MethGWP*10^-6","v":0},"=",{"$f":"J171/CO2_C","v":0}]
[null,"Oil Transportation",null,null,"x",{"$f":"IF(ISNUMBER(OilTransFactor),OilTransFactor,VLOOKUP(D166,OilEFs,10,FALSE))","v":0.94187891969296511},"=",{"$f":"D172*F172/Control!$D$75","v":0},"=",{"$f":"H172*MethGWP*10^-6","v":0},"=",{"$f":"J172/CO2_C","v":0}]
[null,"Total  ",null,null,null,null,null,{"$f":"SUM(H170:H172)","v":0},null,{"$f":"H173*MethGWP*10^-6","v":0},"=",{"$f":"J173/CO2_C","v":0}]
[]
[null,"Petroleum Systems",null,{"$f":"D166+1","v":2009}]
[]
[null,null,null,"Activity Data",null,"Emission Factor",null,"Metric Tons CH4",null,"MMTCO2E",null,"MMTCE"]
[null,null,null,"'000 barrels",null,"kg CH4 per year per 1000 bbl"]
[null,"Oil Production",null,null,"x",{"$f":"IF(ISNUMBER(OilProdFactor),OilProdFactor,VLOOKUP(D175,OilEFs,8,FALSE))","v":808.49786476869531},"=",{"$f":"D179*F179/Control!$D$75","v":0},"=",{"$f":"H179*MethGWP*10^-6","v":0},"=",{"$f":"J179/CO2_C","v":0}]
[null,"Oil Refining",null,null,"x",{"$f":"IF(ISNUMBER(OilRefFactor),OilRefFactor,VLOOKUP(D175,OilEFs,9,FALSE))","v":5.2595377052268839},"=",{"$f":"D180*F180/Control!$D$75","v":0},"=",{"$f":"H180*MethGWP*10^-6","v":0},"=",{"$f":"J180/CO2_C","v":0}]
[null,"Oil Transportation",null,null,"x",{"$f":"IF(ISNUMBER(OilTransFactor),OilTransFactor,VLOOKUP(D175,OilEFs,10,FALSE))","v":0.9441020704569707},"=",{"$f":"D181*F181/Control!$D$75","v":0},"=",{"$f":"H181*MethGWP*10^-6","v":0},"=",{"$f":"J181/CO2_C","v":0}]
[null,"Total  ",null,null,null,null,null,{"$f":"SUM(H179:H181)","v":0},null,{"$f":"H182*MethGWP*10^-6","v":0},"=",{"$f":"J182/CO2_C","v":0}]
[]
[null,"Petroleum Systems",null,{"$f":"D175+1","v":2010}]
[]
[null,null,null,"Activity Data",null,"Emission Factor",null,"Metric Tons CH4",null,"MMTCO2E",null,"MMTCE"]
[null,null,null,"'000 barrels",null,"kg CH4 per year per 1000 bbl"]
[null,"Oil Production",null,null,"x",{"$f":"IF(ISNUMBER(OilProdFactor),OilProdFactor,VLOOKUP(D184,OilEFs,8,FALSE))","v":788.08076054807509},"=",{"$f":"D188*F188/Control!$D$75","v":0},"=",{"$f":"H188*MethGWP*10^-6","v":0},"=",{"$f":"J188/CO2_C","v":0}]
[null,"Oil Refining",null,null,"x",{"$f":"IF(ISNUMBER(OilRefFactor),OilRefFactor,VLOOKUP(D184,OilEFs,9,FALSE))","v":5.2213119704885091},"=",{"$f":"D189*F189/Control!$D$75","v":0},"=",{"$f":"H189*MethGWP*10^-6","v":0},"=",{"$f":"J189/CO2_C","v":0}]
[null,"Oil Transportation",null,null,"x",{"$f":"IF(ISNUMBER(OilTransFactor),OilTransFactor,VLOOKUP(D184,OilEFs,10,FALSE))","v":0.92868920796120313},"=",{"$f":"D190*F190/Control!$D$75","v":0},"=",{"$f":"H190*MethGWP*10^-6","v":0},"=",{"$f":"J190/CO2_C","v":0}]
[null,"Total  ",null,null,null,null,null,{"$f":"SUM(H188:H190)","v":0},null,{"$f":"H191*MethGWP*10^-6","v":0},"=",{"$f":"J191/CO2_C","v":0}]
[]
[null,"Petroleum Systems",null,{"$f":"D184+1","v":2011}]
[]
[null,null,null,"Activity Data",null,"Emission Factor",null,"Metric Tons CH4",null,"MMTCO2E",null,"MMTCE"]
[null,null,null,"'000 barrels",null,"kg CH4 per year per 1000 bbl"]
[null,"Oil Production",null,null,"x",{"$f":"IF(ISNUMBER(OilProdFactor),OilProdFactor,VLOOKUP(D193,OilEFs,8,FALSE))","v":777.0870111552839},"=",{"$f":"D197*F197/Control!$D$75","v":0},"=",{"$f":"H197*MethGWP*10^-6","v":0},"=",{"$f":"J197/CO2_C","v":0}]
[null,"Oil Refining",null,null,"x",{"$f":"IF(ISNUMBER(OilRefFactor),OilRefFactor,VLOOKUP(D193,OilEFs,9,FALSE))","v":5.566556259947375},"=",{"$f":"D198*F198/Control!$D$75","v":0},"=",{"$f":"H198*MethGWP*10^-6","v":0},"=",{"$f":"J198/CO2_C","v":0}]
[null,"Oil Transportation",null,null,"x",{"$f":"IF(ISNUMBER(OilTransFactor),OilTransFactor,VLOOKUP(D193,OilEFs,10,FALSE))","v":0.97026653188600032},"=",{"$f":"D199*F199/Control!$D$75","v":0},"=",{"$f":"H199*MethGWP*10^-6","v":0},"=",{"$f":"J199/CO2_C","v":0}]
[null,"Total  ",null,null,null,null,null,{"$f":"SUM(H197:H199)","v":0},null,{"$f":"H200*MethGWP*10^-6","v":0},"=",{"$f":"J200/CO2_C","v":0}]
[]
[null,"Petroleum Systems",null,{"$f":"D193+1","v":2012}]
[]
[null,null,null,"Activity Data",null,"Emission Factor",null,"Metric Tons CH4",null,"MMTCO2E",null,"MMTCE"]
[null,null,null,"'000 barrels",null,"kg CH4 per year per 1000 bbl"]
[null,"Oil Production",null,null,"x",{"$f":"IF(ISNUMBER(OilProdFactor),OilProdFactor,VLOOKUP(D202,OilEFs,8,FALSE))","v":651.62036580520476},"=",{"$f":"D206*F206/Control!$D$75","v":0},"=",{"$f":"H206*MethGWP*10^-6","v":0},"=",{"$f":"J206/CO2_C","v":0}]
[null,"Oil Refining",null,null,"x",{"$f":"IF(ISNUMBER(OilRefFactor),OilRefFactor,VLOOKUP(D202,OilEFs,9,FALSE))","v":5.337140238434869},"=",{"$f":"D207*F207/Control!$D$75","v":0},"=",{"$f":"H207*MethGWP*10^-6","v":0},"=",{"$f":"J207/CO2_C","v":0}]
[null,"Oil Transportation",null,null,"x",{"$f":"IF(ISNUMBER(OilTransFactor),OilTransFactor,VLOOKUP(D202,OilEFs,10,FALSE))","v":1.1231144556578059},"=",{"$f":"D208*F208/Control!$D$75","v":0},"=",{"$f":"H208*MethGWP*10^-6","v":0},"=",{"$f":"J208/CO2_C","v":0}]
[null,"Total  ",null,null,null,null,null,{"$f":"SUM(H206:H208)","v":0},null,{"$f":"H209*MethGWP*10^-6","v":0},"=",{"$f":"J209/CO2_C","v":0}]
[]
[null,"Petroleum Systems",null,{"$f":"D202+1","v":2013}]
[]
[null,null,null,"Activity Data",null,"Emission Factor",null,"Metric Tons CH4",null,"MMTCO2E",null,"MMTCE"]
[null,null,null,"'000 barrels",null,"kg CH4 per year per 1000 bbl"]
[null,"Oil Production",null,null,"x",{"$f":"IF(ISNUMBER(OilProdFactor),OilProdFactor,VLOOKUP(D211,OilEFs,8,FALSE))","v":714.55542385221656},"=",{"$f":"D215*F215/Control!$D$75","v":0},"=",{"$f":"H215*MethGWP*10^-6","v":0},"=",{"$f":"J215/CO2_C","v":0}]
[null,"Oil Refining",null,null,"x",{"$f":"IF(ISNUMBER(OilRefFactor),OilRefFactor,VLOOKUP(D211,OilEFs,9,FALSE))","v":4.923197672467805},"=",{"$f":"D216*F216/Control!$D$75","v":0},"=",{"$f":"H216*MethGWP*10^-6","v":0},"=",{"$f":"J216/CO2_C","v":0}]
[null,"Oil Transportation",null,null,"x",{"$f":"IF(ISNUMBER(OilTransFactor),OilTransFactor,VLOOKUP(D211,OilEFs,10,FALSE))","v":1.2831931847533991},"=",{"$f":"D217*F217/Control!$D$75","v":0},"=",{"$f":"H217*MethGWP*10^-6","v":0},"=",{"$f":"J217/CO2_C","v":0}]
[null,"Total  ",null,null,null,null,null,{"$f":"SUM(H215:H217)","v":0},null,{"$f":"H218*MethGWP*10^-6","v":0},"=",{"$f":"J218/CO2_C","v":0}]
[]
[null,"Petroleum Systems",null,{"$f":"D211+1","v":2014}]
[]
[null,null,null,"Activity Data",null,"Emission Factor",null,"Metric Tons CH4",null,"MMTCO2E",null,"MMTCE"]
[null,null,null,"'000 barrels",null,"kg CH4 per year per 1000 bbl"]
[null,"Oil Production",null,null,"x",{"$f":"IF(ISNUMBER(OilProdFactor),OilProdFactor,VLOOKUP(D220,OilEFs,8,FALSE))","v":645.83341718791314},"=",{"$f":"D224*F224/Control!$D$75","v":0},"=",{"$f":"H224*MethGWP*10^-6","v":0},"=",{"$f":"J224/CO2_C","v":0}]
[null,"Oil Refining",null,null,"x",{"$f":"IF(ISNUMBER(OilRefFactor),OilRefFactor,VLOOKUP(D220,OilEFs,9,FALSE))","v":4.6660913336293621},"=",{"$f":"D225*F225/Control!$D$75","v":0},"=",{"$f":"H225*MethGWP*10^-6","v":0},"=",{"$f":"J225/CO2_C","v":0}]
[null,"Oil Transportation",null,null,"x",{"$f":"IF(ISNUMBER(OilTransFactor),OilTransFactor,VLOOKUP(D220,OilEFs,10,FALSE))","v":1.4199316188915703},"=",{"$f":"D226*F226/Control!$D$75","v":0},"=",{"$f":"H226*MethGWP*10^-6","v":0},"=",{"$f":"J226/CO2_C","v":0}]
[null,"Total  ",null,null,null,null,null,{"$f":"SUM(H224:H226)","v":0},null,{"$f":"H227*MethGWP*10^-6","v":0},"=",{"$f":"J227/CO2_C","v":0}]
[]
[null,"Petroleum Systems",null,{"$f":"D220+1","v":2015}]
[]
[null,null,null,"Activity Data",null,"Emission Factor",null,"Metric Tons CH4",null,"MMTCO2E",null,"MMTCE"]
[null,null,null,"'000 barrels",null,"kg CH4 per year per 1000 bbl"]
[null,"Oil Production",null,null,"x",{"$f":"IF(ISNUMBER(OilProdFactor),OilProdFactor,VLOOKUP(D229,OilEFs,8,FALSE))","v":601.72561454509241},"=",{"$f":"D233*F233/Control!$D$75","v":0},"=",{"$f":"H233*MethGWP*10^-6","v":0},"=",{"$f":"J233/CO2_C","v":0}]
[null,"Oil Refining",null,null,"x",{"$f":"IF(ISNUMBER(OilRefFactor),OilRefFactor,VLOOKUP(D229,OilEFs,9,FALSE))","v":4.9263967426181381},"=",{"$f":"D234*F234/Control!$D$75","v":0},"=",{"$f":"H234*MethGWP*10^-6","v":0},"=",{"$f":"J234/CO2_C","v":0}]
[null,"Oil Transportation",null,null,"x",{"$f":"IF(ISNUMBER(OilTransFactor),OilTransFactor,VLOOKUP(D229,OilEFs,10,FALSE))","v":1.4143197805705146},"=",{"$f":"D235*F235/Control!$D$75","v":0},"=",{"$f":"H235*MethGWP*10^-6","v":0},"=",{"$f":"J235/CO2_C","v":0}]
[null,"Total  ",null,null,null,null,null,{"$f":"SUM(H233:H235)","v":0},null,{"$f":"H236*MethGWP*10^-6","v":0},"=",{"$f":"J236/CO2_C","v":0}]
[]
[null,"Petroleum Systems",null,{"$f":"D229+1","v":2016}]
[]
[null,null,null,"Activity Data",null,"Emission Factor",null,"Metric Tons CH4",null,"MMTCO2E",null,"MMTCE"]
[null,null,null,"'000 barrels",null,"kg CH4 per year per 1000 bbl"]
[null,"Oil Production",null,null,"x",{"$f":"IF(ISNUMBER(OilProdFactor),OilProdFactor,VLOOKUP(D238,OilEFs,8,FALSE))","v":439.42633392140175},"=",{"$f":"D242*F242/Control!$D$75","v":0},"=",{"$f":"H242*MethGWP*10^-6","v":0},"=",{"$f":"J242/CO2_C","v":0}]
[null,"Oil Refining",null,null,"x",{"$f":"IF(ISNUMBER(OilRefFactor),OilRefFactor,VLOOKUP(D238,OilEFs,9,FALSE))","v":6.2601672358795826},"=",{"$f":"D243*F243/Control!$D$75","v":0},"=",{"$f":"H243*MethGWP*10^-6","v":0},"=",{"$f":"J243/CO2_C","v":0}]
[null,"Oil Transportation",null,null,"x",{"$f":"IF(ISNUMBER(OilTransFactor),OilTransFactor,VLOOKUP(D238,OilEFs,10,FALSE))","v":1.3577349084639434},"=",{"$f":"D244*F244/Control!$D$75","v":0},"=",{"$f":"H244*MethGWP*10^-6","v":0},"=",{"$f":"J244/CO2_C","v":0}]
[null,"Total  ",null,null,null,null,null,{"$f":"SUM(H242:H244)","v":0},null,{"$f":"H245*MethGWP*10^-6","v":0},"=",{"$f":"J245/CO2_C","v":0}]
[]
[null,"Petroleum Systems",null,{"$f":"D238+1","v":2017}]
[]
[null,null,null,"Activity Data",null,"Emission Factor",null,"Metric Tons CH4",null,"MMTCO2E",null,"MMTCE"]
[null,null,null,"'000 barrels",null,"kg CH4 per year per 1000 bbl"]
[null,"Oil Production",null,null,"x",{"$f":"IF(ISNUMBER(OilProdFactor),OilProdFactor,VLOOKUP(D247,OilEFs,8,FALSE))","v":619.13800957788897},"=",{"$f":"D251*F251/Control!$D$75","v":0},"=",{"$f":"H251*MethGWP*10^-6","v":0},"=",{"$f":"J251/CO2_C","v":0}]
[null,"Oil Refining",null,null,"x",{"$f":"IF(ISNUMBER(OilRefFactor),OilRefFactor,VLOOKUP(D247,OilEFs,9,FALSE))","v":4.9169054090704485},"=",{"$f":"D252*F252/Control!$D$75","v":0},"=",{"$f":"H252*MethGWP*10^-6","v":0},"=",{"$f":"J252/CO2_C","v":0}]
[null,"Oil Transportation",null,null,"x",{"$f":"IF(ISNUMBER(OilTransFactor),OilTransFactor,VLOOKUP(D247,OilEFs,10,FALSE))","v":1.254015240114795},"=",{"$f":"D253*F253/Control!$D$75","v":0},"=",{"$f":"H253*MethGWP*10^-6","v":0},"=",{"$f":"J253/CO2_C","v":0}]
[null,"Total  ",null,null,null,null,null,{"$f":"SUM(H251:H253)","v":0},null,{"$f":"H254*MethGWP*10^-6","v":0},"=",{"$f":"J254/CO2_C","v":0}]
[]
[null,"Petroleum Systems",null,{"$f":"D247+1","v":2018}]
[]
[null,null,null,"Activity Data",null,"Emission Factor",null,"Metric Tons CH4",null,"MMTCO2E",null,"MMTCE"]
[null,null,null,"'000 barrels",null,"kg CH4 per year per 1000 bbl"]
[null,"Oil Production",null,null,"x",{"$f":"IF(ISNUMBER(OilProdFactor),OilProdFactor,VLOOKUP(D256,OilEFs,8,FALSE))","v":513.07105565738834},"=",{"$f":"D260*F260/Control!$D$75","v":0},"=",{"$f":"H260*MethGWP*10^-6","v":0},"=",{"$f":"J260/CO2_C","v":0}]
[null,"Oil Refining",null,null,"x",{"$f":"IF(ISNUMBER(OilRefFactor),OilRefFactor,VLOOKUP(D256,OilEFs,9,FALSE))","v":4.4890387113876606},"=",{"$f":"D261*F261/Control!$D$75","v":0},"=",{"$f":"H261*MethGWP*10^-6","v":0},"=",{"$f":"J261/CO2_C","v":0}]
[null,"Oil Transportation",null,null,"x",{"$f":"IF(ISNUMBER(OilTransFactor),OilTransFactor,VLOOKUP(D256,OilEFs,10,FALSE))","v":1.3402995660255059},"=",{"$f":"D262*F262/Control!$D$75","v":0},"=",{"$f":"H262*MethGWP*10^-6","v":0},"=",{"$f":"J262/CO2_C","v":0}]
[null,"Total  ",null,null,null,null,null,{"$f":"SUM(H260:H262)","v":0},null,{"$f":"H263*MethGWP*10^-6","v":0},"=",{"$f":"J263/CO2_C","v":0}]
[]
[null,"Petroleum Systems",null,{"$f":"D256+1","v":2019}]
[]
[null,null,null,"Activity Data",null,"Emission Factor",null,"Metric Tons CH4",null,"MMTCO2E",null,"MMTCE"]
[null,null,null,"'000 barrels",null,"kg CH4 per year per 1000 bbl"]
[null,"Oil Production",null,null,"x",{"$f":"IF(ISNUMBER(OilProdFactor),OilProdFactor,VLOOKUP(D265,OilEFs,8,FALSE))","v":402.4504985471213},"=",{"$f":"D269*F269/Control!$D$75","v":0},"=",{"$f":"H269*MethGWP*10^-6","v":0},"=",{"$f":"J269/CO2_C","v":0}]
[null,"Oil Refining",null,null,"x",{"$f":"IF(ISNUMBER(OilRefFactor),OilRefFactor,VLOOKUP(D265,OilEFs,9,FALSE))","v":5.0970681925274484},"=",{"$f":"D270*F270/Control!$D$75","v":0},"=",{"$f":"H270*MethGWP*10^-6","v":0},"=",{"$f":"J270/CO2_C","v":0}]
[null,"Oil Transportation",null,null,"x",{"$f":"IF(ISNUMBER(OilTransFactor),OilTransFactor,VLOOKUP(D265,OilEFs,10,FALSE))","v":1.4922097806589887},"=",{"$f":"D271*F271/Control!$D$75","v":0},"=",{"$f":"H271*MethGWP*10^-6","v":0},"=",{"$f":"J271/CO2_C","v":0}]
[null,"Total  ",null,null,null,null,null,{"$f":"SUM(H269:H271)","v":0},null,{"$f":"H272*MethGWP*10^-6","v":0},"=",{"$f":"J272/CO2_C","v":0}]
[]
[null,"Petroleum Systems",null,{"$f":"D265+1","v":2020}]
[]
[null,null,null,"Activity Data",null,"Emission Factor",null,"Metric Tons CH4",null,"MMTCO2E",null,"MMTCE"]
[null,null,null,"'000 barrels",null,"kg CH4 per year per 1000 bbl"]
[null,"Oil Production",null,null,"x",{"$f":"IF(ISNUMBER(OilProdFactor),OilProdFactor,VLOOKUP(D274,OilEFs,8,FALSE))","v":448.40980091974876},"=",{"$f":"D278*F278/Control!$D$75","v":0},"=",{"$f":"H278*MethGWP*10^-6","v":0},"=",{"$f":"J278/CO2_C","v":0}]
[null,"Oil Refining",null,null,"x",{"$f":"IF(ISNUMBER(OilRefFactor),OilRefFactor,VLOOKUP(D274,OilEFs,9,FALSE))","v":4.971673709648349},"=",{"$f":"D279*F279/Control!$D$75","v":0},"=",{"$f":"H279*MethGWP*10^-6","v":0},"=",{"$f":"J279/CO2_C","v":0}]
[null,"Oil Transportation",null,null,"x",{"$f":"IF(ISNUMBER(OilTransFactor),OilTransFactor,VLOOKUP(D274,OilEFs,10,FALSE))","v":1.5825098000295499},"=",{"$f":"D280*F280/Control!$D$75","v":0},"=",{"$f":"H280*MethGWP*10^-6","v":0},"=",{"$f":"J280/CO2_C","v":0}]
[null,"Total  ",null,null,null,null,null,{"$f":"SUM(H278:H280)","v":0},null,{"$f":"H281*MethGWP*10^-6","v":0},"=",{"$f":"J281/CO2_C","v":0}]
[]
[null,"Petroleum Systems",null,{"$f":"D274+1","v":2021}]
[]
[null,null,null,"Activity Data",null,"Emission Factor",null,"Metric Tons CH4",null,"MMTCO2E",null,"MMTCE"]
[null,null,null,"'000 barrels",null,"kg CH4 per year per 1000 bbl"]
[null,"Oil Production",null,null,"x",{"$f":"IF(ISNUMBER(OilProdFactor),OilProdFactor,VLOOKUP(D283,OilEFs,8,FALSE))","v":411.00537336553964},"=",{"$f":"D287*F287/Control!$D$75","v":0},"=",{"$f":"H287*MethGWP*10^-6","v":0},"=",{"$f":"J287/CO2_C","v":0}]
[null,"Oil Refining",null,null,"x",{"$f":"IF(ISNUMBER(OilRefFactor),OilRefFactor,VLOOKUP(D283,OilEFs,9,FALSE))","v":4.5882855173236061},"=",{"$f":"D288*F288/Control!$D$75","v":0},"=",{"$f":"H288*MethGWP*10^-6","v":0},"=",{"$f":"J288/CO2_C","v":0}]
[null,"Oil Transportation",null,null,"x",{"$f":"IF(ISNUMBER(OilTransFactor),OilTransFactor,VLOOKUP(D283,OilEFs,10,FALSE))","v":1.4228922872492675},"=",{"$f":"D289*F289/Control!$D$75","v":0},"=",{"$f":"H289*MethGWP*10^-6","v":0},"=",{"$f":"J289/CO2_C","v":0}]
[null,"Total  ",null,null,null,null,null,{"$f":"SUM(H287:H289)","v":0},null,{"$f":"H290*MethGWP*10^-6","v":0},"=",{"$f":"J290/CO2_C","v":0}]
[]
[null,"Petroleum Systems",null,{"$f":"D283+1","v":2022}]
[]
[null,null,null,"Activity Data",null,"Emission Factor",null,"Metric Tons CH4",null,"MMTCO2E",null,"MMTCE"]
[null,null,null,"'000 barrels",null,"kg CH4 per year per 1000 bbl"]
[null,"Oil Production",null,null,"x",{"$f":"IF(ISNUMBER(OilProdFactor),OilProdFactor,VLOOKUP(D292,OilEFs,8,FALSE))","v":314.684290692682},"=",{"$f":"D296*F296/Control!$D$75","v":0},"=",{"$f":"H296*MethGWP*10^-6","v":0},"=",{"$f":"J296/CO2_C","v":0}]
[null,"Oil Refining",null,null,"x",{"$f":"IF(ISNUMBER(OilRefFactor),OilRefFactor,VLOOKUP(D292,OilEFs,9,FALSE))","v":4.2328425791938775},"=",{"$f":"D297*F297/Control!$D$75","v":0},"=",{"$f":"H297*MethGWP*10^-6","v":0},"=",{"$f":"J297/CO2_C","v":0}]
[null,"Oil Transportation",null,null,"x",{"$f":"IF(ISNUMBER(OilTransFactor),OilTransFactor,VLOOKUP(D292,OilEFs,10,FALSE))","v":1.427715130203274},"=",{"$f":"D298*F298/Control!$D$75","v":0},"=",{"$f":"H298*MethGWP*10^-6","v":0},"=",{"$f":"J298/CO2_C","v":0}]
[null,"Total  ",null,null,null,null,null,{"$f":"SUM(H296:H298)","v":0},null,{"$f":"H299*MethGWP*10^-6","v":0},"=",{"$f":"J299/CO2_C","v":0}]
[]
[null,"Petroleum Systems",null,{"$f":"D292+1","v":2023}]
[]
[null,null,null,"Activity Data",null,"Emission Factor",null,"Metric Tons CH4",null,"MMTCO2E",null,"MMTCE"]
[null,null,null,"'000 barrels",null,"kg CH4 per year per 1000 bbl"]
[null,"Oil Production",null,null,"x",{"$f":"IF(ISNUMBER(OilProdFactor),OilProdFactor,VLOOKUP(D301,OilEFs,8,FALSE))","v":314.684290692682},"=",{"$f":"D305*F305/Control!$D$75","v":0},"=",{"$f":"H305*MethGWP*10^-6","v":0},"=",{"$f":"J305/CO2_C","v":0}]
[null,"Oil Refining",null,null,"x",{"$f":"IF(ISNUMBER(OilRefFactor),OilRefFactor,VLOOKUP(D301,OilEFs,9,FALSE))","v":4.2328425791938775},"=",{"$f":"D306*F306/Control!$D$75","v":0},"=",{"$f":"H306*MethGWP*10^-6","v":0},"=",{"$f":"J306/CO2_C","v":0}]
[null,"Oil Transportation",null,null,"x",{"$f":"IF(ISNUMBER(OilTransFactor),OilTransFactor,VLOOKUP(D301,OilEFs,10,FALSE))","v":1.427715130203274},"=",{"$f":"D307*F307/Control!$D$75","v":0},"=",{"$f":"H307*MethGWP*10^-6","v":0},"=",{"$f":"J307/CO2_C","v":0}]
[null,"Total  ",null,null,null,null,null,{"$f":"SUM(H305:H307)","v":0},null,{"$f":"H308*MethGWP*10^-6","v":0},"=",{"$f":"J308/CO2_C","v":0}]
[]
[null,"Petroleum Systems",null,{"$f":"D301+1","v":2024}]
[]
[null,null,null,"Activity Data",null,"Emission Factor",null,"Metric Tons CH4",null,"MMTCO2E",null,"MMTCE"]
[null,null,null,"'000 barrels",null,"kg CH4 per year per 1000 bbl"]
[null,"Oil Production",null,null,"x",{"$f":"IF(ISNUMBER(OilProdFactor),OilProdFactor,VLOOKUP(D310,OilEFs,8,FALSE))","v":314.684290692682},"=",{"$f":"D314*F314/Control!$D$75","v":0},"=",{"$f":"H314*MethGWP*10^-6","v":0},"=",{"$f":"J314/CO2_C","v":0}]
[null,"Oil Refining",null,null,"x",{"$f":"IF(ISNUMBER(OilRefFactor),OilRefFactor,VLOOKUP(D310,OilEFs,9,FALSE))","v":4.2328425791938775},"=",{"$f":"D315*F315/Control!$D$75","v":0},"=",{"$f":"H315*MethGWP*10^-6","v":0},"=",{"$f":"J315/CO2_C","v":0}]
[null,"Oil Transportation",null,null,"x",{"$f":"IF(ISNUMBER(OilTransFactor),OilTransFactor,VLOOKUP(D310,OilEFs,10,FALSE))","v":1.427715130203274},"=",{"$f":"D316*F316/Control!$D$75","v":0},"=",{"$f":"H316*MethGWP*10^-6","v":0},"=",{"$f":"J316/CO2_C","v":0}]
[null,"Total  ",null,null,null,null,null,{"$f":"SUM(H314:H316)","v":0},null,{"$f":"H317*MethGWP*10^-6","v":0},"=",{"$f":"J317/CO2_C","v":0}]
[]
[null,"Petroleum Systems",null,{"$f":"D310+1","v":2025}]
[]
[null,null,null,"Activity Data",null,"Emission Factor",null,"Metric Tons CH4",null,"MMTCO2E",null,"MMTCE"]
[null,null,null,"'000 barrels",null,"kg CH4 per year per 1000 bbl"]
[null,"Oil Production",null,null,"x",{"$f":"IF(ISNUMBER(OilProdFactor),OilProdFactor,VLOOKUP(D319,OilEFs,8,FALSE))","v":314.684290692682},"=",{"$f":"D323*F323/Control!$D$75","v":0},"=",{"$f":"H323*MethGWP*10^-6","v":0},"=",{"$f":"J323/CO2_C","v":0}]
[null,"Oil Refining",null,null,"x",{"$f":"IF(ISNUMBER(OilRefFactor),OilRefFactor,VLOOKUP(D319,OilEFs,9,FALSE))","v":4.2328425791938775},"=",{"$f":"D324*F324/Control!$D$75","v":0},"=",{"$f":"H324*MethGWP*10^-6","v":0},"=",{"$f":"J324/CO2_C","v":0}]
[null,"Oil Transportation",null,null,"x",{"$f":"IF(ISNUMBER(OilTransFactor),OilTransFactor,VLOOKUP(D319,OilEFs,10,FALSE))","v":1.427715130203274},"=",{"$f":"D325*F325/Control!$D$75","v":0},"=",{"$f":"H325*MethGWP*10^-6","v":0},"=",{"$f":"J325/CO2_C","v":0}]
[null,"Total  ",null,null,null,null,null,{"$f":"SUM(H323:H325)","v":0},null,{"$f":"H326*MethGWP*10^-6","v":0},"=",{"$f":"J326/CO2_C","v":0}]

{"sheet":"Additional Emission Sources","index":8,"n_rows":37,"n_cols":44,"rows_kept":37,"cut":false,"hidden":false,"merged":[[0,12,0,39],[49,4,49,10]]}
[null,{"$f":"\"7 (OPTIONAL) Additional Emission Sources for \"&ListData!D2","v":"7 (OPTIONAL) Additional Emission Sources for Select a State . . ."}]
[]
[]
[]
[]
[]
[null,"Additional Emission Sources (MMTCO2E)"]
[null,"Option A"]
[null,"Source","Gas",1990,1991,1992,1993,1994,1995,1996,1997,1998,1999,2000,2001,2002,2003,2004,2005,2006,2007,2008,2009,2010,2011,2012,2013,2014,2015,2016,2017,2018,2019,2020,2021,2022,2023,2024,2025]
[]
[null,null,null,null,null,null,null,null,null,null,null,null,null,null,null,null,null,null,null,null,null,null,null,null,null,null,null,null,null,null,null,null,null,null,null,null,null,null,null,null,null,null,null,"CO2"]
[null,null,null,null,null,null,null,null,null,null,null,null,null,null,null,null,null,null,null,null,null,null,null,null,null,null,null,null,null,null,null,null,null,null,null,null,null,null,null,null,null,null,null,"CH4"]
[]
[]
[]
[]
[]
[]
[]
[]
[]
[null,null,null,1990,1991,1992,1993,1994,1995,1996,1997,1998,1999,2000,2001,2002,2003,2004,2005,2006,2007,2008,2009,2010,2011,2012,2013,2014,2015,2016,2017,2018,2019,2020,2021,2022,2023,2024,2025]
[null,"Additional Carbon Dioxide Emissions","CO2",{"$f":"IF(SUMIF($C$10:$C$19, $C23, D$10:D$19)=0, \" \", SUMIF($C$10:$C$19, $C23, D$10:D$19))","v":" "}," "," "," "," "," "," "," "," "," ",{"$f":"IF(SUMIF($C$10:$C$19, $C23, N$10:N$19)=0, \" \", SUMIF($C$10:$C$19, $C23, N$10:N$19))","v":" "}," "," "," "," "," "," "," "," "," ",{"$f":"IF(SUMIF($C$10:$C$19, $C23, X$10:X$19)=0, \" \", SUMIF($C$10:$C$19, $C23, X$10:X$19))","v":" "}," "," "," "," "," "," "," "," "," ",{"$f":"IF(SUMIF($C$10:$C$19, $C23, AH$10:AH$19)=0, \" \", SUMIF($C$10:$C$19, $C23, AH$10:AH$19))","v":" "}," "," "," "," "," "]
[null,"Additional Methane Emissions","CH4"," "," "," "," "," "," "," "," "," "," "," "," "," "," "," "," "," "," "," "," "," "," "," "," "," "," "," "," "," "," "," "," "," "," "," "," "]
[]
[]
[null,"Option B"]
[null,null,null,1990,1991,1992,1993,1994,1995,1996,1997,1998,1999,2000,2001,2002,2003,2004,2005,2006,2007,2008,2009,2010,2011,2012,2013,2014,2015,2016,2017,2018,2019,2020,2021,2022,2023,2024,2025]
[null,"Additional Carbon Dioxide Emissions","CO2"]
[null,"Additional Methane Emissions","CH4"]
[]
[]
[null,"HIDDEN ROWS:"]
[null,"Additional Emissions used for Summary tab:"]
[null,null,null,1990,1991,1992,1993,1994,1995,1996,1997,1998,1999,2000,2001,2002,2003,2004,2005,2006,2007,2008,2009,2010,2011,2012,2013,2014,2015,2016,2017,2018,2019,2020,2021,2022,2023,2024,2025]
[null,"Additional Carbon Dioxide Emissions","CO2",{"$f":"IFERROR( IF(ISBLANK(D29),D23,D29)*1, 0)","v":0},{"$f":"IFERROR( IF(ISBLANK(E29),E23,E29)*1, 0)","v":0},0,0,0,0,0,0,0,0,0,0,0,0,0,0,0,0,0,0,0,0,0,0,0,0,0,0,0,0,0,0,0,0,0,0]
[null,"Additional Methane Emissions","CH4",{"$f":"IFERROR( IF(ISBLANK(D30),D24,D30)*1, 0)","v":0},{"$f":"IFERROR( IF(ISBLANK(E30),E24,E30)*1, 0)","v":0},0,0,0,0,0,0,0,0,0,0,0,0,0,0,0,0,0,0,0,0,0,0,0,0,0,0,0,0,0,0,0,0,0,0]

{"sheet":"Summary","index":9,"n_rows":51,"n_cols":38,"rows_kept":51,"cut":false,"hidden":false,"merged":[[1,2,1,12],[2,1,2,10]]}
[{"$f":"\"7. \"&ListData!D2&\" Emissions Summary\"","v":"7. Select a State . . . Emissions Summary"}]
[]
[null,{"$f":"Tracker!B14","v":"Emissions were not calculated for the following sources: Natural Gas Production, Natural Gas Flaring, Natural Gas Transmission, Natural Gas Distribution, and Oil."}]
[null,"* Additional Emission Sources will only populate if values are added (optional) to the Additional Data Input tab"]
[null,"Emissions (MMTCE)"]
[null,null,1990,1991,1992,1993,1994,1995,1996,1997,1998,1999,2000,2001,2002,2003,2004,2005,2006,2007,2008,2009,2010,2011,2012,2013,2014,2015,2016,2017,2018,2019,2020]
[null,"Natural Gas",{"$f":"C12/CO2_C","v":0},{"$error":"#VALUE!"},{"$error":"#VALUE!"},{"$error":"#VALUE!"},{"$error":"#VALUE!"},{"$error":"#VALUE!"},{"$error":"#VALUE!"},{"$error":"#VALUE!"},{"$error":"#VALUE!"},{"$error":"#VALUE!"},{"$error":"#VALUE!"},{"$error":"#VALUE!"},{"$error":"#VALUE!"},{"$error":"#VALUE!"},{"$error":"#VALUE!"},{"$error":"#VALUE!"},{"$error":"#VALUE!"},{"$error":"#VALUE!"},{"$error":"#VALUE!"},{"$error":"#VALUE!"},{"$error":"#VALUE!"},{"$error":"#VALUE!"},{"$error":"#VALUE!"},{"$error":"#VALUE!"},{"$error":"#VALUE!"},{"$error":"#VALUE!"},{"$error":"#VALUE!"},{"$error":"#VALUE!"},{"$error":"#VALUE!"},{"$error":"#VALUE!"},{"$error":"#VALUE!"}]
[null,"Oil",{"$f":"Summary!C13/CO2_C","v":0},{"$f":"Summary!D13/CO2_C","v":0},{"$f":"Summary!E13/CO2_C","v":0},{"$f":"Summary!F13/CO2_C","v":0},{"$f":"Summary!G13/CO2_C","v":0},{"$f":"Summary!H13/CO2_C","v":0},{"$f":"Summary!I13/CO2_C","v":0},{"$f":"Summary!J13/CO2_C","v":0},{"$f":"Summary!K13/CO2_C","v":0},{"$f":"Summary!L13/CO2_C","v":0},{"$f":"Summary!M13/CO2_C","v":0},{"$f":"Summary!N13/CO2_C","v":0},{"$f":"Summary!O13/CO2_C","v":0},{"$f":"Summary!P13/CO2_C","v":0},{"$f":"Summary!Q13/CO2_C","v":0},{"$f":"Summary!R13/CO2_C","v":0},{"$f":"Summary!S13/CO2_C","v":0},{"$f":"Summary!T13/CO2_C","v":0},{"$f":"Summary!U13/CO2_C","v":0},{"$f":"Summary!V13/CO2_C","v":0},{"$f":"Summary!W13/CO2_C","v":0},{"$f":"Summary!X13/CO2_C","v":0},{"$f":"Summary!Y13/CO2_C","v":0},{"$f":"Summary!Z13/CO2_C","v":0},{"$f":"Summary!AA13/CO2_C","v":0},{"$f":"Summary!AB13/CO2_C","v":0},{"$f":"Summary!AC13/CO2_C","v":0},{"$f":"Summary!AD13/CO2_C","v":0},{"$f":"Summary!AE13/CO2_C","v":0},{"$f":"Summary!AF13/CO2_C","v":0},{"$f":"Summary!AG13/CO2_C","v":0}]
[null,"Additional Emission Sources*",{"$f":"Summary!C14/CO2_C","v":0},{"$f":"Summary!D14/CO2_C","v":0},{"$f":"Summary!E14/CO2_C","v":0},{"$f":"Summary!F14/CO2_C","v":0},{"$f":"Summary!G14/CO2_C","v":0},{"$f":"Summary!H14/CO2_C","v":0},{"$f":"Summary!I14/CO2_C","v":0},{"$f":"Summary!J14/CO2_C","v":0},{"$f":"Summary!K14/CO2_C","v":0},{"$f":"Summary!L14/CO2_C","v":0},{"$f":"Summary!M14/CO2_C","v":0},{"$f":"Summary!N14/CO2_C","v":0},{"$f":"Summary!O14/CO2_C","v":0},{"$f":"Summary!P14/CO2_C","v":0},{"$f":"Summary!Q14/CO2_C","v":0},{"$f":"Summary!R14/CO2_C","v":0},{"$f":"Summary!S14/CO2_C","v":0},{"$f":"Summary!T14/CO2_C","v":0},{"$f":"Summary!U14/CO2_C","v":0},{"$f":"Summary!V14/CO2_C","v":0},{"$f":"Summary!W14/CO2_C","v":0},{"$f":"Summary!X14/CO2_C","v":0},{"$f":"Summary!Y14/CO2_C","v":0},{"$f":"Summary!Z14/CO2_C","v":0},{"$f":"Summary!AA14/CO2_C","v":0},{"$f":"Summary!AB14/CO2_C","v":0},{"$f":"Summary!AC14/CO2_C","v":0},{"$f":"Summary!AD14/CO2_C","v":0},{"$f":"Summary!AE14/CO2_C","v":0},{"$f":"Summary!AF14/CO2_C","v":0},{"$f":"Summary!AG14/CO2_C","v":0}]
[null,"Emissions (MMTCO2 Eq.)"]
[null,null,1990,1991,1992,1993,1994,1995,1996,1997,1998,1999,2000,2001,2002,2003,2004,2005,2006,2007,2008,2009,2010,2011,2012,2013,2014,2015,2016,2017,2018,2019,2020,2021,2022,2023,2024,2025]
[null,"Natural Gas",{"$f":"IFERROR(((C19*MethGWP*10^-6)+C27),\"-\")","v":0},"-","-","-","-","-","-","-","-","-","-","-","-","-","-","-","-","-","-","-","-","-","-","-","-","-","-","-","-","-","-","-","-","-","-","-"]
[null,"Oil",{"$f":"C23*MethGWP*10^-6","v":0},{"$f":"D23*MethGWP*10^-6","v":0},0,0,0,0,0,0,0,0,0,0,0,0,0,0,0,0,0,0,0,0,0,0,0,0,0,0,0,0,0,{"$f":"AH23*MethGWP*10^-6","v":0},0,0,0,0]
[null,"Additional Emission Sources*",{"$f":"(IFERROR('Additional Emission Sources'!D36,0)+IFERROR('Additional Emission Sources'!D37,0))","v":0},{"$f":"IFERROR('Additional Emission Sources'!E36,0)+IFERROR('Additional Emission Sources'!E37,0)","v":0},{"$f":"IFERROR('Additional Emission Sources'!F36,0)+IFERROR('Additional Emission Sources'!F37,0)","v":0},{"$f":"IFERROR('Additional Emission Sources'!G36,0)+IFERROR('Additional Emission Sources'!G37,0)","v":0},{"$f":"IFERROR('Additional Emission Sources'!H36,0)+IFERROR('Additional Emission Sources'!H37,0)","v":0},{"$f":"IFERROR('Additional Emission Sources'!I36,0)+IFERROR('Additional Emission Sources'!I37,0)","v":0},{"$f":"IFERROR('Additional Emission Sources'!J36,0)+IFERROR('Additional Emission Sources'!J37,0)","v":0},{"$f":"IFERROR('Additional Emission Sources'!K36,0)+IFERROR('Additional Emission Sources'!K37,0)","v":0},{"$f":"IFERROR('Additional Emission Sources'!L36,0)+IFERROR('Additional Emission Sources'!L37,0)","v":0},{"$f":"IFERROR('Additional Emission Sources'!M36,0)+IFERROR('Additional Emission Sources'!M37,0)","v":0},{"$f":"IFERROR('Additional Emission Sources'!N36,0)+IFERROR('Additional Emission Sources'!N37,0)","v":0},{"$f":"IFERROR('Additional Emission Sources'!O36,0)+IFERROR('Additional Emission Sources'!O37,0)","v":0},{"$f":"IFERROR('Additional Emission Sources'!P36,0)+IFERROR('Additional Emission Sources'!P37,0)","v":0},{"$f":"IFERROR('Additional Emission Sources'!Q36,0)+IFERROR('Additional Emission Sources'!Q37,0)","v":0},{"$f":"IFERROR('Additional Emission Sources'!R36,0)+IFERROR('Additional Emission Sources'!R37,0)","v":0},{"$f":"IFERROR('Additional Emission Sources'!S36,0)+IFERROR('Additional Emission Sources'!S37,0)","v":0},{"$f":"IFERROR('Additional Emission Sources'!T36,0)+IFERROR('Additional Emission Sources'!T37,0)","v":0},{"$f":"IFERROR('Additional Emission Sources'!U36,0)+IFERROR('Additional Emission Sources'!U37,0)","v":0},{"$f":"IFERROR('Additional Emission Sources'!V36,0)+IFERROR('Additional Emission Sources'!V37,0)","v":0},{"$f":"IFERROR('Additional Emission Sources'!W36,0)+IFERROR('Additional Emission Sources'!W37,0)","v":0},{"$f":"IFERROR('Additional Emission Sources'!X36,0)+IFERROR('Additional Emission Sources'!X37,0)","v":0},{"$f":"IFERROR('Additional Emission Sources'!Y36,0)+IFERROR('Additional Emission Sources'!Y37,0)","v":0},{"$f":"IFERROR('Additional Emission Sources'!Z36,0)+IFERROR('Additional Emission Sources'!Z37,0)","v":0},{"$f":"IFERROR('Additional Emission Sources'!AA36,0)+IFERROR('Additional Emission Sources'!AA37,0)","v":0},{"$f":"IFERROR('Additional Emission Sources'!AB36,0)+IFERROR('Additional Emission Sources'!AB37,0)","v":0},{"$f":"IFERROR('Additional Emission Sources'!AC36,0)+IFERROR('Additional Emission Sources'!AC37,0)","v":0},{"$f":"IFERROR('Additional Emission Sources'!AD36,0)+IFERROR('Additional Emission Sources'!AD37,0)","v":0},{"$f":"IFERROR('Additional Emission Sources'!AE36,0)+IFERROR('Additional Emission Sources'!AE37,0)","v":0},{"$f":"IFERROR('Additional Emission Sources'!AF36,0)+IFERROR('Additional Emission Sources'!AF37,0)","v":0},{"$f":"IFERROR('Additional Emission Sources'!AG36,0)+IFERROR('Additional Emission Sources'!AG37,0)","v":0},{"$f":"IFERROR('Additional Emission Sources'!AH36,0)+IFERROR('Additional Emission Sources'!AH37,0)","v":0},{"$f":"IFERROR('Additional Emission Sources'!AI36,0)+IFERROR('Additional Emission Sources'!AI37,0)","v":0},{"$f":"IFERROR('Additional Emission Sources'!AJ36,0)+IFERROR('Additional Emission Sources'!AJ37,0)","v":0},{"$f":"IFERROR('Additional Emission Sources'!AK36,0)+IFERROR('Additional Emission Sources'!AK37,0)","v":0},{"$f":"IFERROR('Additional Emission Sources'!AL36,0)+IFERROR('Additional Emission Sources'!AL37,0)","v":0},{"$f":"IFERROR('Additional Emission Sources'!AM36,0)+IFERROR('Additional Emission Sources'!AM37,0)","v":0}]
[null,null,{"$f":"IF(ISERROR(IF(C12=0,0,COLUMN()-2)),0,IF(C12=0,0,COLUMN()-2))","v":0},{"$f":"IF(ISERROR(IF(D12=0,0,COLUMN()-2)),0,IF(D12=0,0,COLUMN()-2))","v":2},{"$f":"IF(ISERROR(IF(E12=0,0,COLUMN()-2)),0,IF(E12=0,0,COLUMN()-2))","v":3},{"$f":"IF(ISERROR(IF(F12=0,0,COLUMN()-2)),0,IF(F12=0,0,COLUMN()-2))","v":4},5,6,7,8,9,10,11,12,13,14,15,16,17,18,19,20,21,22,23,24,25,26,27,28,29,30,31,{"$f":"IF(ISERROR(IF(AH12=0,0,COLUMN()-2)),0,IF(AH12=0,0,COLUMN()-2))","v":32},33,34,35,36]
[null,null,1,{"$f":"IF(ISERROR(IF(D13=0,0,COLUMN()-2)),0,IF(D13=0,0,COLUMN()-2))","v":0},{"$f":"IF(ISERROR(IF(E13=0,0,COLUMN()-2)),0,IF(E13=0,0,COLUMN()-2))","v":0},{"$f":"IF(ISERROR(IF(F13=0,0,COLUMN()-2)),0,IF(F13=0,0,COLUMN()-2))","v":0},0,0,0,0,0,0,0,0,0,0,0,0,0,0,0,0,0,0,0,0,0,0,0,0,0,0,0,{"$f":"IF(ISERROR(IF(AH13=0,0,COLUMN()-2)),0,IF(AH13=0,0,COLUMN()-2))","v":0},0,0,0,0]
[null,"Emissions by Gas (MTCH4)"]
[null,null,1990,1991,1992,1993,1994,1995,1996,1997,1998,1999,2000,2001,2002,2003,2004,2005,2006,2007,2008,2009,2010,2011,2012,2013,2014,2015,2016,2017,2018,2019,2020,2021,2022,2023,2024,2025]
[null,"Natural Gas",{"$f":"IFERROR((SUM(C20:C22)),\"-\")","v":0},{"$f":"IFERROR((SUM(D20:D22)),\"-\")","v":"-"},"-","-","-","-","-","-","-","-","-","-","-","-","-","-","-","-","-","-","-","-","-","-","-","-","-","-","-","-","-","-","-","-","-","-"]
[null,"Production",{"$f":"IFERROR('Natural Gas - Production'!$H11,\"-\")","v":"-"},{"$f":"'Natural Gas - Production'!$H20","v":{"$error":"#N/A"}},{"$f":"'Natural Gas - Production'!$H29","v":{"$error":"#N/A"}},{"$f":"'Natural Gas - Production'!$H38","v":{"$error":"#N/A"}},{"$f":"'Natural Gas - Production'!$H47","v":{"$error":"#N/A"}},{"$f":"'Natural Gas - Production'!$H56","v":{"$error":"#N/A"}},{"$f":"'Natural Gas - Production'!$H65","v":{"$error":"#N/A"}},{"$f":"'Natural Gas - Production'!$H74","v":{"$error":"#N/A"}},{"$f":"'Natural Gas - Production'!$H83","v":{"$error":"#N/A"}},{"$f":"'Natural Gas - Production'!$H92","v":{"$error":"#N/A"}},{"$f":"'Natural Gas - Production'!$H101","v":{"$error":"#N/A"}},{"$f":"'Natural Gas - Production'!$H110","v":{"$error":"#N/A"}},{"$f":"'Natural Gas - Production'!$H119","v":{"$error":"#N/A"}},{"$f":"'Natural Gas - Production'!$H128","v":{"$error":"#N/A"}},{"$f":"'Natural Gas - Production'!$H137","v":{"$error":"#N/A"}},{"$f":"'Natural Gas - Production'!$H146","v":{"$error":"#N/A"}},{"$f":"'Natural Gas - Production'!$H155","v":{"$error":"#N/A"}},{"$f":"'Natural Gas - Production'!$H164","v":{"$error":"#N/A"}},{"$f":"'Natural Gas - Production'!$H173","v":{"$error":"#N/A"}},{"$f":"'Natural Gas - Production'!$H182","v":{"$error":"#N/A"}},{"$f":"'Natural Gas - Production'!$H191","v":{"$error":"#N/A"}},{"$f":"'Natural Gas - Production'!$H200","v":{"$error":"#N/A"}},{"$f":"'Natural Gas - Production'!$H209","v":{"$error":"#N/A"}},{"$f":"'Natural Gas - Production'!$H218","v":{"$error":"#N/A"}},{"$f":"'Natural Gas - Production'!$H227","v":{"$error":"#N/A"}},{"$f":"'Natural Gas - Production'!$H236","v":{"$error":"#N/A"}},{"$f":"'Natural Gas - Production'!$H245","v":{"$error":"#N/A"}},{"$f":"'Natural Gas - Production'!$H254","v":{"$error":"#N/A"}},{"$f":"'Natural Gas - Production'!$H263","v":{"$error":"#N/A"}},{"$f":"'Natural Gas - Production'!$H272","v":{"$error":"#N/A"}},{"$f":"'Natural Gas - Production'!$H281","v":{"$error":"#N/A"}},{"$f":"'Natural Gas - Production'!$H290","v":{"$error":"#N/A"}},{"$f":"'Natural Gas - Production'!$H299","v":{"$error":"#N/A"}},{"$f":"'Natural Gas - Production'!$H308","v":{"$error":"#N/A"}},{"$f":"'Natural Gas - Production'!$H317","v":{"$error":"#N/A"}},{"$f":"'Natural Gas - Production'!$H326","v":{"$error":"#N/A"}}]
[null,"Transmission",{"$f":"'Natural Gas - Transmission'!$H18","v":0},{"$f":"'Natural Gas - Transmission'!$H31","v":0},{"$f":"'Natural Gas - Transmission'!$H44","v":0},{"$f":"'Natural Gas - Transmission'!$H57","v":0},{"$f":"'Natural Gas - Transmission'!$H70","v":0},{"$f":"'Natural Gas - Transmission'!$H83","v":0},{"$f":"'Natural Gas - Transmission'!$H96","v":0},{"$f":"'Natural Gas - Transmission'!$H109","v":0},{"$f":"'Natural Gas - Transmission'!$H122","v":0},{"$f":"'Natural Gas - Transmission'!$H135","v":0},{"$f":"'Natural Gas - Transmission'!$H148","v":0},{"$f":"'Natural Gas - Transmission'!$H161","v":0},{"$f":"'Natural Gas - Transmission'!$H174","v":0},{"$f":"'Natural Gas - Transmission'!$H187","v":0},{"$f":"'Natural Gas - Transmission'!$H200","v":0},{"$f":"'Natural Gas - Transmission'!$H213","v":0},{"$f":"'Natural Gas - Transmission'!$H226","v":0},{"$f":"'Natural Gas - Transmission'!$H239","v":0},{"$f":"'Natural Gas - Transmission'!$H252","v":0},{"$f":"'Natural Gas - Transmission'!$H265","v":0},{"$f":"'Natural Gas - Transmission'!$H278","v":0},{"$f":"'Natural Gas - Transmission'!$H291","v":0},{"$f":"'Natural Gas - Transmission'!$H304","v":0},{"$f":"'Natural Gas - Transmission'!$H317","v":0},{"$f":"'Natural Gas - Transmission'!$H330","v":0},{"$f":"'Natural Gas - Transmission'!$H343","v":0},{"$f":"'Natural Gas - Transmission'!$H356","v":0},{"$f":"'Natural Gas - Transmission'!$H369","v":0},{"$f":"'Natural Gas - Transmission'!$H382","v":0},{"$f":"'Natural Gas - Transmission'!$H395","v":0},{"$f":"'Natural Gas - Transmission'!$H408","v":0},{"$f":"'Natural Gas - Transmission'!$H421","v":0},{"$f":"'Natural Gas - Transmission'!$H434","v":0},{"$f":"'Natural Gas - Transmission'!$H447","v":0},{"$f":"'Natural Gas - Transmission'!$H460","v":0},{"$f":"'Natural Gas - Transmission'!$H473","v":0}]
[null,"Distribution",{"$f":"'Natural Gas - Distribution'!$H22","v":0},{"$f":"'Natural Gas - Distribution'!$H40","v":0},{"$f":"'Natural Gas - Distribution'!$H58","v":0},{"$f":"'Natural Gas - Distribution'!$H76","v":0},{"$f":"'Natural Gas - Distribution'!$H94","v":0},{"$f":"'Natural Gas - Distribution'!$H112","v":0},{"$f":"'Natural Gas - Distribution'!$H130","v":0},{"$f":"'Natural Gas - Distribution'!$H148","v":0},{"$f":"'Natural Gas - Distribution'!$H166","v":0},{"$f":"'Natural Gas - Distribution'!$H184","v":0},{"$f":"'Natural Gas - Distribution'!$H202","v":0},{"$f":"'Natural Gas - Distribution'!$H220","v":0},{"$f":"'Natural Gas - Distribution'!$H238","v":0},{"$f":"'Natural Gas - Distribution'!$H256","v":0},{"$f":"'Natural Gas - Distribution'!$H274","v":0},{"$f":"'Natural Gas - Distribution'!$H292","v":0},{"$f":"'Natural Gas - Distribution'!$H310","v":0},{"$f":"'Natural Gas - Distribution'!$H328","v":0},{"$f":"'Natural Gas - Distribution'!$H346","v":0},{"$f":"'Natural Gas - Distribution'!$H364","v":0},{"$f":"'Natural Gas - Distribution'!$H382","v":0},{"$f":"'Natural Gas - Distribution'!$H400","v":0},{"$f":"'Natural Gas - Distribution'!$H418","v":0},{"$f":"'Natural Gas - Distribution'!$H436","v":0},{"$f":"'Natural Gas - Distribution'!$H454","v":0},{"$f":"'Natural Gas - Distribution'!$H472","v":0},{"$f":"'Natural Gas - Distribution'!$H490","v":0},{"$f":"'Natural Gas - Distribution'!$H508","v":0},{"$f":"'Natural Gas - Distribution'!$H526","v":0},{"$f":"'Natural Gas - Distribution'!$H544","v":0},{"$f":"'Natural Gas - Distribution'!$H562","v":0},{"$f":"'Natural Gas - Distribution'!$H580","v":0},{"$f":"'Natural Gas - Distribution'!$H598","v":0},{"$f":"'Natural Gas - Distribution'!$H616","v":0},{"$f":"'Natural Gas - Distribution'!$H634","v":0},{"$f":"'Natural Gas - Distribution'!$H652","v":0}]
[null,"Oil",{"$f":"'Petroleum Systems'!$H11","v":0},{"$f":"'Petroleum Systems'!$H20","v":0},{"$f":"'Petroleum Systems'!$H29","v":0},{"$f":"'Petroleum Systems'!$H38","v":0},{"$f":"'Petroleum Systems'!$H47","v":0},{"$f":"'Petroleum Systems'!$H56","v":0},{"$f":"'Petroleum Systems'!$H65","v":0},{"$f":"'Petroleum Systems'!$H74","v":0},{"$f":"'Petroleum Systems'!$H83","v":0},{"$f":"'Petroleum Systems'!$H92","v":0},{"$f":"'Petroleum Systems'!$H101","v":0},{"$f":"'Petroleum Systems'!$H110","v":0},{"$f":"'Petroleum Systems'!$H119","v":0},{"$f":"'Petroleum Systems'!$H128","v":0},{"$f":"'Petroleum Systems'!$H137","v":0},{"$f":"'Petroleum Systems'!$H146","v":0},{"$f":"'Petroleum Systems'!$H155","v":0},{"$f":"'Petroleum Systems'!$H164","v":0},{"$f":"'Petroleum Systems'!$H173","v":0},{"$f":"'Petroleum Systems'!$H182","v":0},{"$f":"'Petroleum Systems'!$H191","v":0},{"$f":"'Petroleum Systems'!$H200","v":0},{"$f":"'Petroleum Systems'!$H209","v":0},{"$f":"'Petroleum Systems'!$H218","v":0},{"$f":"'Petroleum Systems'!$H227","v":0},{"$f":"'Petroleum Systems'!$H236","v":0},{"$f":"'Petroleum Systems'!$H245","v":0},{"$f":"'Petroleum Systems'!$H254","v":0},{"$f":"'Petroleum Systems'!$H263","v":0},{"$f":"'Petroleum Systems'!$H272","v":0},{"$f":"'Petroleum Systems'!$H281","v":0},{"$f":"'Petroleum Systems'!$H290","v":0},{"$f":"'Petroleum Systems'!$H299","v":0},{"$f":"'Petroleum Systems'!$H308","v":0},{"$f":"'Petroleum Systems'!$H317","v":0},{"$f":"'Petroleum Systems'!$H326","v":0}]
[null,"Additional Emission Sources*",{"$f":"('Additional Emission Sources'!D37/MethGWP)*10^6","v":0},{"$f":"('Additional Emission Sources'!E37/MethGWP)*10^6","v":0},{"$f":"('Additional Emission Sources'!F37/MethGWP)*10^6","v":0},{"$f":"('Additional Emission Sources'!G37/MethGWP)*10^6","v":0},{"$f":"('Additional Emission Sources'!H37/MethGWP)*10^6","v":0},{"$f":"('Additional Emission Sources'!I37/MethGWP)*10^6","v":0},{"$f":"('Additional Emission Sources'!J37/MethGWP)*10^6","v":0},{"$f":"('Additional Emission Sources'!K37/MethGWP)*10^6","v":0},{"$f":"('Additional Emission Sources'!L37/MethGWP)*10^6","v":0},{"$f":"('Additional Emission Sources'!M37/MethGWP)*10^6","v":0},{"$f":"('Additional Emission Sources'!N37/MethGWP)*10^6","v":0},{"$f":"('Additional Emission Sources'!O37/MethGWP)*10^6","v":0},{"$f":"('Additional Emission Sources'!P37/MethGWP)*10^6","v":0},{"$f":"('Additional Emission Sources'!Q37/MethGWP)*10^6","v":0},{"$f":"('Additional Emission Sources'!R37/MethGWP)*10^6","v":0},{"$f":"('Additional Emission Sources'!S37/MethGWP)*10^6","v":0},{"$f":"('Additional Emission Sources'!T37/MethGWP)*10^6","v":0},{"$f":"('Additional Emission Sources'!U37/MethGWP)*10^6","v":0},{"$f":"('Additional Emission Sources'!V37/MethGWP)*10^6","v":0},{"$f":"('Additional Emission Sources'!W37/MethGWP)*10^6","v":0},{"$f":"('Additional Emission Sources'!X37/MethGWP)*10^6","v":0},{"$f":"('Additional Emission Sources'!Y37/MethGWP)*10^6","v":0},{"$f":"('Additional Emission Sources'!Z37/MethGWP)*10^6","v":0},{"$f":"('Additional Emission Sources'!AA37/MethGWP)*10^6","v":0},{"$f":"('Additional Emission Sources'!AB37/MethGWP)*10^6","v":0},{"$f":"('Additional Emission Sources'!AC37/MethGWP)*10^6","v":0},{"$f":"('Additional Emission Sources'!AD37/MethGWP)*10^6","v":0},{"$f":"('Additional Emission Sources'!AE37/MethGWP)*10^6","v":0},{"$f":"('Additional Emission Sources'!AF37/MethGWP)*10^6","v":0},{"$f":"('Additional Emission Sources'!AG37/MethGWP)*10^6","v":0},{"$f":"('Additional Emission Sources'!AH37/MethGWP)*10^6","v":0},{"$f":"('Additional Emission Sources'!AI37/MethGWP)*10^6","v":0},{"$f":"('Additional Emission Sources'!AJ37/MethGWP)*10^6","v":0},{"$f":"('Additional Emission Sources'!AK37/MethGWP)*10^6","v":0},{"$f":"('Additional Emission Sources'!AL37/MethGWP)*10^6","v":0},{"$f":"('Additional Emission Sources'!AM37/MethGWP)*10^6","v":0}]
[null,"Emissions by Gas (MMTCO2)"]
[null,null,1990,1991,1992,1993,1994,1995,1996,1997,1998,1999,2000,2001,2002,2003,2004,2005,2006,2007,2008,2009,2010,2011,2012,2013,2014,2015,2016,2017,2018,2019,2020,2021,2022,2023,2024,2025]
[null,"Natural Gas Flaring",{"$f":"'Natural Gas - Venting_Flaring'!$N$8*CO2_C","v":0},{"$f":"'Natural Gas - Venting_Flaring'!$N$15*CO2_C","v":0},{"$f":"'Natural Gas - Venting_Flaring'!$N$22*CO2_C","v":0},{"$f":"'Natural Gas - Venting_Flaring'!$N$29*CO2_C","v":0},{"$f":"'Natural Gas - Venting_Flaring'!$N$36*CO2_C","v":0},{"$f":"'Natural Gas - Venting_Flaring'!$N$43*CO2_C","v":0},{"$f":"'Natural Gas - Venting_Flaring'!$N$50*CO2_C","v":0},{"$f":"'Natural Gas - Venting_Flaring'!$N$57*CO2_C","v":0},{"$f":"'Natural Gas - Venting_Flaring'!$N$64*CO2_C","v":0},{"$f":"'Natural Gas - Venting_Flaring'!$N$71*CO2_C","v":0},{"$f":"'Natural Gas - Venting_Flaring'!$N$78*CO2_C","v":0},{"$f":"'Natural Gas - Venting_Flaring'!$N$85*CO2_C","v":0},{"$f":"'Natural Gas - Venting_Flaring'!$N$92*CO2_C","v":0},{"$f":"'Natural Gas - Venting_Flaring'!$N$99*CO2_C","v":0},{"$f":"'Natural Gas - Venting_Flaring'!$N$106*CO2_C","v":0},{"$f":"'Natural Gas - Venting_Flaring'!$N$113*CO2_C","v":0},{"$f":"'Natural Gas - Venting_Flaring'!$N$120*CO2_C","v":0},{"$f":"'Natural Gas - Venting_Flaring'!$N$127*CO2_C","v":0},{"$f":"'Natural Gas - Venting_Flaring'!$N$134*CO2_C","v":0},{"$f":"'Natural Gas - Venting_Flaring'!$N$141*CO2_C","v":0},{"$f":"'Natural Gas - Venting_Flaring'!$N$148*CO2_C","v":0},{"$f":"'Natural Gas - Venting_Flaring'!$N$155*CO2_C","v":0},{"$f":"'Natural Gas - Venting_Flaring'!$N$162*CO2_C","v":0},{"$f":"'Natural Gas - Venting_Flaring'!$N$169*CO2_C","v":0},{"$f":"'Natural Gas - Venting_Flaring'!$N$176*CO2_C","v":0},{"$f":"'Natural Gas - Venting_Flaring'!$N$183*CO2_C","v":0},{"$f":"'Natural Gas - Venting_Flaring'!$N$190*CO2_C","v":0},{"$f":"'Natural Gas - Venting_Flaring'!$N$197*CO2_C","v":0},{"$f":"'Natural Gas - Venting_Flaring'!$N$204*CO2_C","v":0},{"$f":"'Natural Gas - Venting_Flaring'!$N$211*CO2_C","v":0},{"$f":"'Natural Gas - Venting_Flaring'!$N$218*CO2_C","v":0},{"$f":"'Natural Gas - Venting_Flaring'!$N$225*CO2_C","v":0},{"$f":"'Natural Gas - Venting_Flaring'!$N$232*CO2_C","v":0},{"$f":"'Natural Gas - Venting_Flaring'!$N$239*CO2_C","v":0},{"$f":"'Natural Gas - Venting_Flaring'!$N$246*CO2_C","v":0},{"$f":"'Natural Gas - Venting_Flaring'!$N$253*CO2_C","v":0}]
[null,"Additional Emission Sources*",{"$f":"'Additional Emission Sources'!D36","v":0},{"$f":"'Additional Emission Sources'!E36","v":0},{"$f":"'Additional Emission Sources'!F36","v":0},{"$f":"'Additional Emission Sources'!G36","v":0},{"$f":"'Additional Emission Sources'!H36","v":0},{"$f":"'Additional Emission Sources'!I36","v":0},{"$f":"'Additional Emission Sources'!J36","v":0},{"$f":"'Additional Emission Sources'!K36","v":0},{"$f":"'Additional Emission Sources'!L36","v":0},{"$f":"'Additional Emission Sources'!M36","v":0},{"$f":"'Additional Emission Sources'!N36","v":0},{"$f":"'Additional Emission Sources'!O36","v":0},{"$f":"'Additional Emission Sources'!P36","v":0},{"$f":"'Additional Emission Sources'!Q36","v":0},{"$f":"'Additional Emission Sources'!R36","v":0},{"$f":"'Additional Emission Sources'!S36","v":0},{"$f":"'Additional Emission Sources'!T36","v":0},{"$f":"'Additional Emission Sources'!U36","v":0},{"$f":"'Additional Emission Sources'!V36","v":0},{"$f":"'Additional Emission Sources'!W36","v":0},{"$f":"'Additional Emission Sources'!X36","v":0},{"$f":"'Additional Emission Sources'!Y36","v":0},{"$f":"'Additional Emission Sources'!Z36","v":0},{"$f":"'Additional Emission Sources'!AA36","v":0},{"$f":"'Additional Emission Sources'!AB36","v":0},{"$f":"'Additional Emission Sources'!AC36","v":0},{"$f":"'Additional Emission Sources'!AD36","v":0},{"$f":"'Additional Emission Sources'!AE36","v":0},{"$f":"'Additional Emission Sources'!AF36","v":0},{"$f":"'Additional Emission Sources'!AG36","v":0},{"$f":"'Additional Emission Sources'!AH36","v":0},{"$f":"'Additional Emission Sources'!AI36","v":0},{"$f":"'Additional Emission Sources'!AJ36","v":0},{"$f":"'Additional Emission Sources'!AK36","v":0},{"$f":"'Additional Emission Sources'!AL36","v":0},{"$f":"'Additional Emission Sources'!AM36","v":0}]
[]
[]
[]
[null,null,null,null,null,null,null,null,null,null,null,null,null,{"$f":"\"Greenhouse Gas Emissions from Natural Gas and Oil Activites, 1990-\"&B51","v":"Greenhouse Gas Emissions from Natural Gas and Oil Activites, 1990-1990"}]
[]
[]
[]
[]
[]
[]
[]
[]
[]
[]
[]
[]
[]
[]
[]
[]
[]
[]
[null,{"$f":"MAX(C51:AL51)","v":1990},1990,{"$f":"IFERROR((IF(D12+D13=0,0,D11)),0)","v":0},{"$f":"IFERROR((IF(E12+E13=0,0,E11)),0)","v":0},0,0,0,0,0,0,0,0,0,0,0,0,0,0,0,0,0,0,0,0,{"$f":"IFERROR((IF(Z12+Z13=0,0,Z11)),0)","v":0},0,0,0,0,0,0,0,0,0,0,0,0]

{"sheet":"Tracker","index":10,"n_rows":14,"n_cols":7,"rows_kept":14,"cut":false,"hidden":true,"merged":[]}
["Sector","Sum","Not included?","Text of missing sector","\"and\"?","Punctuation","Text used"]
["Natural Gas Production",{"$f":"SUM(Summary!C20:AL20)","v":{"$error":"#N/A"}},{"$f":"IF(ISERROR(B2),TRUE,IF(B2=0,TRUE,FALSE))","v":true},{"$f":"IF(C2=TRUE,\" \"&A2,\"\")","v":" Natural Gas Production"},{"$f":"IF(AND($C$10=A2,$C$9>1),\" and\",\"\")","v":""},{"$f":"IF(C2=TRUE,IF($C$10=A2,\".\",\",\"),\"\")","v":","},{"$f":"E2&D2&F2","v":" Natural Gas Production,"}]
["Natural Gas Flaring",{"$f":"SUM(Summary!C27:AL27)","v":0},{"$f":"IF(ISERROR(B3),TRUE,IF(B3=0,TRUE,FALSE))","v":true},{"$f":"IF(C3=TRUE,\" \"&A3,\"\")","v":" Natural Gas Flaring"},{"$f":"IF(AND($C$10=A3,$C$9>1),\" and\",\"\")","v":""},{"$f":"IF(C3=TRUE,IF($C$10=A3,\".\",\",\"),\"\")","v":","},{"$f":"E3&D3&F3","v":" Natural Gas Flaring,"}]
["Natural Gas Transmission",{"$f":"SUM(Summary!C21:AL21)","v":0},{"$f":"IF(ISERROR(B4),TRUE,IF(B4=0,TRUE,FALSE))","v":true},{"$f":"IF(C4=TRUE,\" \"&A4,\"\")","v":" Natural Gas Transmission"},{"$f":"IF(AND($C$10=A4,$C$9>1),\" and\",\"\")","v":""},{"$f":"IF(C4=TRUE,IF($C$10=A4,\".\",\",\"),\"\")","v":","},{"$f":"E4&D4&F4","v":" Natural Gas Transmission,"}]
["Natural Gas Distribution",{"$f":"SUM(Summary!C22:AL22)","v":0},{"$f":"IF(ISERROR(B5),TRUE,IF(B5=0,TRUE,FALSE))","v":true},{"$f":"IF(C5=TRUE,\" \"&A5,\"\")","v":" Natural Gas Distribution"},{"$f":"IF(AND($C$10=A5,$C$9>1),\" and\",\"\")","v":""},{"$f":"IF(C5=TRUE,IF($C$10=A5,\".\",\",\"),\"\")","v":","},{"$f":"E5&D5&F5","v":" Natural Gas Distribution,"}]
["Oil",{"$f":"SUM(Summary!C23:AL23)","v":0},{"$f":"IF(ISERROR(B6),TRUE,IF(B6=0,TRUE,FALSE))","v":true},{"$f":"IF(C6=TRUE,\" \"&A6,\"\")","v":" Oil"},{"$f":"IF(AND($C$10=A6,$C$9>1),\" and\",\"\")","v":" and"},{"$f":"IF(C6=TRUE,IF($C$10=A6,\".\",\",\"),\"\")","v":"."},{"$f":"E6&D6&F6","v":" and Oil."}]
[]
[]
[null,"Count",{"$f":"COUNTIF(C2:C8,TRUE)","v":5}]
[null,"Last",{"$f":"IF(C8=TRUE,A8,IF(C7=TRUE,A7,IF(C6=TRUE,A6,IF(C5=TRUE,A5,IF(C4=TRUE,A4,IF(C2=TRUE,A2,))))))","v":"Oil"}]
[]
["Part A",{"$f":"IF(C9>1,\"Emissions were not calculated for the following sources:\",\"Emissions were not calculated for the following source:\")","v":"Emissions were not calculated for the following sources:"}]
["Part B",{"$f":"G2&G3&G4&G5&G6&G7&G8","v":" Natural Gas Production, Natural Gas Flaring, Natural Gas Transmission, Natural Gas Distribution, and Oil."}]
["Final",{"$f":"IF(C9=0,0,B12&B13)","v":"Emissions were not calculated for the following sources: Natural Gas Production, Natural Gas Flaring, Natural Gas Transmission, Natural Gas Distribution, and Oil."}]

{"sheet":"Uncertainty","index":11,"n_rows":3,"n_cols":2,"rows_kept":3,"cut":false,"hidden":false,"merged":[]}
[]
["Uncertainty Associated With Natural Gas and Oil Emissions Estimates"]
[null,"Excerpted from EIIP Guidance, Chapter 5."]

{"sheet":"Gas Data Sources","index":12,"n_rows":47,"n_cols":3,"rows_kept":47,"cut":false,"hidden":false,"merged":[[6,1,6,2],[46,1,46,2],[45,1,45,2],[43,1,43,2],[42,1,42,2],[44,1,44,2]]}
[]
[]
[]
[null,"Activity Factor for Natural Gas - Production","Recommended Source"]
[]
[null,"Total number of wells","EIA Natural Gas Navigator"]
[null,"Data on the total number of wells are from EIA's Natural Gas Navigator. \"Number of Producing Gas Wells\" https://www.eia.gov/dnav/ng/NG_PROD_WELLS_S1_A.htm"]
[null,"Number of off-shore platforms in the Gulf of Mexico","BOEM*"]
[null,"Number of off-shore platforms not including those in the Gulf of Mexico","BOEM*"]
[]
[]
[]
[]
[]
[]
[" "]
[null,"Activity Factor for Natural Gas - Transmission","Recommended Source"]
[null,"Miles of gathering pipeline ","OPS**"]
[null,"Number of gas processing plants","Oil and Gas Journal "]
[null,"Number of gas transmission compressor stations1","State Sources / EIAGIS2/ EIA† "]
[null,"Number of gas storage compressor stations1","State Sources / EIAGIS/ EIA Natural Gas Annual"]
[null,"Miles of transmission pipeline","OPS"]
[null,"Number of LNG storage compressor stations","State Sources / EIAGIS/ EIA  "]
[]
[]
[]
[null,"Activity Factor for Natural Gas - Distribution","Recommended Source"]
[null,"Miles of cast iron distribution pipeline","OPS"]
[null,"Miles of unprotected steel distribution pipeline","OPS"]
[null,"Miles of protected steel distribution pipeline","OPS"]
[null,"Miles of plastic distribution pipeline","OPS"]
[null,"Total number of services","OPS"]
[null,"Number of unprotected steel services","OPS"]
[null,"Number of protected steel services","OPS"]
[]
[]
[null,"Activity Factor for Natural Gas - Production","Recommended Source"]
[null,"Natural Gas Vented and Flared","EIA Natural Gas Navigator"]
[]
[]
[null,"Notes"]
[]
[null,"1 If this data is not available, an alternate method using miles of transmission pipeline may be used.  See the sheet \"Natural Gas - Transmission\" "]
[null,"2 After 9/11 the EIA GIS database is not publicly available."]
[null,"* Bureu of Ocean Energy Management (BOEM) is a comprehensive source of data for off-shore oil and gas production activities.  The website is http://www.boem.gov."]
[null,"** The Office of Pipeline Safety (OPS) has detailed and exhaustive data on all kinds of pipeline (transmission, gathering, distribution, services) and it is accessible to the public on the website https://www.phmsa.dot.gov/about-phmsa/offices/office-pipeline-safety. The phone number is 202-366-4595."]
[null,"† The Energy Information Administration is available online at http://eia.doe.gov, by phone at 202-586-8800, and by email at infoctr@eia.doe.gov."]

{"sheet":"Additional Data Sources","index":13,"n_rows":6,"n_cols":4,"rows_kept":6,"cut":false,"hidden":false,"merged":[[0,0,0,8],[5,3,5,6],[6,2,6,7]]}
["Possible Data Sources for Additional Emission Sources"]
[]
[]
[null,"Additional Emission Sources"]
[null,null,"For state-level data on additional emission sources go to:"]
[null,null,null,"https://www.epa.gov/ghgemissions/state-ghg-emissions-and-removals"]

{"sheet":"Oil Data Sources","index":14,"n_rows":31,"n_cols":8,"rows_kept":31,"cut":false,"hidden":false,"merged":[[24,1,24,4],[30,1,30,7],[7,3,7,4],[16,2,16,4],[17,2,17,4],[23,1,23,4],[8,1,8,4],[2,3,2,4],[15,2,15,4],[14,2,14,4],[13,2,13,4],[11,2,11,4],[3,1,3,2],[3,3,3,4],[12,2,12,4],[2,1,2,2],[4,1,4,2],[5,1,5,2],[6,1,6,2],[7,1,7,2],[4,3,4,4],[5,3,5,4],[6,3,6,4]]}
[]
[]
[null,"Activity Data for Petroleum Systems",null,"Recommended Source"]
[]
[null,"All the activity data for petroleum systems ",null,"EIA's Petroleum Supply Annual (PSA)† "]
[null,"Oil Production",null,"PSA Table 14 "]
[null,"Oil Refined",null,"PSA Table 18 and Table 1*"]
[null,"Oil Transported",null,"Assumed to equal the amount of oil refined as estimated above."]
[null,"EIA data available online at: http://www.eia.gov/dnav/pet/PET_CRD_CRPDN_ADC_MBBL_A.htm"]
[]
[null,"Petroleum Administration for Defense (PAD) Districts"]
[null,"PAD District","States Included"]
[]
[null,"I","ME, NH, VT, MA, RI, CT, NJ, DE, MD, DC, VA, NC, SC, GA, FL, NY, PA, WV"]
[null,"II","IN,IL,KY,TN, MI, OH, MN, WI, ND, SD, OK, KS, MO, NE, IA"]
[null,"III","TX, MS, LA, AR, AL, NM"]
[null,"IV","MT, WY, CO, UT, ID "]
[null,"V","WA, OR, NV, CA, AZ, AK, HI"]
[null,"Source","Petroleum Supply Annual 2023, Appendix A, page 123"]
[]
[]
[null,"Notes"]
[]
[null,"† The Energy Information Administration is available online at http://eia.doe.gov, by phone at 202-586-8800, and by email at infoctr@eia.doe.gov."]
[null,"*Table found in the EIA's Refinery Capacity Report. This method assumes that refining in your state equals the total input of crude oil into your PADD times the ratio of your state's refining capacity to your PADD's total refining capacity. Use the calculator below to estimate oil refined for your state. "]
[]
[null,"Calculator to Estimate Amount of Crude Oil Refined Annually"]
[null,"User inputs are yellow, calculations are white, and the final product is gray."]
[null,"Daily Gross Crude Input into Refinery for PADD1 '000 bbl","Annual Gross Crude Input into Refinery for PADD (Daily x 365) '000 bbl","State Operating Refining Capacity '000 bbl Daily","State Operating Refining Capacity '000 bbl Annual = Daily x 365","PADD Operating Refining Capacity Daily '000 Barrels","PADD Operating Refining Capacity Annual = Daily x 365","Estimated Crude Refined Annually '000 bbl"]
[null,null,{"$f":"365*B30","v":0},null,{"$f":"D30*365","v":0},null,{"$f":"F30*365","v":0},{"$f":"IF(G30=0,0,C30*E30/G30)","v":0}]
[null,"1 This is the Gross Input that goes into the Atmospheric Crude Distillation Unit of a Refinery (Data available from Table 16 of PSA for the respective year)."]

{"sheet":"Emission Factors","index":15,"n_rows":97,"n_cols":40,"rows_kept":97,"cut":false,"hidden":false,"merged":[[3,1,3,3],[3,4,3,6],[3,7,3,9],[0,0,0,7]]}
["Note: The activity data and total emissions below are national, not state totals.  They are used to calculate the implied emission factors that can be used at the state level when more specific data is not available."]
[]
["Implied Emission Factors for Oil Activities- From PetroleumSystems_90_22_FR.xlsx"]
["Year","Activity Data",null,null,"Total Emissions (Gg/yr) from",null,null,"Implied Emissions Factor kg/1000 bbl"]
[null,"Production ('000 Barrels/day)","Refining ('000 Barrels/day)","Transportation (MMBarrels/yr)","Production ","Refining","Transportation","Production","Refining","Transportation"]
[1990,7355.3068493150686,13409.257534246575,4894.2849999999999,1626.337617803365,25.742170894170656,6.5504311947334779,{"$f":"E6*Control!$D$74/(B6*Control!$D$77)","v":605.78295265085467},{"$f":"F6*Control!$D$74/(C6*Control!$D$77)","v":5.2595377052268848},{"$f":"G6*Control!$D$74/(D6*Control!$D$76)","v":1.3383836852029414}]
[1991,7416.5452054794523,13301.413698630136,4854.8649999999998,1629.7532148161254,25.535139711479811,6.508857570702296,{"$f":"E7*Control!$D$74/(B7*Control!$D$77)","v":602.04275402612427},{"$f":"F7*Control!$D$74/(C7*Control!$D$77)","v":5.2595377052268857},{"$f":"G7*Control!$D$74/(D7*Control!$D$76)","v":1.3406876546932398}]
[1992,7190.7726027397257,13448.227397260274,4895.0150000000003,1597.5377386703813,25.816982558489805,6.2950776381449289,{"$f":"E8*Control!$D$74/(B8*Control!$D$77)","v":608.67113510403794},{"$f":"F8*Control!$D$74/(C8*Control!$D$77)","v":5.2595377052268848},{"$f":"G8*Control!$D$74/(D8*Control!$D$76)","v":1.2860180485953423}]
[1993,6846.6657534246579,13612.715068493151,4968.7449999999999,1595.7215992664949,26.132754683236211,6.1873466047388321,{"$f":"E9*Control!$D$74/(B9*Control!$D$77)","v":638.53562528645875},{"$f":"F9*Control!$D$74/(C9*Control!$D$77)","v":5.2595377052268839},{"$f":"G9*Control!$D$74/(D9*Control!$D$76)","v":1.2452533999508593}]
[1994,6661.5780821917806,13866.057534246575,5061.09,1586.7776161498139,26.61910413483854,6.0742506067086763,{"$f":"E10*Control!$D$74/(B10*Control!$D$77)","v":652.59851059595644},{"$f":"F10*Control!$D$74/(C10*Control!$D$77)","v":5.2595377052268839},{"$f":"G10*Control!$D$74/(D10*Control!$D$76)","v":1.2001862457906649}]
[1995,6559.6383561643834,13973.471232876713,5099.78,1599.4862116072061,26.825309570109674,5.9695095716965261,{"$f":"E11*Control!$D$74/(B11*Control!$D$77)","v":668.0481097384278},{"$f":"F11*Control!$D$74/(C11*Control!$D$77)","v":5.2595377052268857},{"$f":"G11*Control!$D$74/(D11*Control!$D$76)","v":1.1705425668747527}]
[1996,6482.2383561643837,14233.602739726028,5181.1750000000002,1650.3911044489942,27.324692156145552,5.9238555665581298,{"$f":"E12*Control!$D$74/(B12*Control!$D$77)","v":697.53983358910534},{"$f":"F12*Control!$D$74/(C12*Control!$D$77)","v":5.2595377052268857},{"$f":"G12*Control!$D$74/(D12*Control!$D$76)","v":1.1433421118873865}]
[1997,6451.5917808219174,14661.550684931506,5338.49,1656.5077703793527,28.146237205239693,5.8941940148988499,{"$f":"E13*Control!$D$74/(B13*Control!$D$77)","v":703.4508083082618},{"$f":"F13*Control!$D$74/(C13*Control!$D$77)","v":5.2595377052268848},{"$f":"G13*Control!$D$74/(D13*Control!$D$76)","v":1.1040938570455034},null,null,"https://www.eia.gov/dnav/pet/pet_pnp_caprec_dcu_nus_a.htm"]
[1998,6251.8328767123285,14888.720547945206,5434.4849999999997,1618.8996339368496,28.582342293143991,5.9457534101016352,{"$f":"E14*Control!$D$74/(B14*Control!$D$77)","v":709.44658155563343},{"$f":"F14*Control!$D$74/(C14*Control!$D$77)","v":5.2595377052268839},{"$f":"G14*Control!$D$74/(D14*Control!$D$76)","v":1.0940785391995074},null,null,2570879]
[1999,5881.4575342465751,14803.972602739726,5403.45,1577.5777502510973,28.419649013308209,5.5362710349355417,{"$f":"E15*Control!$D$74/(B15*Control!$D$77)","v":734.87410177474283},{"$f":"F15*Control!$D$74/(C15*Control!$D$77)","v":5.2595377052268848},{"$f":"G15*Control!$D$74/(D15*Control!$D$76)","v":1.0245807835615286},null,null,110284]
[2000,5837.5534246575344,15107.931506849314,5514.3950000000004,1585.7273594673163,29.003168424014607,5.1952526026801591,{"$f":"E16*Control!$D$74/(B16*Control!$D$77)","v":744.22591161868638},{"$f":"F16*Control!$D$74/(C16*Control!$D$77)","v":5.2595377052268848},{"$f":"G16*Control!$D$74/(D16*Control!$D$76)","v":0.94212558271218494},null,null,164278]
[2001,5801.4,15127.772602739726,5521.6369999999997,1584.2677183643341,29.041257996075856,5.1590578837734906,{"$f":"E17*Control!$D$74/(B17*Control!$D$77)","v":748.17449277209619},{"$f":"F17*Control!$D$74/(C17*Control!$D$77)","v":5.2595377052268839},{"$f":"G17*Control!$D$74/(D17*Control!$D$76)","v":0.93433485101854596},null,null,{"$f":"SUM(M14:M16)/365","v":7795.728767123288},"000 barrels/day "]
[2002,5744.0767123287669,14946.657534246575,5456,1577.5024712425993,28.693565736996426,5.1798588306128783,{"$f":"E18*Control!$D$74/(B18*Control!$D$77)","v":752.41414681501533},{"$f":"F18*Control!$D$74/(C18*Control!$D$77)","v":5.2595377052268848},{"$f":"G18*Control!$D$74/(D18*Control!$D$76)","v":0.94938761558153928}]
[2003,5649.3013698630139,15303.767123287671,5585.875,1589.6408209422441,29.37912017918422,5.2698014465865608,{"$f":"E19*Control!$D$74/(B19*Control!$D$77)","v":770.92370298775893},{"$f":"F19*Control!$D$74/(C19*Control!$D$77)","v":5.2595377052268839},{"$f":"G19*Control!$D$74/(D19*Control!$D$76)","v":0.94341556991278186}]
[2004,5455.8739726027397,15517.427397260273,5663.8609999999999,1591.7211098608052,29.789290486664047,5.2123450530470254,{"$f":"E20*Control!$D$74/(B20*Control!$D$77)","v":799.29994258333875},{"$f":"F20*Control!$D$74/(C20*Control!$D$77)","v":5.2595377052268839},{"$f":"G20*Control!$D$74/(D20*Control!$D$76)","v":0.92028124508123088}]
[2005,5183.821917808219,15220.087671232877,5555.3320000000003,1499.5271786190815,29.218478119053483,5.122682426600953,{"$f":"E21*Control!$D$74/(B21*Control!$D$77)","v":792.52214007176246},{"$f":"F21*Control!$D$74/(C21*Control!$D$77)","v":5.2595377052268857},{"$f":"G21*Control!$D$74/(D21*Control!$D$76)","v":0.92211994289467358}]
[2006,5085.8630136986303,15242.065753424658,5563.3540000000003,1591.3258060449555,29.260670130524808,5.033601975531921,{"$f":"E22*Control!$D$74/(B22*Control!$D$77)","v":857.23833244177013},{"$f":"F22*Control!$D$74/(C22*Control!$D$77)","v":5.2595377052268839},{"$f":"G22*Control!$D$74/(D22*Control!$D$76)","v":0.90477830020018868}]
[2007,5073.9013698630133,15156.430136986301,5532.0969999999998,1573.4971009575609,29.09627276047253,5.1112676872597778,{"$f":"E23*Control!$D$74/(B23*Control!$D$77)","v":849.6323927644562},{"$f":"F23*Control!$D$74/(C23*Control!$D$77)","v":5.2595377052268839},{"$f":"G23*Control!$D$74/(D23*Control!$D$76)","v":0.92392951303272108}]
[2008,5013.3698630136987,14688.457534246576,5361.2870000000003,1626.0556924172311,28.19789112504273,5.0496832077239375,{"$f":"E24*Control!$D$74/(B24*Control!$D$77)","v":888.61329290293963},{"$f":"F24*Control!$D$74/(C24*Control!$D$77)","v":5.2595377052268848},{"$f":"G24*Control!$D$74/(D24*Control!$D$76)","v":0.94187891969296511}]
[2009,5356.6958904109588,14336.043835616438,5232.6559999999999,1580.7701742085644,27.521351530481684,4.9401613635890902,{"$f":"E25*Control!$D$74/(B25*Control!$D$77)","v":808.49786476869531},{"$f":"F25*Control!$D$74/(C25*Control!$D$77)","v":5.2595377052268839},{"$f":"G25*Control!$D$74/(D25*Control!$D$76)","v":0.9441020704569707}]
[2010,5484.3972602739723,14723.545205479451,5374.0940000000001,1577.5840068689392,28.059821332730476,4.9908631003690536,{"$f":"E26*Control!$D$74/(B26*Control!$D$77)","v":788.08076054807509},{"$f":"F26*Control!$D$74/(C26*Control!$D$77)","v":5.2213119704885091},{"$f":"G26*Control!$D$74/(D26*Control!$D$76)","v":0.92868920796120313}]
[2011,5674.2054794520545,14806.430136986301,5404.3469999999998,1609.4132524985412,30.083601623777817,5.2436570207985103,{"$f":"E27*Control!$D$74/(B27*Control!$D$77)","v":777.0870111552839},{"$f":"F27*Control!$D$74/(C27*Control!$D$77)","v":5.566556259947375},{"$f":"G27*Control!$D$74/(D27*Control!$D$76)","v":0.97026653188600032}]
[2012,6541.6438356164381,15039.769863013698,5489.5159999999996,1555.8739474330873,29.298316733132026,6.1653547741648156,{"$f":"E28*Control!$D$74/(B28*Control!$D$77)","v":651.62036580520476},{"$f":"F28*Control!$D$74/(C28*Control!$D$77)","v":5.337140238434869},{"$f":"G28*Control!$D$74/(D28*Control!$D$76)","v":1.1231144556578059}]
[2013,7495.4,15312.345205479452,5589.0060000000003,1954.8957342387951,27.515781330608601,7.1717744087458559,{"$f":"E29*Control!$D$74/(B29*Control!$D$77)","v":714.55542385221656},{"$f":"F29*Control!$D$74/(C29*Control!$D$77)","v":4.923197672467805},{"$f":"G29*Control!$D$74/(D29*Control!$D$76)","v":1.2831931847533991}]
[2014,8781.4493150684939,15848.320547945206,5784.6369999999997,2070.0439979397979,26.991644573891751,8.2137889801100759,{"$f":"E30*Control!$D$74/(B30*Control!$D$77)","v":645.83341718791314},{"$f":"F30*Control!$D$74/(C30*Control!$D$77)","v":4.6660913336293621},{"$f":"G30*Control!$D$74/(D30*Control!$D$76)","v":1.4199316188915703}]
[2015,9431.961643835617,16187.808219178081,5908.55,2071.540314523495,29.107861473596397,8.3565791394899147,{"$f":"E31*Control!$D$74/(B31*Control!$D$77)","v":601.72561454509241},{"$f":"F31*Control!$D$74/(C31*Control!$D$77)","v":4.9263967426181381},{"$f":"G31*Control!$D$74/(D31*Control!$D$76)","v":1.4143197805705146}]
[2016,8874.2986301369856,16231.219178082192,5924.3950000000004,1763.3716549595031,28.138236771241438,8.0437579030292436,439.42633392140175,6.2601672358795826,{"$f":"G32*Control!$D$74/(D32*Control!$D$76)","v":1.3577349084639434}]
[2017,9359.5808219178089,16589.701369863014,6055.241,2115.1283678064347,29.773047226125151,7.5933644965679514,{"$f":"E33*Control!$D$74/(B33*Control!$D$77)","v":619.13800957788897},{"$f":"F33*Control!$D$74/(C33*Control!$D$77)","v":4.9169054090704485},{"$f":"G33*Control!$D$74/(D33*Control!$D$76)","v":1.254015240114795}]
[2018,10959.471232876713,16969.402739726029,6193.8320000000003,2052.3904283380743,27.804351619831664,8.301590341634892,{"$f":"E34*Control!$D$74/(B34*Control!$D$77)","v":513.07105565738834},{"$f":"F34*Control!$D$74/(C34*Control!$D$77)","v":4.4890387113876606},{"$f":"G34*Control!$D$74/(D34*Control!$D$76)","v":1.3402995660255059}]
[2019,12313.950684931508,16562.728767123288,6045.3959999999997,1808.850791165903,30.813795662832668,9.0209990391567274,{"$f":"E35*Control!$D$74/(B35*Control!$D$77)","v":402.4504985471213},{"$f":"F35*Control!$D$74/(C35*Control!$D$77)","v":5.0970681925274484},{"$f":"G35*Control!$D$74/(D35*Control!$D$76)","v":1.4922097806589887}]
[2020,11353.928767123287,14250.94794520548,5201.5959999999995,1858.2927224148077,25.860638081412013,8.2315766457945063,{"$f":"E36*Control!$D$74/(B36*Control!$D$77)","v":448.40980091974876},{"$f":"F36*Control!$D$74/(C36*Control!$D$77)","v":4.971673709648349},{"$f":"G36*Control!$D$74/(D36*Control!$D$76)","v":1.5825098000295499}]
[2021,11308.158904109589,15146.504109589041,5528.4740000000002,1696.4156364480507,25.366217187100105,7.8664230148581069,{"$f":"E37*Control!$D$74/(B37*Control!$D$77)","v":411.00537336553964},{"$f":"F37*Control!$D$74/(C37*Control!$D$77)","v":4.5882855173236061},{"$f":"G37*Control!$D$74/(D37*Control!$D$76)","v":1.4228922872492675}]
[2022,11992.246575342466,15977.246575342466,5831.6949999999997,1377.4266366912868,24.684646904872043,8.3259991862307814,{"$f":"E38*Control!$D$74/(B38*Control!$D$77)","v":314.684290692682},{"$f":"F38*Control!$D$74/(C38*Control!$D$77)","v":4.2328425791938775},{"$f":"G38*Control!$D$74/(D38*Control!$D$76)","v":1.427715130203274}]
[2023,{"$f":"B38","v":11992.246575342466},15977.246575342466,5831.6949999999997,1377.4266366912868,24.684646904872043,8.3259991862307814,{"$f":"E39*Control!$D$74/(B39*Control!$D$77)","v":314.684290692682},{"$f":"F39*Control!$D$74/(C39*Control!$D$77)","v":4.2328425791938775},{"$f":"G39*Control!$D$74/(D39*Control!$D$76)","v":1.427715130203274}]
[2024,{"$f":"B39","v":11992.246575342466},{"$f":"C39","v":15977.246575342466},{"$f":"D39","v":5831.6949999999997},{"$f":"E39","v":1377.4266366912868},{"$f":"F39","v":24.684646904872043},{"$f":"G39","v":8.3259991862307814},{"$f":"H39","v":314.684290692682},{"$f":"I39","v":4.2328425791938775},{"$f":"J39","v":1.427715130203274}]
[2025,11992.246575342466,15977.246575342466,5831.6949999999997,1377.4266366912868,24.684646904872043,8.3259991862307814,314.684290692682,4.2328425791938775,1.427715130203274]
[]
["Sources for activity data"]
["Production: PSA website http://www.eia.gov/petroleum/supply/annual/volume1/pdf/table2.pdf. Field production of crude oil column "]
["Refining: PSA website http://www.eia.gov/petroleum/supply/annual/volume1/pdf/table2.pdf. Refinery and Blender Net Inputs column "]
["Transportation: Petroleum Model at ICF (PetroleumSystems_90_22_FR.xlsx, Transportation Emissions, Row 132 - Refinery Feed)"]
[]
["Sources for Emissions"]
["Petroleum Model at ICF (PetroleumSystems_90_22_FR.xlsx), CH4 Summary Tab, Converted to Gg from MMT (MMT * 1000) "]
[]
[]
["Natural Gas Well Emission Factors by Region from Natural Gas Systems 1990-2011.xls; and from the file NG EF's NEW.xls"]
["Scfd/well are converted to MTCH4/well by using the conversion that 1 scfd/well = 0.0070299 metric tons CH4/well"]
[null,"Production Emission Factors Metric Tons CH4/well"]
[null,null,1990,1991,1992,1993,1994,1995,1996,1997,1998,1999,2000,2001,2002,2003,2004,2005,2006,2007,2008,2009,2010,2011,2012,2013,2014,2015,2016,2017,2018,2019,2020,2021,2022,2023,2024,2025]
[null,"NE",{"$f":"E72","v":4.0199999999999996},{"$f":"AVERAGE(F72:F73)","v":4.0199999999999996},4.03,4.03,4.05,4.0599999999999996,4.08,4.05,4.07,{"$f":"AVERAGE(N72:N73)","v":4.09},{"$f":"AVERAGE(O72:O73)","v":4.08},{"$f":"AVERAGE(P72:P73)","v":4.08},4.09,4.0999999999999996,4.1100000000000003,4.0999999999999996,4.0999999999999996,{"$f":"AVERAGE(V72:V73)","v":4.0999999999999996},4.0999999999999996,4.0999999999999996,4.0999999999999996,4.0999999999999996,4.0999999999999996,4.0999999999999996,4.0999999999999996,4.0999999999999996,4.0999999999999996,4.0999999999999996,4.0999999999999996,4.0999999999999996,4.0999999999999996,{"$f":"AVERAGE(AJ72:AJ73)","v":4.0999999999999996},{"$f":"AVERAGE(AK72:AK73)","v":4.0999999999999996},{"$f":"AI56","v":4.0999999999999996},{"$f":"AJ56","v":4.0999999999999996},4.0999999999999996]
[null,"MC",{"$f":"E77","v":8.8800000000000008},{"$f":"AVERAGE(F77:F77)","v":8.93},8.9700000000000006,9.06,9.15,9.24,9.34,9.33,9.33,{"$f":"AVERAGE(N77:N77)","v":9.34},{"$f":"AVERAGE(O77:O77)","v":9.34},{"$f":"AVERAGE(P77:P77)","v":9.34},9.34,9.35,9.36,9.36,9.36,{"$f":"AVERAGE(V77:V77)","v":9.36},9.36,9.36,9.36,9.36,9.36,9.36,9.36,9.36,9.36,9.36,9.36,9.36,9.36,{"$f":"AVERAGE(AJ77:AJ77)","v":9.36},{"$f":"AVERAGE(AK77:AK77)","v":9.36},{"$f":"AI57","v":9.36},{"$f":"AJ57","v":9.36},9.36]
[null,"RM",{"$f":"E81","v":9.07},{"$f":"AVERAGE(F81:F81)","v":9.33},9.59,9.8800000000000008,10.16,10.45,11.88,10.81,10.82,{"$f":"AVERAGE(N81:N81)","v":10.81},{"$f":"AVERAGE(O81:O81)","v":10.78},{"$f":"AVERAGE(P81:P81)","v":10.69},10.66,10.64,10.63,10.62,10.62,{"$f":"AVERAGE(V81:V81)","v":10.62},10.62,10.62,10.62,10.62,10.62,10.62,10.62,10.62,10.62,10.62,10.62,10.62,10.62,{"$f":"AVERAGE(AJ81:AJ81)","v":10.62},{"$f":"AVERAGE(AK81:AK81)","v":10.62},10.62,10.62,10.62]
[null,"SW",{"$f":"E85","v":8.6300000000000008},{"$f":"AVERAGE(F85:F85)","v":8.98},9.9600000000000009,10.19,10.37,10.58,10.78,10.78,10.78,{"$f":"AVERAGE(N85:N85)","v":10.78},{"$f":"AVERAGE(O85:O85)","v":10.78},{"$f":"AVERAGE(P85:P85)","v":10.78},10.78,10.78,10.78,10.78,10.78,{"$f":"AVERAGE(V85:V85)","v":10.78},10.78,10.78,10.78,10.78,10.78,10.78,10.78,10.78,10.78,10.78,10.78,10.78,10.78,{"$f":"AVERAGE(AJ85:AJ85)","v":10.78},{"$f":"AVERAGE(AK85:AK85)","v":10.78},10.78,10.78,10.78]
[null,"WC",{"$f":"E89","v":10.09},{"$f":"AVERAGE(F89:F89)","v":10.46},10.83,11.2,11.57,11.94,12.31,12.31,12.31,{"$f":"AVERAGE(N89:N89)","v":12.31},{"$f":"AVERAGE(O89:O89)","v":12.31},{"$f":"AVERAGE(P89:P89)","v":12.31},12.31,12.31,12.31,12.31,12.31,{"$f":"AVERAGE(V89:V89)","v":12.31},12.31,12.31,12.31,12.31,12.31,12.31,12.31,12.31,12.31,12.31,12.31,12.31,12.31,{"$f":"AVERAGE(AJ89:AJ89)","v":12.31},{"$f":"AVERAGE(AK89:AK89)","v":12.31},12.31,12.31,12.31]
[null,"GC",{"$f":"E93","v":10.69},{"$f":"AVERAGE(F93:F93)","v":10.73},11.08,11.27,11.47,11.67,11.87,11.87,11.87,{"$f":"AVERAGE(N93:N93)","v":11.87},{"$f":"AVERAGE(O93:O93)","v":11.88},{"$f":"AVERAGE(P93:P93)","v":11.87},11.87,11.87,11.87,11.87,11.87,{"$f":"AVERAGE(V93:V93)","v":11.87},11.87,11.87,11.87,11.87,11.87,11.87,11.87,11.87,11.87,11.87,11.87,11.87,11.87,{"$f":"AVERAGE(AJ93:AJ93)","v":11.87},{"$f":"AVERAGE(AK93:AK93)","v":11.87},11.87,11.87,11.87]
[null,"Offshore"]
[null,"Shallow water",{"$f":"E96","v":8899},{"$f":"F96","v":8899},8899,8899,8899,8899,8899,8899,8899,{"$f":"N96","v":8899},8899,8899,8899,8899,8899,8899,8899,{"$f":"V96","v":8899},8899,8899,8899,8899,8899,8899,8899,8899,8899,8899,8899,8899,8899,{"$f":"AJ96","v":8899},{"$f":"AK96","v":8899},{"$f":"AI63","v":8899},{"$f":"AJ63","v":8899},8899]
[null,"Deep Water",{"$f":"E97","v":93836},93836,93836,93836,93836,93836,93836,93836,93836,93836,93836,93836,93836,93836,93836,93836,93836,93836,93836,93836,93836,93836,93836,93836,93836,93836,93836,93836,93836,93836,93836,93836,93836,{"$f":"AI64","v":93836},{"$f":"AJ64","v":93836},93836]
[]
[]
[7.0299000000000004E-3,"scfd/well conversion to tonne/well"]
["Source Hyperlink","Region","Source","Units"]
["EF",null,null,null,1990,1991,1992,1993,1994,1995,1996,1997,1998,1999,2000,2001,2002,2003,2004,2005,2006,2007,2008,2009,2010,2011,2012,2013,2014,2015,2016,2017,2018,2019,2020,2021,2022,2023,2024,2025]
[null,"North East"]
[null,null,"Gas Wells"]
["EF - 1",null,"NE - Associated Gas Wells","scfd/well",4.0199999999999996,4.0199999999999996,4.03,4.03,4.05,4.0599999999999996,4.08,4.05,4.07,4.09,4.08,4.08,4.09,4.0999999999999996,4.1100000000000003,4.0999999999999996,4.0999999999999996,{"$f":"U72","v":4.0999999999999996},{"$f":"V72","v":4.0999999999999996},4.0999999999999996,4.0999999999999996,4.0999999999999996,4.0999999999999996,4.0999999999999996,4.0999999999999996,4.0999999999999996,{"$f":"AD72","v":4.0999999999999996},{"$f":"AE72","v":4.0999999999999996},4.0999999999999996,4.0999999999999996,4.0999999999999996,{"$f":"AI72","v":4.0999999999999996},{"$f":"AJ72","v":4.0999999999999996},{"$f":"AK72","v":4.0999999999999996},{"$f":"AL72","v":4.0999999999999996},{"$f":"AM72","v":4.0999999999999996}]
[null,null,"Drilling and Well Completion"]
[]
[null,"Mid-Central"]
[null,null,"Gas Wells"]
[29,null,"MC - Associated Gas Wells","scfd/well",8.8800000000000008,8.93,8.9700000000000006,9.06,9.15,9.24,9.34,9.33,9.33,9.34,9.34,9.34,9.34,9.35,9.36,9.36,9.36,{"$f":"U77","v":9.36},{"$f":"V77","v":9.36},9.36,9.36,9.36,9.36,9.36,9.36,9.36,{"$f":"AD77","v":9.36},9.36,9.36,9.36,9.36,{"$f":"AI77","v":9.36},{"$f":"AJ77","v":9.36},{"$f":"AK77","v":9.36},{"$f":"AL77","v":9.36},{"$f":"AM77","v":9.36}]
[]
[null,"Rocky Mountain"]
[null,null,"Gas Wells"]
[57,null,"RM - Associated Gas Wells",null,9.07,9.33,9.59,9.8800000000000008,10.16,10.45,11.88,10.81,10.82,10.81,10.78,10.69,10.66,10.64,10.63,10.62,10.62,{"$f":"U81","v":10.62},{"$f":"V81","v":10.62},10.62,10.62,10.62,10.62,10.62,10.62,10.62,{"$f":"AD81","v":10.62},{"$f":"AE81","v":10.62},10.62,10.62,10.62,{"$f":"AI81","v":10.62},{"$f":"AJ81","v":10.62},{"$f":"AK81","v":10.62},{"$f":"AL81","v":10.62},{"$f":"AM81","v":10.62}]
[]
[null,"South West"]
[null,null,"Gas Wells"]
[86,null,"SW - Associated Gas Wells",null,8.6300000000000008,8.98,9.9600000000000009,10.19,10.37,10.58,10.78,10.78,10.78,10.78,10.78,10.78,10.78,10.78,10.78,10.78,10.78,{"$f":"U85","v":10.78},{"$f":"V85","v":10.78},10.78,10.78,10.78,10.78,10.78,10.78,10.78,{"$f":"AD85","v":10.78},{"$f":"AE85","v":10.78},10.78,10.78,10.78,{"$f":"AI85","v":10.78},{"$f":"AJ85","v":10.78},{"$f":"AK85","v":10.78},{"$f":"AL85","v":10.78},{"$f":"AM85","v":10.78}]
[]
[null,"West Coast"]
[null,null,"Gas Wells"]
[114,null,"WC - Associated Gas Wells",null,10.09,10.46,10.83,11.2,11.57,11.94,12.31,12.31,12.31,12.31,12.31,12.31,12.31,12.31,12.31,12.31,12.31,{"$f":"U89","v":12.31},{"$f":"V89","v":12.31},12.31,12.31,12.31,12.31,12.31,12.31,12.31,{"$f":"AD89","v":12.31},{"$f":"AE89","v":12.31},12.31,12.31,12.31,{"$f":"AI89","v":12.31},{"$f":"AJ89","v":12.31},{"$f":"AK89","v":12.31},{"$f":"AL89","v":12.31},{"$f":"AM89","v":12.31}]
[]
[null,"Gulf Coast"]
[null,null,"Gas Wells"]
[142,null,"GC - Associated Gas Wells",null,10.69,10.73,11.08,11.27,11.47,11.67,11.87,11.87,11.87,11.87,11.88,11.87,11.87,11.87,11.87,11.87,11.87,{"$f":"U93","v":11.87},{"$f":"V93","v":11.87},11.87,11.87,11.87,11.87,11.87,11.87,11.87,{"$f":"AD93","v":11.87},{"$f":"AE93","v":11.87},11.87,11.87,11.87,{"$f":"AI93","v":11.87},{"$f":"AJ93","v":11.87},{"$f":"AK93","v":11.87},{"$f":"AL93","v":11.87},{"$f":"AM93","v":11.87}]
[]
[null,"Offshore"]
[171,null,"Shallow water Gas Platforms (GoM and Pacific)","scfd/platform",8899,8899,8899,8899,8899,8899,8899,8899,8899,8899,8899,8899,8899,8899,8899,8899,8899,8899,8899,8899,8899,8899,8899,8899,8899,{"$f":"AC96","v":8899},{"$f":"AD96","v":8899},8899,8899,8899,8899,{"$f":"AI96","v":8899},{"$f":"AJ96","v":8899},{"$f":"AK96","v":8899},{"$f":"AL96","v":8899},{"$f":"AM96","v":8899}]
[172,null,"Deepwater Gas Platforms (GoM and Pacific)","scfd/platform",93836,93836,93836,93836,93836,93836,93836,93836,93836,93836,93836,93836,93836,93836,93836,93836,93836,93836,93836,93836,93836,93836,93836,93836,93836,93836,93836,93836,93836,93836,93836,93836,93836,93836,93836,93836]

{"sheet":"Production Data","index":16,"n_rows":37,"n_cols":37,"rows_kept":37,"cut":false,"hidden":false,"merged":[]}
["Oil Production ('000 barrels)"]
[null,1990,1991,1992,1993,1994,1995,1996,1997,1998,1999,2000,2001,2002,2003,2004,2005,2006,2007,2008,2009,2010,2011,2012,2013,2014,2015,2016,2017,2018,2019,2020,2021,2022,2023,2024,2025]
["AK",647309,656349,627322,577495,568951,541654,509999,472949,428850,383199,355199,351411,359382,355603,332441,315387,270481,263595,249893,235510,218904,204829,192401,187923,181130,176229,179378,180547,174801,169947,163852,159623,159611]
["AL",18538,18637,19025,18677,18345,18731,16868,14832,12398,11123,10457,9334,8636,7894,7443,7861,7539,7171,7696,7189,7155,8373,9525,10408,9831,9694,8112,6832,5887,4859,4295,4291,3820]
["AR",10386,10305,10260,9975,9568,8910,8814,8429,7998,7150,7154,7592,7252,7209,6747,6175,5948,6031,6079,5755,5733,7938,6604,6669,6775,6229,5519,5288,5004,4833,4143,4213,4445]
["AZ",121,111,94,73,65,71,84,82,78,66,59,59,63,47,54,50,55,43,54,46,37,37,52,60,56,37,8,13,10,7,5,6,6]
["CA",320868,319497,305488,293090,286060,278977,282409,285172,283627,273017,271132,260663,257898,248093,240138,230230,223015,218518,214533,207262,200370,196172,197211,198928,204766,201284,186079,173403,160658,156350,142221,136520,124727]
["CO",30453,31382,29787,29398,28613,27977,24953,25617,22364,18469,18481,16520,20522,21508,22532,23227,24501,26183,29946,30394,33068,39517,49760,66219,95661,122196,115993,129957,169160,192238,171635,153423,160149]
["FL",5675,4725,5425,5604,6093,5693,6292,6381,5971,4895,4626,4426,3634,3263,2904,2585,2360,2078,1953,696,1777,2023,2135,2174,2227,2208,1934,1923,1839,1937,1488,1490,1214]
["IL",19954,19068,19303,17406,17148,16190,15575,16115,13732,12065,12206,10092,11100,11697,10984,10207,10324,9609,9430,9099,9067,9158,9733,9539,9546,9520,8639,8313,8420,8243,7150,7057,6925]
["IN",3000,3014,3016,2761,2492,2778,2523,2430,2208,1964,2098,2022,1962,1865,1755,1727,1773,1727,1859,1803,1835,1987,2350,2399,2507,2219,1817,1779,1684,1579,1402,1523,1689]
["KS",55428,56928,53613,49625,46732,43767,41789,39835,35541,29046,34463,33942,33380,33973,33879,33620,35668,36590,39663,39466,40470,41500,43751,46846,49518,45481,37944,35825,34715,33206,28261,27905,28161]
["KY",5409,5485,5479,4595,4013,3492,3602,2988,2921,2777,3465,2969,2721,2538,2548,2535,2340,2666,2645,2609,2519,2326,3198,2305,2626,2862,2595,2477,2265,2505,2265,2464,2252]
["LA",147582,147070,143075,138673,126484,122885,132151,134134,134220,120008,105425,104610,93321,90018,83272,75199,73619,76978,72346,68967,67590,69278,71007,72215,69173,63738,57433,51548,48087,45817,36420,34286,36493]
["MI",19676,17520,15579,13799,12207,11383,10837,10053,8994,7836,7907,7375,7218,6468,5951,5734,5849,5726,6370,6258,6980,7038,7449,7790,7426,6565,5652,5571,5518,5220,4181,4591,4570]
["MO",146,149,143,135,123,120,115,114,93,92,94,91,95,87,88,86,87,80,99,106,146,118,175,199,196,149,123,116,96,85,62,60,69]
["MS",27034,27055,25182,22613,20124,19910,19509,21037,22031,17951,19844,19528,19371,19301,19242,17695,17356,20672,22104,23328,23981,24043,24137,24057,24395,24923,20386,17783,16953,16878,14166,13434,12667]
["MT",19810,19579,18482,17448,16528,16530,15919,15526,16483,14937,15428,15920,16990,19420,24718,32787,36294,34907,31596,27835,25332,24155,26494,29288,29896,28555,23177,20717,21553,22992,19082,18972,20585]
["ND",36717,35891,32894,30915,27575,29335,32317,35832,35562,32882,32719,31691,30803,29411,31152,35675,39591,44788,62322,79792,112555,152436,242354,312357,394623,429627,377817,390605,460428,517687,433563,405138,386203]
["NE",5889,5832,5474,4868,4216,3793,3541,3337,3174,2663,2957,2922,2782,2753,2506,2408,2313,2335,2394,2239,2331,2544,3025,2366,2487,2400,1983,1936,1962,1866,1673,1592,1489]
["NM",67250,70417,69972,68422,65846,64508,64479,69834,72328,64376,67198,68001,67562,66589,64517,60963,59452,59179,60155,61178,65569,71518,85551,102789,125061,148095,146634,172378,249211,336535,375419,450353,579837]
["NV",4011,3413,3721,1880,1698,1342,1058,980,799,706,621,572,553,493,463,447,426,408,436,438,426,408,368,334,316,281,277,286,255,268,196,218,219]
["NY",415,427,404,335,299,304,309,276,217,206,210,166,164,143,170,202,312,379,387,333,381,375,362,366,356,286,225,193,221,274,238,266,266]
["OH",10008,9156,9197,8282,8758,8258,8305,8593,6541,5970,6575,6051,5631,5658,5783,5658,5439,5155,5088,4890,4772,4657,5123,8038,15091,26848,21718,19755,22743,27585,23864,18812,22280]
["OK",112273,108094,101807,96625,90973,87490,85379,83364,77578,70556,69976,68531,66421,64916,63977,61262,64236,62901,67299,67174,70196,82022,100999,124371,150112,165550,155034,165480,200711,216930,172804,147837,151537]
["PA",2641,2531,2137,2036,2518,1939,1692,1321,1980,1471,1500,1620,2324,2466,2396,2460,2589,2788,2999,2967,3238,3431,4319,5303,6850,7091,6183,6461,6389,6486,5532,6253,4509]
["SD",1648,1662,1557,1500,1453,1344,1257,1335,1206,1100,1170,1255,1214,1237,1357,1394,1390,1664,1700,1664,1607,1634,1754,1850,1798,1663,1406,1304,1273,1166,1047,1028,961]
["TN",506,485,501,419,417,383,381,367,287,344,346,351,275,311,361,324,192,284,338,268,257,296,371,334,330,296,257,271,210,211,152,141,146]
["TX",678478,682616,650623,619090,590735,559646,543342,536584,504662,449233,443397,424297,405776,400664,392714,392601,392481,391261,405938,399327,426767,529813,725940,928358,1160097,1261782,1168696,1275904,1612374,1864363,1773072,1744882,1846806]
["UT",27604,24467,22720,21821,20661,19988,19401,19317,19199,16253,15636,15252,13771,13097,14744,16673,17927,19535,22039,22942,24663,26276,30210,35016,40909,37136,30528,34438,37117,36933,31001,35774,45251]
["VA",16,13,12,12,11,11,13,10,5,8,9,11,25,18,19,26,17,19,16,12,12,11,9,10,14,11,8,7,5,6,5,5,7]
["WV",2143,1963,2068,2048,1918,1948,1680,1509,1471,1471,1400,1226,1456,1481,1735,1696,1726,1992,2126,1501,1842,2146,2573,7239,10330,11572,7636,9081,12739,17256,19484,17964,15204]
["WY",103856,99928,96810,87667,79528,78884,73365,70176,64782,61126,60726,57433,54801,52970,51940,51770,52974,54116,53045,51531,53890,54515,57808,63478,76091,86456,72659,75746,87960,102165,89076,85455,90906]
["Gulf Coast (PADD 3) Crude Oil Production (Thousand Barrels)",1219071,1247848,1219046,1178566,1144925,1138908,1158802,1197018,1202022,1163910,1176723,1193844,1169338,1152741,1109290,1027420,1028473,1029263,997620,1136054,1163423,1191654,1386037,1602524,1905273,2067390,1992364,2143439,2579485,2965928,2817695,2874587,3115721]
["Federal Offshore (PADD 3) Crude Oil Production (Thousand Barrels)",269804,291755,300909,301118,313822,344318,373644,412168,448388,494064,523250,560485,567420,561065,535355,466926,472078,467971,423301,570309,566628,480692,463272,458027,509941,552929,585583,613707,641970,692644,610181,623127,631653]
["Gulf Coast (PADD 3) Crude Oil Field Production Adjustment (Thousand Barrels), Source: http://www.eia.gov/dnav/pet/PET_CRD_CRPDN_ADC_MBBL_A.htm"]
["Source: U.S. Crude oil field production, http://www.eia.gov/dnav/pet/PET_CRD_CRPDN_ADC_MBBL_A.htm"]

{"sheet":"Data","index":17,"n_rows":75,"n_cols":38,"rows_kept":75,"cut":false,"hidden":false,"merged":[]}
[]
[null,"Natural Gas Vented and Flared (TBtu)"]
[null,null,1990,1991,1992,1993,1994,1995,1996,1997,1998,1999,2000,2001,2002,2003,2004,2005,2006,2007,2008,2009,2010,2011,2012,2013,2014,2015,2016,2017,2018,2019,2020,2021,2022,2023,2024,2025]
[null,"Alabama",{"$f":"(C43*C40)/(10^3)","v":2135.9650000000001},{"$f":"(D43*$D$40)/(10^3)","v":2429.8440000000001},{"$f":"(E43*$E$40)/(10^3)","v":1996.89},{"$f":"(F43*$F$40)/(10^3)","v":1988.588},{"$f":"(G43*$G$40)/(10^3)","v":2928.25},{"$f":"(H43*$H$40)/(10^3)","v":3246.11},{"$f":"(I43*$I$40)/(10^3)","v":2054.9769999999999},{"$f":"(J43*$J$40)/(10^3)","v":1730.241},{"$f":"(K43*$K$40)/(10^3)","v":1621.3579999999999},{"$f":"(L43*$L$40)/(10^3)","v":1201.095},{"$f":"(M43*$M$40)/(10^3)","v":1397.0340000000001},{"$f":"(N43*$N$40)/(10^3)","v":1148.095},{"$f":"(O43*$O$40)/(10^3)","v":1468.0930000000001},{"$f":"(P43*$P$40)/(10^3)","v":1776.933},{"$f":"(Q43*$Q$40)/(10^3)","v":2556.864},{"$f":"(R43*R$40)/(10^3)","v":2743.44},3888.0749999999998,2613.944,1981.1,2746.9949999999999,2873.4659999999999,{"$f":"(X43*X$40)/(10^3)","v":3986.7220000000002},{"$f":"(Y43*Y$40)/(10^3)","v":0},0,0,0,0,0,{"$f":"(AE43*AE$40)/(10^3)","v":0},{"$f":"(AF43*AF$40)/(10^3)","v":0},{"$f":"(AG43*AG$40)/(10^3)","v":0},{"$f":"(AH43*AH$40)/(10^3)","v":0},{"$f":"(AI43*AI$40)/(10^3)","v":0}]
[null,"Alaska",{"$f":"(C44*$C$40)/(10^3)","v":11853.334999999999},11948.672,15647.67,24868.41,14630.2,9662.0159999999996,7840.63,9153.7829999999994,9061.6389999999992,7857.4859999999999,8353.4220000000005,8493.0300000000007,8065.1360000000004,6998.5349999999999,6721.152,{"$f":"(R44*$R$40)/(10^3)","v":7097.616},{"$f":"(S44*S$40)/(10^3)","v":7858.875},7116.7160000000003,{"$f":"(U44*U$40)/(10^3)","v":11025.3},7135.5810000000001,11169.954,12523.172,12839.978999999999,{"$f":"(Z44*Z$40)/(10^3)","v":7948.1189999999997},7314.2640000000001,{"$f":"(AB44*AB$40)/(10^3)","v":6052.74},9634.2479999999996,8586.0450000000001,{"$f":"(AE44*AE$40)/(10^3)","v":9310.14},8262.7199999999993,{"$f":"(AG44*AG$40)/(10^3)","v":6534.5150000000003},6840.4740000000002,{"$f":"(AI44*AI$40)/(10^3)","v":8172.8370000000004}]
[null,"Arizona",24.31,62.048000000000002,25.53,23.225999999999999,8.84,0,0,1.107,0,0,0,0,0,0,0,0,0,0,0,0,0,0,0,0,0,0,0,0,{"$f":"(AE45*AE$40)/(10^3)","v":0},0,{"$f":"(AG45*AG$40)/(10^3)","v":0},0,{"$f":"(AI45*AI$40)/(10^3)","v":0}]
[null,"Arkansas",313.82,230.464,411.81,452.35399999999998,345.86500000000001,346.178,299.43,148.33799999999999,49.905000000000001,6647.5349999999999,228.042,476.255,276.85300000000001,390.46199999999999,266.06400000000002,266.06400000000002,13.236000000000001,12.122,125.4,155.24100000000001,466.65,564.14800000000002,0,0,0,0,0,0,{"$f":"(AE46*AE$40)/(10^3)","v":0},0,{"$f":"(AG46*AG$40)/(10^3)","v":0},0,{"$f":"(AI46*AI$40)/(10^3)","v":0}]
[null,"California",1374.62,1583.3320000000001,833.61,641.48,917.15,1382.5,1406.212,1760.13,2164.768,1513.269,2446.4699999999998,1897.2850000000001,2967.07,4345.82,3549.36,2340.48,1722.886,2070.6579999999999,2339.6999999999998,2753.6010000000001,3063.42,2768.2080000000001,0,0,0,0,0,0,{"$f":"(AE47*AE$40)/(10^3)","v":0},0,{"$f":"(AG47*AG$40)/(10^3)","v":1780.4749999999999},1725.876,{"$f":"(AI47*AI$40)/(10^3)","v":1762.566}]
[null,"Colorado",5214.4949999999999,3202.12,2073.48,2238.5439999999999,2735.98,1670.06,1364.07,2411.0459999999998,1379.596,887.81399999999996,891.13499999999999,1003.34,1031.3050000000001,1238.6690000000001,1278.432,1341.36,1423.973,1468.9659999999999,1651.1,1553.511,1363.7159999999999,1474.3219999999999,0,0,0,0,2955.36,4830.991,{"$f":"(AE48*AE$40)/(10^3)","v":6827.8140000000003},4878.0600000000004,{"$f":"(AG48*AG$40)/(10^3)","v":3485.38},1894.338,{"$f":"(AI48*AI$40)/(10^3)","v":650.33399999999995}]
[null,"Florida",316.02999999999997,534.05600000000004,271.95,226.73,243.1,30.968,0,0,0,0,0,0,0,0,0,0,0,0,0,0,0,0,0,0,0,0,0,0,{"$f":"(AE49*AE$40)/(10^3)","v":0},0,{"$f":"(AG49*AG$40)/(10^3)","v":0},0,{"$f":"(AI49*AI$40)/(10^3)","v":0}]
[null,"Illinois",0,0,0,0,0,0,0,0,0,0,0,0,0,0,0,0,0,0,0,0,0,0,0,0,0,0,0,0,{"$f":"(AE50*AE$40)/(10^3)","v":0},0,{"$f":"(AG50*AG$40)/(10^3)","v":0},0,{"$f":"(AI50*AI$40)/(10^3)","v":0}]
[null,"Indiana",0,0,0,0,0,0,0,0,0,0,0,0,0,0,0,0,0,0,0,0,0,0,0,0,0,0,0,0,{"$f":"(AE51*AE$40)/(10^3)","v":0},0,{"$f":"(AG51*AG$40)/(10^3)","v":0},0,{"$f":"(AI51*AI$40)/(10^3)","v":0}]
[null,"Kansas",615.48500000000001,695.82399999999996,712.62,741.02,790.07500000000005,799.63800000000003,794.04399999999998,752.76,670.94500000000005,614.38499999999999,583.38900000000001,531.505,502.96800000000002,463.26,439.392,417.31200000000001,402.59500000000003,400.02600000000001,410.3,388.65300000000002,354.654,350.59399999999999,0,0,0,0,0,0,{"$f":"(AE52*AE$40)/(10^3)","v":0},0,{"$f":"(AG52*AG$40)/(10^3)","v":0},0,{"$f":"(AI52*AI$40)/(10^3)","v":0}]
[null,"Kentucky",0,0,0,0,0,0,0,0,0,0,0,0,0,0,0,0,0,0,0,0,0,0,0,0,0,0,0,0,{"$f":"(AE53*AE$40)/(10^3)","v":0},0,{"$f":"(AG53*AG$40)/(10^3)","v":0},0,{"$f":"(AI53*AI$40)/(10^3)","v":0}]
[null,"Louisiana",22829.3,22619.82,22797.18,21655.48,21756.345000000001,20714.274000000001,24070.845000000001,24274.295999999998,21673.187000000002,23810.463,22434.462,12983.75,12085.571,10239.148999999999,5536.56,5771.7120000000004,7351.4949999999999,7158.5919999999996,4423.1000000000004,4773.9359999999997,5026.6440000000002,7196.884,0,4307.1120000000001,5140.2960000000003,4256.5879999999997,5759.5680000000002,6026.6019999999999,{"$f":"(AE54*AE$40)/(10^3)","v":6765.4440000000004},5815.14,{"$f":"(AG54*AG$40)/(10^3)","v":5142.1949999999997},4009.8539999999998,{"$f":"(AI54*AI$40)/(10^3)","v":4384.5839999999998}]
[null,"Maryland",0,0,0,0,0,0,0,0,0,0,0,0,0,0,0,0,0,0,0,0,0,0,0,0,0,0,0,0,{"$f":"(AE55*AE$40)/(10^3)","v":0},0,{"$f":"(AG55*AG$40)/(10^3)","v":0},0,{"$f":"(AI55*AI$40)/(10^3)","v":0}]
[null,"Michigan",3673.02,3682.9920000000002,3689.64,3676.3440000000001,3673.02,3676.3440000000001,3686.3159999999998,3679.6680000000001,3686.3159999999998,3679.6680000000001,3679.6680000000001,3673.02,3666.3719999999998,3666.3719999999998,3669.6959999999999,3669.6959999999999,3666.3719999999998,3663.0479999999998,3656.4,3659.7240000000002,3649.752,3796.0079999999998,0,0,0,0,0,0,{"$f":"(AE56*AE$40)/(10^3)","v":0},0,{"$f":"(AG56*AG$40)/(10^3)","v":0},0,{"$f":"(AI56*AI$40)/(10^3)","v":0}]
[null,"Mississippi",4008.94,3101.2919999999999,3414.36,2457.5320000000002,2130.44,2470.8040000000001,2968.7930000000001,3035.3939999999998,3102.982,3038.7150000000001,2742.0390000000002,3271.9050000000002,3603.5010000000002,3861.6030000000001,4208.4480000000003,4354.1760000000004,5046.2250000000004,6511.7179999999998,8254.4,8670.375,9536.1299999999992,10955.206,0,0,0,0,0,0,{"$f":"(AE57*AE$40)/(10^3)","v":0},0,{"$f":"(AG57*AG$40)/(10^3)","v":0},0,{"$f":"(AI57*AI$40)/(10^3)","v":0}]
[null,"Missouri",0,0,0,0,0,0,0,0,0,0,0,0,0,0,0,0,0,0,0,0,0,0,0,{"$f":"(Z58*Z$40)/(10^3)","v":0},{"$f":"(AA58*AA$40)/(10^3)","v":0},0,0,0,{"$f":"(AE58*AE$40)/(10^3)","v":0},0,{"$f":"(AG58*AG$40)/(10^3)","v":0},0,{"$f":"(AI58*AI$40)/(10^3)","v":0}]
[null,"Montana",979.03,855.37599999999998,846.93,838.34799999999996,608.85500000000002,461.202,660.96400000000006,1239.8399999999999,1412.866,350.91899999999998,540.21600000000001,446.42,384.947,444.50900000000001,1182.384,694.41600000000005,1293.819,4100.5420000000004,7549.3,7708.1009999999997,6282.7560000000003,5570.6760000000004,0,0,0,7737.616,4753.3919999999998,3523.6089999999999,{"$f":"(AE59*AE$40)/(10^3)","v":4014.36},5788.92,{"$f":"(AG59*AG$40)/(10^3)","v":4431.1499999999996},3582.3960000000002,{"$f":"(AI59*AI$40)/(10^3)","v":3452.7449999999999}]
[null,"Nebraska",0,0,0,0,0,0,0,0,0,0,0,0,5.5149999999999997,13.236000000000001,25.391999999999999,32.015999999999998,18.751000000000001,5.51,2.2000000000000002,9.9090000000000007,26.352,23.981999999999999,0,0,0,0,0,0,{"$f":"(AE60*AE$40)/(10^3)","v":0},0,{"$f":"(AG60*AG$40)/(10^3)","v":0},0,{"$f":"(AI60*AI$40)/(10^3)","v":0}]
[null,"Nevada",0,0,0,0,0,0,0,0,0,0,0,0,0,0,0,0,0,0,0,0,0,0,0,0,0,0,0,0,{"$f":"(AE61*AE$40)/(10^3)","v":0},0,{"$f":"(AG61*AG$40)/(10^3)","v":0},0,{"$f":"(AI61*AI$40)/(10^3)","v":0}]
[null,"New Mexico",1855.2950000000001,1512.42,1804.86,1748.586,2169.1149999999998,2371.2640000000001,2994.3,3084.1019999999999,2964.357,3005.5050000000001,3464.91,3597.88,3142.4470000000001,2588.741,3891.6,3900.4319999999998,3164.5070000000001,1023.758,883.3,529.58100000000002,1741.4280000000001,4979.12,13374.569,23179.352999999999,21336.804,27931.4,28967.040000000001,19750.725999999999,{"$f":"(AE62*AE$40)/(10^3)","v":42426.341999999997},42515.16,{"$f":"(AG62*AG$40)/(10^3)","v":25802.575000000001},19799.441999999999,{"$f":"(AI62*AI$40)/(10^3)","v":23983.077000000001}]
[null,"New York",414.375,1.1080000000000001,14.43,15.484,12.154999999999999,0,3.327,5.5350000000000001,5.5449999999999999,5.5350000000000001,0,0,0,0,0,0,0,0,0,0,0,0,0,0,0,0,0,0,{"$f":"(AE63*AE$40)/(10^3)","v":0},0,{"$f":"(AG63*AG$40)/(10^3)","v":0},0,{"$f":"(AI63*AI$40)/(10^3)","v":0}]
[null,"North Dakota",4024.41,2884.1239999999998,2438.67,2584.7220000000002,2753.66,4755.8,3279.3130000000001,3912.1379999999999,4847.4390000000003,2981.1509999999998,3642.03,3498.43,3078.473,2283.21,2426.5920000000001,3599.04,8228.3799999999992,11571,28270,29590.475999999999,26991.036,56702.584000000003,86804.323999999993,113243.355,144764.17199999999,119779.06,79010.759999999995,99978.595000000001,{"$f":"(AE64*AE$40)/(10^3)","v":168400.13399999999},234016.92,{"$f":"(AG64*AG$40)/(10^3)","v":113964.14},87622.013999999996,{"$f":"(AI64*AI$40)/(10^3)","v":73533.702000000005}]
[null,"Ohio",0,0,0,0,0,0,0,0,0,0,0,0,0,0,0,0,0,0,0,0,0,0,0,0,0,0,0,0,{"$f":"(AE65*AE$40)/(10^3)","v":0},0,{"$f":"(AG65*AG$40)/(10^3)","v":0},0,{"$f":"(AI65*AI$40)/(10^3)","v":0}]
[null,"Oklahoma",0,0,0,0,0,0,0,0,0,0,0,0,0,0,0,0,0,0,0,0,0,0,0,0,0,0,0,0,{"$f":"(AE66*AE$40)/(10^3)","v":0},0,{"$f":"(AG66*AG$40)/(10^3)","v":0},0,{"$f":"(AI66*AI$40)/(10^3)","v":0}]
[null,"Oregon",0,0,0,0,0,0,0,0,0,0,0,0,0,0,0,0,0,0,0,0,0,0,0,0,0,0,0,0,{"$f":"(AE67*AE$40)/(10^3)","v":0},0,{"$f":"(AG67*AG$40)/(10^3)","v":0},0,{"$f":"(AI67*AI$40)/(10^3)","v":0}]
[null,"Other States",0,5660.7719999999999,6530.13,6830.6559999999999,6781.3850000000002,8223.11,8771.0810000000001,1968.2460000000001,1747.7840000000001,8373.348,2227.2840000000001,2732.665,2354.9050000000002,2721.1010000000001,2648.4960000000001,2585.5680000000002,14749.316000000001,15192.172,16174.4,17465.163,18429.93,21182.957999999999,0,0,0,15687.668,0,0,{"$f":"(AE68*AE$40)/(10^3)","v":7.9379999999999997},0,{"$f":"(AG68*AG$40)/(10^3)","v":0},0,{"$f":"(AI68*AI$40)/(10^3)","v":0}]
[null,"Pennsylvania",0,0,0,0,0,0,0,0,0,0,0,0,0,0,0,0,0,0,0,0,0,0,0,0,0,0,0,0,{"$f":"(AE69*AE$40)/(10^3)","v":0},0,{"$f":"(AG69*AG$40)/(10^3)","v":0},0,{"$f":"(AI69*AI$40)/(10^3)","v":0}]
[null,"South Dakota",4031.04,5367.152,6078.36,6339.5919999999996,6414.5249999999996,7876.9319999999998,8468.3240000000005,1814.373,1692.3340000000001,1721.385,1999.242,2257.5149999999999,2073.64,2316.3000000000002,2357.04,2286.384,2129.893,2399.0540000000001,2280.3000000000002,2378.16,2345.328,2421.04,0,0,0,15687.668,0,0,{"$f":"(AE70*AE$40)/(10^3)","v":0},0,{"$f":"(AG70*AG$40)/(10^3)","v":0},0,{"$f":"(AI70*AI$40)/(10^3)","v":0}]
[null,"Tennessee",0,0,0,0,0,0,0,0,0,0,0,0,0,0,0,0,0,0,0,0,0,0,0,0,0,0,0,0,{"$f":"(AE71*AE$40)/(10^3)","v":0},0,{"$f":"(AG71*AG$40)/(10^3)","v":0},0,{"$f":"(AI71*AI$40)/(10^3)","v":0}]
[null,"Texas",31212.935000000001,33946.904000000002,21854.79,38141.516000000003,46450.885000000002,51078.398000000001,50328.637999999999,53049.654000000002,28777.440999999999,39492.224999999999,35435.07,29639.415000000001,30199.037,26230.442999999999,29749.488000000001,42674.016000000003,47615.406999999999,40423.563999999998,46795.1,45398.633999999998,43446.762000000002,40253.216,51855.23,83800.413,100579.5,127895.46400000001,98730.456000000006,109452.034,{"$f":"(AE72*AE$40)/(10^3)","v":269953.23599999998},286352.03999999998,{"$f":"(AG72*AG$40)/(10^3)","v":143509.72},117197.982,{"$f":"(AI72*AI$40)/(10^3)","v":114553.00199999999}]
[null,"Utah",1478.49,1800.5,1425.24,2381.2179999999998,3716.1149999999998,38786.313999999998,30250.192999999999,18586.53,21475.785,15315.344999999999,2148.6869999999999,{"$f":"(N73*$N$40)/(10^3)","v":2040.9349999999999},1053.365,777.61500000000001,759.55200000000002,656.88,645.255,1107.51,1413.5,1539.1980000000001,2283.84,2004.21,0,0,0,0,0,0,{"$f":"(AE73*AE$40)/(10^3)","v":0},1076.1600000000001,{"$f":"(AG73*AG$40)/(10^3)","v":681.27499999999998},606.23400000000004,{"$f":"(AI73*AI$40)/(10^3)","v":1191.5129999999999}]
[null,"West Virginia",0,0,0,0,0,0,0,0,0,0,0,0,0,0,0,0,0,0,0,0,0,0,0,0,0,0,0,0,{"$f":"(AE74*AE$40)/(10^3)","v":0},0,{"$f":"(AG74*AG$40)/(10^3)","v":0},0,{"$f":"(AI74*AI$40)/(10^3)","v":0}]
[null,"Wyoming",69853.679999999993,91802.232000000004,99606.96,139756.372,140027.81,164485.42600000001,161306.26800000001,155142.72899999999,9660.4989999999998,9965.2139999999999,11009.115,8245.51,13628.668,18403.555,18600.191999999999,34401.743999999999,34922.082999999999,52656.866000000002,46580.6,46825.53,46226.898000000001,65905.962,49563.038999999997,38118.822,30377.52,3903.652,13096.08,20792.793000000001,{"$f":"(AE75*AE$40)/(10^3)","v":10158.371999999999},9886.08,{"$f":"(AG75*AG$40)/(10^3)","v":69175.175000000003},75340.331999999995,{"$f":"(AI75*AI$40)/(10^3)","v":67417.574999999997}]
[]
[null,"Thermal Conversion Factors (Btu/Ft3) (Source:  Monthly Energy Review: Table A4 Approximate Heat Content of Natural Gas, 1950-2021 (Btu per Cubic Foot))"]
[null,null,1990,1991,1992,1993,1994,1995,1996,1997,1998,1999,2000,2001,2002,2003,2004,2005,2006,2007,2008,2009,2010,2011,2012,2013,2014,2015,2016,2017,2018,2019,2020,2021,2022,2023,2024,2025]
[null,"Factor",1105,1108,1110,1106,1105,1106,1109,1107,1109,1107,1107,1105,1103,1103,1104,1104,1103,1102,1100,1101,1098,1142,1091,1101,1116,1124,1128,1129,1134,1140,1145,1146,1149]
[null,"Natural Gas Vented and Flared (MMcf) (Source: EIA's Natural Gas Navigator - Gross Withdrawals and Production.  Available online at: http://www.eia.gov/dnav/ng/ng_prod_sum_a_EPG0_vgv_mmcf_a.htm"]
[null,null,1990,1991,1992,1993,1994,1995,1996,1997,1998,1999,2000,2001,2002,2003,2004,2005,2006,2007,2008,2009,2010,2011,2012,2013,2014,2015,2016,2017,2018,2019,2020,2021,2022,2023,2024,2025]
["AL","Alabama",1933,2193,1799,1798,2650,2935,1853,1563,1462,1085,1262,1039,1331,1611,2316,2485,3525,2372,1801,2495,2617,3491,0,0,0,0,0,0,0,0,0,0,0]
["AK","Alaska",10727,10784,14097,22485,13240,8736,7070,8269,8171,7098,7546,7686,7312,6345,6088,6429,7125,6458,10023,6481,10173,10966,11769,7219,6554,5385,8541,7605,8210,7248,5707,5969,7113]
["AZ","Arizona",22,56,23,21,8,0,0,1,0,0,0,0,0,0,0,0,0,0,0,0,0,0,0,0,0,0,0,0,0,0,0,0,0]
["AR","Arkansas",284,208,371,409,313,313,270,134,45,6005,206,431,251,354,241,241,12,11,114,141,425,494,0,0,0,0,0,0,0,0,0,0,0]
["CA","California",1244,1429,751,580,830,1250,1268,1590,1952,1367,2210,1717,2690,3940,3215,2120,1562,1879,2127,2501,2790,2424,0,0,0,0,0,0,0,0,1555,1506,1534]
["CO","Colorado",4719,2890,1868,2024,2476,1510,1230,2178,1244,802,805,908,935,1123,1158,1215,1291,1333,1501,1411,1242,1291,0,0,0,0,2620,4279,6021,4279,3044,1653,566]
["FL","Florida",286,482,245,205,220,28,0,0,0,0,0,0,0,0,0,0,0,0,0,0,0,0,0,0,0,0,0,0,0,0,0,0,0]
["IL","Illinois",0,0,0,0,0,0,0,0,0,0,0,0,0,0,0,0,0,0,0,0,0,0,0,0,0,0,0,0,0,0,0,0,0]
["IN","Indiana",0,0,0,0,0,0,0,0,0,0,0,0,0,0,0,0,0,0,0,0,0,0,0,0,0,0,0,0,0,0,0,0,0]
["KS","Kansas",557,628,642,670,715,723,716,680,605,555,527,481,456,420,398,378,365,363,373,353,323,307,0,0,0,0,0,0,0,0,0,0,0]
["KY","Kentucky",0,0,0,0,0,0,0,0,0,0,0,0,0,0,0,0,0,0,0,0,0,0,0,0,0,0,0,0,0,0,0,0,0]
["LA","Louisiana",20660,20415,20538,19580,19689,18729,21705,21928,19543,21509,20266,11750,10957,9283,5015,5228,6665,6496,4021,4336,4578,6302,0,3912,4606,3787,5106,5338,5966,5101,4491,3499,3816]
["MD","Maryland",0,0,0,0,0,0,0,0,0,0,0,0,0,0,0,0,0,0,0,0,0,0,0,0,0,0,0,0,0,0,0,0,0]
["MI","Michigan",3324,3324,3324,3324,3324,3324,3324,3324,3324,3324,3324,3324,3324,3324,3324,3324,3324,3324,3324,3324,3324,3324,0,0,0,0,0,0,0,0,0,0,0]
["MS","Mississippi",3628,2799,3076,2222,1928,2234,2677,2742,2798,2745,2477,2961,3267,3501,3812,3944,4575,5909,7504,7875,8685,9593,0,0,0,0,0,0,0,0,0,0,0]
["MO","Missouri",0,0,0,0,0,0,0,0,0,0,0,0,0,0,0,0,0,0,0,0,0,0,0,0,0,0,0,0,0,0,0,0,0]
["MT","Montana",886,772,763,758,551,417,596,1120,1274,317,488,404,349,403,1071,629,1173,3721,6863,7001,5722,4878,0,0,0,6884,4214,3121,3540,5078,3870,3126,3005]
["NE","Nebraska",0,0,0,0,0,0,0,0,0,0,0,0,5,12,23,29,17,5,2,9,24,21,0,0,0,0,0,0,0,0,0,0,0]
["NV","Nevada",0,0,0,0,0,0,0,0,0,0,0,0,0,0,0,0,0,0,0,0,0,0,0,0,0,0,0,0,0,0,0,0,0]
["NM","New Mexico",1679,1365,1626,1581,1963,2144,2700,2786,2673,2715,3130,3256,2849,2347,3525,3533,2869,929,803,481,1586,4360,12259,21053,19119,24850,25680,17494,37413,37294,22535,17277,20873]
["NY","New York",375,1,13,14,11,0,3,5,5,5,0,0,0,0,0,0,0,0,0,0,0,0,0,0,0,0,0,0,0,0,0,0,0]
["ND","North Dakota",3642,2603,2197,2337,2492,4300,2957,3534,4371,2693,3290,3166,2791,2070,2198,3260,7460,10500,25700,26876,24582,49652,79564,102855,129717,106565,70045,88555,148501,205278,99532,76459,63998]
["OH","Ohio",0,0,0,0,0,0,0,0,0,0,0,0,0,0,0,0,0,0,0,0,0,0,0,0,0,0,0,0,0,0,0,0,0]
["OK","Oklahoma",0,0,0,0,0,0,0,0,0,0,0,0,0,0,0,0,0,0,0,0,0,0,0,0,0,0,0,0,0,0,0,0,0]
["OR","Oregon",0,0,0,0,0,0,0,0,0,0,0,0,0,0,0,0,0,0,0,0,0,0,0,0,0,0,0,0,0,0,0,0,0]
["other states","Other States",0,5109,5883,6176,6137,7435,7909,1778,1576,7564,2012,2473,2135,2467,2399,2342,13372,13786,14704,15863,16785,18549,0,0,0,13957,0,0,7,0,0,0,0]
["PA","Pennsylvania",0,0,0,0,0,0,0,0,0,0,0,0,0,0,0,0,0,0,0,0,0,0,0,0,0,0,0,0,0,0,0,0,0]
["SD","South Dakota",3648,4844,5476,5732,5805,7122,7636,1639,1526,1555,1806,2043,1880,2100,2135,2071,1931,2177,2073,2160,2136,2120,0,0,0,13957,0,0,0,0,0,0,0]
["TN","Tennessee",0,0,0,0,0,0,0,0,0,0,0,0,0,0,0,0,0,0,0,0,0,0,0,0,0,0,0,0,0,0,0,0,0]
["TX","Texas",28247,30638,19689,34486,42037,46183,45382,47922,25949,35675,32010,26823,27379,23781,26947,38654,43169,36682,42541,41234,39569,35248,47530,76113,90125,113786,87527,96946,238054,251186,125336,102267,99698]
["UT","Utah",1338,1625,1284,2153,3363,35069,27277,16790,19365,13835,1941,1847,955,705,688,595,585,1005,1285,1398,2080,1755,0,0,0,0,0,0,0,944,595,529,1037]
["WV","West Virginia",0,0,0,0,0,0,0,0,0,0,0,0,0,0,0,0,0,0,0,0,0,0,0,0,0,0,0,0,0,0,0,0,0]
["WY","Wyoming",63216,82854,89736,126362,126722,148721,145452,140147,8711,9002,9945,7462,12356,16685,16848,31161,31661,47783,42346,42530,42101,57711,45429,34622,27220,3473,11610,18417,8958,8672,60415,65742,58675]

{"sheet":"ListData","index":18,"n_rows":67,"n_cols":10,"rows_kept":67,"cut":false,"hidden":false,"merged":[]}
[null,null,null,null,"Region Code","Region"]
[null,1,{"$f":"VLOOKUP(StateID,B3:E53,3,FALSE)","v":"XX"},{"$f":"VLOOKUP(StateID,B3:E53,2,FALSE)","v":"Select a State . . ."},{"$f":"VLOOKUP(StateID,B3:E53,4,FALSE)","v":0},{"$f":"VLOOKUP(C2,$H$17:$I$67,2,FALSE)","v":{"$error":"#N/A"}},null,"Region Code","Tons CH4/Well"]
[null,1,"Select a State . . .","XX",0,null,null,1,2.7801668220797371,"Appalachian States Only (as defined in the text - WV, PA, KY, NY, MD, VA)"]
[null,2,"Alabama","AL",3,null,null,2,2.7820946386247414,"East North Central States Only (Illinois, Indiana, Michigan, Ohio, and Wisconsin)"]
[null,3,"Alaska","AK",3,null,null,3,3.7137318090564362,"Rest of the U.S.(States not covered under Appalachian or East N. Central States' Category)"]
[null,4,"Arizona","AZ",3]
[null,5,"Arkansas","AR",3]
[null,6,"California","CA",3]
[null,7,"Colorado","CO",3,null,null,"VersionNumber",2]
[null,8,"Connecticut","CT",3,null,null,"VersionDate","2025-01-31"]
[null,9,"Delaware","DE",3]
[null,10,"Florida","FL",3]
[null,11,"Georgia","GA",3]
[null,12,"Hawaii","HI",3]
[null,13,"Idaho","ID",3]
[null,14,"Illinois","IL",2,null,null,"State","Region"]
[null,15,"Indiana","IN",2,null,null,"IL","NE"]
[null,16,"Iowa","IA",3,null,null,"IN","NE"]
[null,17,"Kansas","KS",3,null,null,"KY","NE"]
[null,18,"Kentucky","KY",1,null,null,"MI","NE"]
[null,19,"Louisiana","LA",3,null,null,"NY","NE"]
[null,20,"Maine","ME",3,null,null,"OH","NE"]
[null,21,"Maryland","MD",1,null,null,"PA","NE"]
[null,22,"Massachusetts","MA",3,null,null,"TN","NE"]
[null,23,"Michigan","MI",2,null,null,"VA","NE"]
[null,24,"Minnesota","MN",3,null,null,"WV","NE"]
[null,25,"Mississippi","MS",3,null,null,"VT","NE"]
[null,26,"Missouri","MO",3,null,null,"ME","NE"]
[null,27,"Montana","MT",3,null,null,"MA","NE"]
[null,28,"Nebraska","NE",3,null,null,"NH","NE"]
[null,29,"Nevada","NV",3,null,null,"NJ","NE"]
[null,30,"New Hampshire","NH",3,null,null,"MD","NE"]
[null,31,"New Jersey","NJ",3,null,null,"WI","NE"]
[null,32,"New Mexico","NM",3,null,null,"NC","NE"]
[null,33,"New York","NY",1,null,null,"SC","NE"]
[null,34,"North Carolina","NC",3,null,null,"RI","NE"]
[null,35,"North Dakota","ND",3,null,null,"DE","NE"]
[null,36,"Ohio","OH",2,null,null,"GA","NE"]
[null,37,"Oklahoma","OK",3,null,null,"CT","NE"]
[null,38,"Oregon","OR",3,null,null,"DC","NE"]
[null,39,"Pennsylvania","PA",1,null,null,"AL","GC"]
[null,40,"Rhode Island","RI",3,null,null,"FL","GC"]
[null,41,"South Carolina","SC",3,null,null,"LA","GC"]
[null,42,"South Dakota","SD",3,null,null,"MS","GC"]
[null,43,"Tennessee","TN",3,null,null,"NM","SW"]
[null,44,"Texas","TX",3,null,null,"TX","SW"]
[null,45,"Utah","UT",3,null,null,"AR","MC"]
[null,46,"Vermont","VT",3,null,null,"KS","MC"]
[null,47,"Virginia","VA",1,null,null,"MO","MC"]
[null,48,"Washington","WA",3,null,null,"NE","MC"]
[null,49,"West Virginia","WV",1,null,null,"OK","MC"]
[null,50,"Wisconsin","WI",2,null,null,"MN","MC"]
[null,51,"Wyoming","WY",3,null,null,"IA","MC"]
[null,null,null,null,null,null,null,"AZ","RM"]
[null,null,null,null,null,null,null,"CO","RM"]
[null,null,null,null,null,null,null,"MT","RM"]
[null,null,null,null,null,null,null,"NV","RM"]
[null,null,null,null,null,null,null,"ND","RM"]
[null,null,null,null,null,null,null,"SD","RM"]
[null,null,null,null,null,null,null,"UT","RM"]
[null,null,null,null,null,null,null,"WY","RM"]
[null,null,null,null,null,null,null,"ID","RM"]
[null,null,null,null,null,null,null,"AK","WC"]
[null,null,null,null,null,null,null,"CA","WC"]
[null,null,null,null,null,null,null,"OR","WC"]
[null,null,null,null,null,null,null,"WA","WC"]
[null,null,null,null,null,null,null,"HI","WC"]

{"sheet":"Notes","index":19,"n_rows":4,"n_cols":26,"rows_kept":4,"cut":false,"hidden":false,"merged":[]}
[null,null,null,null,null,null,null,null,null,null,null,null,null,null,null,null,null,null,null,null,null,null,null,null,null,"Summary"]
[null,null,null,null,null,null,null,null,null,null,null,null,null,null,null,null,null,null,null,null,null,null,null,null,null,"$D$6"]
["Notes and Comments"]
["Use this sheet to keep a record of data sources, edits, or any other useful notes about the use of this tool."]

{"sheet":"Number of Wells","index":20,"n_rows":39,"n_cols":38,"rows_kept":39,"cut":false,"hidden":false,"merged":[]}
[]
[null,"Number of Natural Gas wells by state"]
[null,null,1990,1991,1992,1993,1994,1995,1996,1997,1998,1999,2000,2001,2002,2003,2004,2005,2006,2007,2008,2009,2010,2011,2012,2013,2014,2015,2016,2017,2018,2019,2020,2021,2022,2023,2024,2025]
["Alabama","AL",2362,3392,3350,3514,3565,3526,4105,4156,4171,4204,4359,4597,4803,5157,5526,5523,6227,6591,6860,6913,7026,6243,6203,6174,6117,6047,5980,5910,5754,5573,5387,{"$f":"AG4","v":5387},{"$f":"AH4","v":5387}]
["Alaska","AK",111,110,112,113,104,100,102,141,148,99,152,170,165,195,224,227,231,239,261,261,269,274,281,300,338,323,303,352,824,798,827,{"$f":"AG5","v":827},827]
["Arizona","AZ",5,6,6,6,6,7,7,8,8,8,9,8,7,9,6,6,7,7,6,6,5,5,4,3,6,6,3,3,0,0,0,0,0]
["Arkansas","AR",2952,2780,3500,3500,3500,3988,4020,3700,3900,3650,4000,4825,6755,7606,3460,3462,3814,4773,5592,6314,7397,8428,9012,9324,9778,9959,9796,9730,9432,9334,9043,9043,9043]
["California","CA",1162,1377,1126,1092,1261,997,978,930,847,1152,1169,1244,1232,1249,1272,1356,1451,1540,1645,1643,1580,4240,4356,4183,4211,4210,3997,3768,3631,3627,3583,3583,3583]
["Colorado","CO",5741,5562,5912,6372,7056,7017,8251,12433,13838,13838,22442,22117,23554,18774,16718,22691,20568,22949,25716,27021,28813,43792,46141,46883,46876,46268,45943,45263,37913,32482,31939,31939,31939]
[null,"Federal Offshore--Gulf of Mexico  Natural Gas Number of Gas and Gas Condensate Wells (Count)",0,0,0,0,0,0,0,0,0,0,0,3271,3245,3039,2781,2123,2419,2552,1527,1984,1852,2226,1892,1588,1377,1156,988,872,634,565,499,499,499]
[null,"FL",0,0,0,0,0,0,0,0,0,0,0,0,0,0,0,0,0,0,0,0,0,46,41,40,43,44,43,40,35,35,35,35,35]
["Illinois ","IL",356,373,382,385,390,372,370,372,185,300,280,300,225,240,251,316,316,43,45,51,50,40,40,34,36,35,36,0,0,0,0,0,0]
["Indiana","IN",1307,1334,1333,1336,1348,1347,1367,1458,1479,1498,1502,1533,1545,2291,2386,2321,2336,2350,525,563,620,914,819,921,895,899,807,0,0,0,0,0,0]
["Kansas","KS",16980,17948,18400,19472,19365,22020,21388,21500,21000,17568,15206,15357,16957,17387,18120,18946,19713,19713,17862,21243,22145,25362,25013,24802,24840,24468,23472,22740,18627,17949,17362,17362,17362]
["Kentucky","KY",11713,12169,12483,12836,13036,13311,13501,13825,14381,14750,13487,14370,14367,12900,13920,14175,15892,16563,16290,17152,17670,12708,13179,14557,19256,18698,18246,0,10516,13329,12711,12711,12711]
["Louisiana","LA",16889,15271,13512,15569,12958,14169,15295,14958,18399,16717,15700,16350,17100,16939,20734,18838,17459,18145,19213,18860,19137,19318,19345,18802,18660,18347,17774,17452,16153,15741,14867,14867,14867]
["Maryland","MD",7,7,9,7,7,7,8,8,8,8,7,7,5,7,7,7,7,7,7,7,7,7,7,7,5,5,5,1,0,0,0,0,0]
["Michigan ","MI",1438,2620,3257,5500,6000,5258,5826,6825,7000,6750,7068,7425,7700,8600,8500,8900,9200,9712,9995,10600,10100,10480,10381,10322,10246,10028,9935,9809,1891,1838,1308,1308,1308]
["Mississippi","MS",585,629,507,620,583,535,568,560,527,560,997,1143,979,427,1536,1676,1836,2315,2343,2320,1979,1703,1666,1632,1594,1566,1499,1469,1364,1331,1257,1257,1257]
["Missouri","MO",8,6,5,8,12,15,24,0,0,0,0,0,0,0,0,0,0,0,0,0,0,19,15,7,6,0,5,5,5,3,3,3,{"$f":"AH20","v":3}]
["montana","MT",2607,2802,2890,3075,2940,2918,2990,3071,3423,3634,3321,4331,4544,4539,4971,5751,6578,6925,7095,7031,6059,6615,6366,5870,5682,5651,5528,5440,5133,4976,5043,5043,5043]
["nebraska","NE",11,12,22,59,87,87,88,91,95,96,98,96,106,109,111,114,114,186,322,285,276,307,299,246,109,140,149,150,153,147,131,131,131]
["nevada","NV",0,0,0,0,0,0,5,5,4,4,4,4,4,4,4,4,4,4,0,0,0,0,0,0,1,1,0,1,0,0,0,0,0]
["new mexico","NM",17124,20021,18040,20846,23292,23510,24134,27421,28200,26007,33948,35217,35873,37100,38574,40157,41634,42644,44241,44784,44748,40231,40441,40119,40244,40578,40502,40409,39152,33130,32529,32529,32529]
["new york","NY",5525,5737,5906,5757,5884,6134,6208,5731,5903,6422,5775,5913,6496,5878,5781,5449,5985,6680,6675,6628,6736,7372,7731,7553,7619,7605,7624,7334,7192,7124,6372,6372,6372]
["north dakota","ND",103,100,104,101,104,99,108,104,99,96,94,95,100,117,117,148,200,200,194,196,188,526,451,423,398,455,454,506,923,1261,1548,1548,1548]
["ohio","OH",34586,34760,34784,34782,34731,34520,34380,34238,34098,33982,33897,33917,34593,33828,33828,33735,33945,34416,34416,34963,34931,31966,31647,30804,31060,30794,32013,30487,29633,29736,27225,27225,27225]
["oklahoma","OK",24547,28216,28902,29118,29121,29733,29733,29734,30101,21790,21507,32672,33279,34334,35612,36704,38060,38364,41921,43600,44000,51712,51472,50606,50044,49522,48595,46987,44647,42640,40360,40360,40360]
["oregon","OR",19,16,16,18,19,17,18,17,15,19,17,20,18,15,15,15,14,18,21,24,26,28,24,24,12,13,16,14,14,13,10,10,10]
["pennyslvania","PA",30300,31000,31000,31100,31150,31025,31792,32692,21576,23822,36000,40100,40830,42437,44227,46654,49750,52700,55631,57356,44500,61815,62922,61838,67621,70051,68412,68807,69430,70144,68929,68929,68929]
["south dakota","SD",54,54,38,47,55,56,61,60,59,60,71,68,69,61,61,69,69,71,71,89,102,155,159,133,128,122,105,94,88,92,91,91,91]
["tennessee","TN",690,650,600,0,0,0,0,505,460,420,380,350,400,430,280,400,330,305,285,310,230,1027,1027,1089,1006,1005,923,0,0,0,0,0,0]
["texas","TX",50867,47615,46298,47101,48654,54635,53816,56747,58736,58712,60577,63704,65779,68572,72237,74827,74265,76436,87556,93507,95014,139368,140087,140964,142292,135560,134958,130033,123928,120576,118957,118957,118957]
["utah","UT",822,913,1006,1061,1303,1127,1339,1475,1643,1978,4178,4601,3005,3220,3657,4092,4858,5197,5578,5774,6075,7603,8121,8300,8537,8583,8430,8261,7951,7625,7756,7756,7756]
["virginia","VA",819,886,1153,1426,1470,1671,1671,2046,2388,2752,3051,3521,3429,3506,3870,4132,5179,5735,6426,7303,7470,7781,7874,7956,8061,8111,8152,7980,7958,7973,7974,7974,7974]
["west virginia","WV",37500,37800,38250,33716,39830,36144,35148,31000,39072,36575,42475,42000,45000,46203,47117,49335,53003,48215,49364,50602,52498,51629,51646,50097,53060,48977,53267,52497,47717,49530,47934,47934,47934]
["wyoming","WY",2600,2821,3111,3615,3942,4196,4510,5160,5166,4950,9907,13978,15608,18154,20244,23734,25052,27350,28969,25710,26124,30653,29254,27141,26055,25297,23693,23453,21969,20494,19641,19641,19641]
[null,"Source: EIA's Natural Gas Navigator. \"Number of Producing Gas and Gas Condensate Wells\" https://www.eia.gov/dnav/ng/NG_PROD_WELLS_S1_A.htm"]
[null,"**Well count data discontinued in 2021. "]