{"text_format":"1","workbook":"xlsx","n_sheets":21,"sheets":["Control","Dataframe","Dataframe_Sum","Natural Gas - Production","Natural Gas - Transmission","Natural Gas - Distribution","Natural Gas - Venting_Flaring","Petroleum Systems","Additional Emission Sources","Summary","Tracker","Uncertainty","Gas Data Sources","Additional Data Sources","Oil Data Sources","Emission Factors","Production Data","Data","ListData","Notes","Number of Wells"],"not_rendered":{"charts":1,"images":109,"macros":1,"external_links":0,"defined_names":71,"comments":5,"pivot_tables":0},"unopened":[],"bounds":{"document_bytes":16777216,"sheet_cells":100000,"rows_first":2000,"rows_last":500,"rows_between":2000,"halvings":0,"cell_chars":16384,"cell_head_chars":4096},"cells_cut":0,"cells_raw":0,"read":"whole","date_system":"1900"}

{"sheet":"Control","index":0,"n_rows":79,"n_cols":9,"rows_kept":79,"cut":false,"hidden":false,"merged":[[27,1,30,1],[8,0,8,5],[29,2,29,3],[25,0,25,4],[0,0,0,6]]}
["State Inventory Tool - Emissions from Natural Gas and Oil Systems\nVersion 2025.2"]
["This module provides default activity data, emission factors, and other relevant metrics for 1990-2022. Emissions Factors are proxied for 2023-2025."]
[]
["1. Choose a State."]
["This is very important - it selects the correct default variables for your state."]
[]
{"$rows_left_out":74}
{"sheet":"Dataframe","index":1,"n_rows":3,"n_cols":38,"rows_kept":3,"cut":false,"hidden":true,"merged":[]}
["Emissions (MMTCO2 Eq.)","Category",1990,1991,1992,1993,1994,1995,1996,1997,1998,1999,2000,2001,2002,2003,2004,2005,2006,2007,2008,2009,2010,2011,2012,2013,2014,2015,2016,2017,2018,2019,2020,2021,2022,2023,2024,2025]
["Natural Gas","Energy - Natural Gas and Oil Systems - Natural Gas",{"$f":"Summary!C12","v":0},{"$f":"Summary!D12","v":"-"},{"$f":"Summary!E12","v":"-"},{"$f":"Summary!F12","v":"-"},{"$f":"Summary!G12","v":"-"},{"$f":"Summary!H12","v":"-"},{"$f":"Summary!I12","v":"-"},{"$f":"Summary!J12","v":"-"},{"$f":"Summary!K12","v":"-"},{"$f":"Summary!L12","v":"-"},{"$f":"Summary!M12","v":"-"},{"$f":"Summary!N12","v":"-"},{"$f":"Summary!O12","v":"-"},{"$f":"Summary!P12","v":"-"},{"$f":"Summary!Q12","v":"-"},{"$f":"Summary!R12","v":"-"},{"$f":"Summary!S12","v":"-"},{"$f":"Summary!T12","v":"-"},{"$f":"Summary!U12","v":"-"},{"$f":"Summary!V12","v":"-"},{"$f":"Summary!W12","v":"-"},{"$f":"Summary!X12","v":"-"},{"$f":"Summary!Y12","v":"-"},{"$f":"Summary!Z12","v":"-"},{"$f":"Summary!AA12","v":"-"},{"$f":"Summary!AB12","v":"-"},{"$f":"Summary!AC12","v":"-"},{"$f":"Summary!AD12","v":"-"},{"$f":"Summary!AE12","v":"-"},{"$f":"Summary!AF12","v":"-"},{"$f":"Summary!AG12","v":"-"},{"$f":"Summary!AH12","v":"-"},{"$f":"Summary!AI12","v":"-"},{"$f":"Summary!AJ12","v":"-"},{"$f":"Summary!AK12","v":"-"},{"$f":"Summary!AL12","v":"-"}]
["Oil","Energy - Natural Gas and Oil Systems - Oil",{"$f":"Summary!C13","v":0},{"$f":"Summary!D13","v":0},{"$f":"Summary!E13","v":0},{"$f":"Summary!F13","v":0},{"$f":"Summary!G13","v":0},{"$f":"Summary!H13","v":0},{"$f":"Summary!I13","v":0},{"$f":"Summary!J13","v":0},{"$f":"Summary!K13","v":0},{"$f":"Summary!L13","v":0},{"$f":"Summary!M13","v":0},{"$f":"Summary!N13","v":0},{"$f":"Summary!O13","v":0},{"$f":"Summary!P13","v":0},{"$f":"Summary!Q13","v":0},{"$f":"Summary!R13","v":0},{"$f":"Summary!S13","v":0},{"$f":"Summary!T13","v":0},{"$f":"Summary!U13","v":0},{"$f":"Summary!V13","v":0},{"$f":"Summary!W13","v":0},{"$f":"Summary!X13","v":0},{"$f":"Summary!Y13","v":0},{"$f":"Summary!Z13","v":0},{"$f":"Summary!AA13","v":0},{"$f":"Summary!AB13","v":0},{"$f":"Summary!AC13","v":0},{"$f":"Summary!AD13","v":0},{"$f":"Summary!AE13","v":0},{"$f":"Summary!AF13","v":0},{"$f":"Summary!AG13","v":0},{"$f":"Summary!AH13","v":0},{"$f":"Summary!AI13","v":0},{"$f":"Summary!AJ13","v":0},{"$f":"Summary!AK13","v":0},{"$f":"Summary!AL13","v":0}]

{"sheet":"Dataframe_Sum","index":2,"n_rows":2,"n_cols":38,"rows_kept":2,"cut":false,"hidden":true,"merged":[]}
["Emissions (MMTCO2 Eq.)","Category",1990,1991,1992,1993,1994,1995,1996,1997,1998,1999,2000,2001,2002,2003,2004,2005,2006,2007,2008,2009,2010,2011,2012,2013,2014,2015,2016,2017,2018,2019,2020,2021,2022,2023,2024,2025]
["Total","Energy - Natural Gas and Oil Systems",{"$f":"Summary!C12+Summary!C13","v":0},{"$f":"Summary!D12+Summary!D13","v":{"$error":"#VALUE!"}},{"$f":"Summary!E12+Summary!E13","v":{"$error":"#VALUE!"}},{"$f":"Summary!F12+Summary!F13","v":{"$error":"#VALUE!"}},{"$f":"Summary!G12+Summary!G13","v":{"$error":"#VALUE!"}},{"$f":"Summary!H12+Summary!H13","v":{"$error":"#VALUE!"}},{"$f":"Summary!I12+Summary!I13","v":{"$error":"#VALUE!"}},{"$f":"Summary!J12+Summary!J13","v":{"$error":"#VALUE!"}},{"$f":"Summary!K12+Summary!K13","v":{"$error":"#VALUE!"}},{"$f":"Summary!L12+Summary!L13","v":{"$error":"#VALUE!"}},{"$f":"Summary!M12+Summary!M13","v":{"$error":"#VALUE!"}},{"$f":"Summary!N12+Summary!N13","v":{"$error":"#VALUE!"}},{"$f":"Summary!O12+Summary!O13","v":{"$error":"#VALUE!"}},{"$f":"Summary!P12+Summary!P13","v":{"$error":"#VALUE!"}},{"$f":"Summary!Q12+Summary!Q13","v":{"$error":"#VALUE!"}},{"$f":"Summary!R12+Summary!R13","v":{"$error":"#VALUE!"}},{"$f":"Summary!S12+Summary!S13","v":{"$error":"#VALUE!"}},{"$f":"Summary!T12+Summary!T13","v":{"$error":"#VALUE!"}},{"$f":"Summary!U12+Summary!U13","v":{"$error":"#VALUE!"}},{"$f":"Summary!V12+Summary!V13","v":{"$error":"#VALUE!"}},{"$f":"Summary!W12+Summary!W13","v":{"$error":"#VALUE!"}},{"$f":"Summary!X12+Summary!X13","v":{"$error":"#VALUE!"}},{"$f":"Summary!Y12+Summary!Y13","v":{"$error":"#VALUE!"}},{"$f":"Summary!Z12+Summary!Z13","v":{"$error":"#VALUE!"}},{"$f":"Summary!AA12+Summary!AA13","v":{"$error":"#VALUE!"}},{"$f":"Summary!AB12+Summary!AB13","v":{"$error":"#VALUE!"}},{"$f":"Summary!AC12+Summary!AC13","v":{"$error":"#VALUE!"}},{"$f":"Summary!AD12+Summary!AD13","v":{"$error":"#VALUE!"}},{"$f":"Summary!AE12+Summary!AE13","v":{"$error":"#VALUE!"}},{"$f":"Summary!AF12+Summary!AF13","v":{"$error":"#VALUE!"}},{"$f":"Summary!AG12+Summary!AG13","v":{"$error":"#VALUE!"}},{"$f":"Summary!AH12+Summary!AH13","v":{"$error":"#VALUE!"}},{"$f":"Summary!AI12+Summary!AI13","v":{"$error":"#VALUE!"}},{"$f":"Summary!AJ12+Summary!AJ13","v":{"$error":"#VALUE!"}},{"$f":"Summary!AK12+Summary!AK13","v":{"$error":"#VALUE!"}},{"$f":"Summary!AL12+Summary!AL13","v":{"$error":"#VALUE!"}}]

{"sheet":"Natural Gas - Production","index":3,"n_rows":326,"n_cols":12,"rows_kept":326,"cut":false,"hidden":false,"merged":[]}
[null,{"$f":"\"2. Emissions from Natural Gas Production Activities in \"&ListData!D2","v":"2. Emissions from Natural Gas Production Activities in Select a State . . ."}]
[null,{"$f":"VLOOKUP(StateID,ListData!$B$3:$D$53,3,FALSE)","v":"XX"}]
[null,{"$f":"Region","v":{"$error":"#N/A"}}]
[null,"Natural Gas - Production",null,1990]
[]
[null,null,null,"Activity Data",null,"Emission Factor",null,"Metric Tons CH4",null,"MMTCO2E",null,"MMTCE"]
{"$rows_left_out":321}
{"sheet":"Natural Gas - Transmission","index":4,"n_rows":473,"n_cols":13,"rows_kept":473,"cut":false,"hidden":false,"merged":[[4,2,4,6],[4,8,4,11]]}
[null,{"$f":"\"3. Emission from Natural Gas Transmission Activities in \"&ListData!D2","v":"3. Emission from Natural Gas Transmission Activities in Select a State . . ."}]
[]
[]
[]
[null,null,"Gas Transmission Compressor Stations/Mile of Transmission Pipeline",null,null,null,null,5.9523809523809529E-3,"Gas Storage Compressor Stations/Mile of Transmission Pipeline",null,null,null,1.509442516844746E-3]
[]
{"$rows_left_out":468}
{"sheet":"Natural Gas - Distribution","index":5,"n_rows":652,"n_cols":12,"rows_kept":652,"cut":false,"hidden":false,"merged":[[4,1,4,3]]}
[null,{"$f":"\"4. Emissions from Natural Gas Distribution Activities in \"&ListData!D2","v":"4. Emissions from Natural Gas Distribution Activities in Select a State . . ."}]
[]
[]
[]
[]
[null,"Natural Gas - Distribution",null,1990]
{"$rows_left_out":647}
{"sheet":"Natural Gas - Venting_Flaring","index":6,"n_rows":254,"n_cols":14,"rows_kept":254,"cut":false,"hidden":false,"merged":[]}
[null,{"$f":"\"5. Emissions from Natural Gas Venting and Flaring Activities in \"&ListData!D2","v":"5. Emissions from Natural Gas Venting and Flaring Activities in Select a State . . ."}]
[null,{"$f":"ListData!D2","v":"Select a State . . ."}]
[]
[null,"Natural Gas - Vented and Flared",null,1990]
[]
[null,null,null,"Activity Data",null,"Emission Factor",null,"Metric Tons CO2",null,"Percent Flared",null,"MMTCO2E",null,"MMTCE"]
{"$rows_left_out":249}
{"sheet":"Petroleum Systems","index":7,"n_rows":326,"n_cols":12,"rows_kept":326,"cut":false,"hidden":false,"merged":[[2,1,2,2]]}
[null,{"$f":"\"6. Emissions from Petroleum Production, Refining, and Transportation in \"&ListData!D2","v":"6. Emissions from Petroleum Production, Refining, and Transportation in Select a State . . ."}]
[null,{"$f":"VLOOKUP(StateID,ListData!$B$3:$D$53,3,FALSE)","v":"XX"}]
[]
[null,"Petroleum Systems",null,1990]
[]
[null,null,null,"Activity Data",null,"Emission Factor",null,"Metric Tons CH4",null,"MMTCO2E",null,"MMTCE"]
{"$rows_left_out":321}
{"sheet":"Additional Emission Sources","index":8,"n_rows":37,"n_cols":44,"rows_kept":37,"cut":false,"hidden":false,"merged":[[0,12,0,39],[49,4,49,10]]}
[null,{"$f":"\"7 (OPTIONAL) Additional Emission Sources for \"&ListData!D2","v":"7 (OPTIONAL) Additional Emission Sources for Select a State . . ."}]
[]
[]
[]
[]
[]
{"$rows_left_out":32}
{"sheet":"Summary","index":9,"n_rows":51,"n_cols":38,"rows_kept":51,"cut":false,"hidden":false,"merged":[[1,2,1,12],[2,1,2,10]]}
[{"$f":"\"7. \"&ListData!D2&\" Emissions Summary\"","v":"7. Select a State . . . Emissions Summary"}]
[]
[null,{"$f":"Tracker!B14","v":"Emissions were not calculated for the following sources: Natural Gas Production, Natural Gas Flaring, Natural Gas Transmission, Natural Gas Distribution, and Oil."}]
[null,"* Additional Emission Sources will only populate if values are added (optional) to the Additional Data Input tab"]
[null,"Emissions (MMTCE)"]
[null,null,1990,1991,1992,1993,1994,1995,1996,1997,1998,1999,2000,2001,2002,2003,2004,2005,2006,2007,2008,2009,2010,2011,2012,2013,2014,2015,2016,2017,2018,2019,2020]
{"$rows_left_out":46}
{"sheet":"Tracker","index":10,"n_rows":14,"n_cols":7,"rows_kept":14,"cut":false,"hidden":true,"merged":[]}
["Sector","Sum","Not included?","Text of missing sector","\"and\"?","Punctuation","Text used"]
["Natural Gas Production",{"$f":"SUM(Summary!C20:AL20)","v":{"$error":"#N/A"}},{"$f":"IF(ISERROR(B2),TRUE,IF(B2=0,TRUE,FALSE))","v":true},{"$f":"IF(C2=TRUE,\" \"&A2,\"\")","v":" Natural Gas Production"},{"$f":"IF(AND($C$10=A2,$C$9>1),\" and\",\"\")","v":""},{"$f":"IF(C2=TRUE,IF($C$10=A2,\".\",\",\"),\"\")","v":","},{"$f":"E2&D2&F2","v":" Natural Gas Production,"}]
["Natural Gas Flaring",{"$f":"SUM(Summary!C27:AL27)","v":0},{"$f":"IF(ISERROR(B3),TRUE,IF(B3=0,TRUE,FALSE))","v":true},{"$f":"IF(C3=TRUE,\" \"&A3,\"\")","v":" Natural Gas Flaring"},{"$f":"IF(AND($C$10=A3,$C$9>1),\" and\",\"\")","v":""},{"$f":"IF(C3=TRUE,IF($C$10=A3,\".\",\",\"),\"\")","v":","},{"$f":"E3&D3&F3","v":" Natural Gas Flaring,"}]
["Natural Gas Transmission",{"$f":"SUM(Summary!C21:AL21)","v":0},{"$f":"IF(ISERROR(B4),TRUE,IF(B4=0,TRUE,FALSE))","v":true},{"$f":"IF(C4=TRUE,\" \"&A4,\"\")","v":" Natural Gas Transmission"},{"$f":"IF(AND($C$10=A4,$C$9>1),\" and\",\"\")","v":""},{"$f":"IF(C4=TRUE,IF($C$10=A4,\".\",\",\"),\"\")","v":","},{"$f":"E4&D4&F4","v":" Natural Gas Transmission,"}]
["Natural Gas Distribution",{"$f":"SUM(Summary!C22:AL22)","v":0},{"$f":"IF(ISERROR(B5),TRUE,IF(B5=0,TRUE,FALSE))","v":true},{"$f":"IF(C5=TRUE,\" \"&A5,\"\")","v":" Natural Gas Distribution"},{"$f":"IF(AND($C$10=A5,$C$9>1),\" and\",\"\")","v":""},{"$f":"IF(C5=TRUE,IF($C$10=A5,\".\",\",\"),\"\")","v":","},{"$f":"E5&D5&F5","v":" Natural Gas Distribution,"}]
["Oil",{"$f":"SUM(Summary!C23:AL23)","v":0},{"$f":"IF(ISERROR(B6),TRUE,IF(B6=0,TRUE,FALSE))","v":true},{"$f":"IF(C6=TRUE,\" \"&A6,\"\")","v":" Oil"},{"$f":"IF(AND($C$10=A6,$C$9>1),\" and\",\"\")","v":" and"},{"$f":"IF(C6=TRUE,IF($C$10=A6,\".\",\",\"),\"\")","v":"."},{"$f":"E6&D6&F6","v":" and Oil."}]
{"$rows_left_out":9}
{"sheet":"Uncertainty","index":11,"n_rows":3,"n_cols":2,"rows_kept":3,"cut":false,"hidden":false,"merged":[]}
[]
["Uncertainty Associated With Natural Gas and Oil Emissions Estimates"]
[null,"Excerpted from EIIP Guidance, Chapter 5."]

{"sheet":"Gas Data Sources","index":12,"n_rows":47,"n_cols":3,"rows_kept":47,"cut":false,"hidden":false,"merged":[[6,1,6,2],[46,1,46,2],[45,1,45,2],[43,1,43,2],[42,1,42,2],[44,1,44,2]]}
[]
[]
[]
[null,"Activity Factor for Natural Gas - Production","Recommended Source"]
[]
[null,"Total number of wells","EIA Natural Gas Navigator"]
{"$rows_left_out":42}
{"sheet":"Additional Data Sources","index":13,"n_rows":6,"n_cols":4,"rows_kept":6,"cut":false,"hidden":false,"merged":[[0,0,0,8],[5,3,5,6],[6,2,6,7]]}
["Possible Data Sources for Additional Emission Sources"]
[]
[]
[null,"Additional Emission Sources"]
[null,null,"For state-level data on additional emission sources go to:"]
[null,null,null,"https://www.epa.gov/ghgemissions/state-ghg-emissions-and-removals"]
{"$rows_left_out":1}
{"sheet":"Oil Data Sources","index":14,"n_rows":31,"n_cols":8,"rows_kept":31,"cut":false,"hidden":false,"merged":[[24,1,24,4],[30,1,30,7],[7,3,7,4],[16,2,16,4],[17,2,17,4],[23,1,23,4],[8,1,8,4],[2,3,2,4],[15,2,15,4],[14,2,14,4],[13,2,13,4],[11,2,11,4],[3,1,3,2],[3,3,3,4],[12,2,12,4],[2,1,2,2],[4,1,4,2],[5,1,5,2],[6,1,6,2],[7,1,7,2],[4,3,4,4],[5,3,5,4],[6,3,6,4]]}
[]
[]
[null,"Activity Data for Petroleum Systems",null,"Recommended Source"]
[]
[null,"All the activity data for petroleum systems ",null,"EIA's Petroleum Supply Annual (PSA)† "]
[null,"Oil Production",null,"PSA Table 14 "]
{"$rows_left_out":26}
{"sheet":"Emission Factors","index":15,"n_rows":97,"n_cols":40,"rows_kept":97,"cut":false,"hidden":false,"merged":[[3,1,3,3],[3,4,3,6],[3,7,3,9],[0,0,0,7]]}
["Note: The activity data and total emissions below are national, not state totals.  They are used to calculate the implied emission factors that can be used at the state level when more specific data is not available."]
[]
["Implied Emission Factors for Oil Activities- From PetroleumSystems_90_22_FR.xlsx"]
["Year","Activity Data",null,null,"Total Emissions (Gg/yr) from",null,null,"Implied Emissions Factor kg/1000 bbl"]
[null,"Production ('000 Barrels/day)","Refining ('000 Barrels/day)","Transportation (MMBarrels/yr)","Production ","Refining","Transportation","Production","Refining","Transportation"]
[1990,7355.3068493150686,13409.257534246575,4894.2849999999999,1626.337617803365,25.742170894170656,6.5504311947334779,{"$f":"E6*Control!$D$74/(B6*Control!$D$77)","v":605.78295265085467},{"$f":"F6*Control!$D$74/(C6*Control!$D$77)","v":5.2595377052268848},{"$f":"G6*Control!$D$74/(D6*Control!$D$76)","v":1.3383836852029414}]
{"$rows_left_out":92}
{"sheet":"Production Data","index":16,"n_rows":37,"n_cols":37,"rows_kept":37,"cut":false,"hidden":false,"merged":[]}
["Oil Production ('000 barrels)"]
[null,1990,1991,1992,1993,1994,1995,1996,1997,1998,1999,2000,2001,2002,2003,2004,2005,2006,2007,2008,2009,2010,2011,2012,2013,2014,2015,2016,2017,2018,2019,2020,2021,2022,2023,2024,2025]
["AK",647309,656349,627322,577495,568951,541654,509999,472949,428850,383199,355199,351411,359382,355603,332441,315387,270481,263595,249893,235510,218904,204829,192401,187923,181130,176229,179378,180547,174801,169947,163852,159623,159611]
["AL",18538,18637,19025,18677,18345,18731,16868,14832,12398,11123,10457,9334,8636,7894,7443,7861,7539,7171,7696,7189,7155,8373,9525,10408,9831,9694,8112,6832,5887,4859,4295,4291,3820]
["AR",10386,10305,10260,9975,9568,8910,8814,8429,7998,7150,7154,7592,7252,7209,6747,6175,5948,6031,6079,5755,5733,7938,6604,6669,6775,6229,5519,5288,5004,4833,4143,4213,4445]
["AZ",121,111,94,73,65,71,84,82,78,66,59,59,63,47,54,50,55,43,54,46,37,37,52,60,56,37,8,13,10,7,5,6,6]
{"$rows_left_out":32}
{"sheet":"Data","index":17,"n_rows":75,"n_cols":38,"rows_kept":75,"cut":false,"hidden":false,"merged":[]}
[]
[null,"Natural Gas Vented and Flared (TBtu)"]
[null,null,1990,1991,1992,1993,1994,1995,1996,1997,1998,1999,2000,2001,2002,2003,2004,2005,2006,2007,2008,2009,2010,2011,2012,2013,2014,2015,2016,2017,2018,2019,2020,2021,2022,2023,2024,2025]
[null,"Alabama",{"$f":"(C43*C40)/(10^3)","v":2135.9650000000001},{"$f":"(D43*$D$40)/(10^3)","v":2429.8440000000001},{"$f":"(E43*$E$40)/(10^3)","v":1996.89},{"$f":"(F43*$F$40)/(10^3)","v":1988.588},{"$f":"(G43*$G$40)/(10^3)","v":2928.25},{"$f":"(H43*$H$40)/(10^3)","v":3246.11},{"$f":"(I43*$I$40)/(10^3)","v":2054.9769999999999},{"$f":"(J43*$J$40)/(10^3)","v":1730.241},{"$f":"(K43*$K$40)/(10^3)","v":1621.3579999999999},{"$f":"(L43*$L$40)/(10^3)","v":1201.095},{"$f":"(M43*$M$40)/(10^3)","v":1397.0340000000001},{"$f":"(N43*$N$40)/(10^3)","v":1148.095},{"$f":"(O43*$O$40)/(10^3)","v":1468.0930000000001},{"$f":"(P43*$P$40)/(10^3)","v":1776.933},{"$f":"(Q43*$Q$40)/(10^3)","v":2556.864},{"$f":"(R43*R$40)/(10^3)","v":2743.44},3888.0749999999998,2613.944,1981.1,2746.9949999999999,2873.4659999999999,{"$f":"(X43*X$40)/(10^3)","v":3986.7220000000002},{"$f":"(Y43*Y$40)/(10^3)","v":0},0,0,0,0,0,{"$f":"(AE43*AE$40)/(10^3)","v":0},{"$f":"(AF43*AF$40)/(10^3)","v":0},{"$f":"(AG43*AG$40)/(10^3)","v":0},{"$f":"(AH43*AH$40)/(10^3)","v":0},{"$f":"(AI43*AI$40)/(10^3)","v":0}]
[null,"Alaska",{"$f":"(C44*$C$40)/(10^3)","v":11853.334999999999},11948.672,15647.67,24868.41,14630.2,9662.0159999999996,7840.63,9153.7829999999994,9061.6389999999992,7857.4859999999999,8353.4220000000005,8493.0300000000007,8065.1360000000004,6998.5349999999999,6721.152,{"$f":"(R44*$R$40)/(10^3)","v":7097.616},{"$f":"(S44*S$40)/(10^3)","v":7858.875},7116.7160000000003,{"$f":"(U44*U$40)/(10^3)","v":11025.3},7135.5810000000001,11169.954,12523.172,12839.978999999999,{"$f":"(Z44*Z$40)/(10^3)","v":7948.1189999999997},7314.2640000000001,{"$f":"(AB44*AB$40)/(10^3)","v":6052.74},9634.2479999999996,8586.0450000000001,{"$f":"(AE44*AE$40)/(10^3)","v":9310.14},8262.7199999999993,{"$f":"(AG44*AG$40)/(10^3)","v":6534.5150000000003},6840.4740000000002,{"$f":"(AI44*AI$40)/(10^3)","v":8172.8370000000004}]
[null,"Arizona",24.31,62.048000000000002,25.53,23.225999999999999,8.84,0,0,1.107,0,0,0,0,0,0,0,0,0,0,0,0,0,0,0,0,0,0,0,0,{"$f":"(AE45*AE$40)/(10^3)","v":0},0,{"$f":"(AG45*AG$40)/(10^3)","v":0},0,{"$f":"(AI45*AI$40)/(10^3)","v":0}]
{"$rows_left_out":70}
{"sheet":"ListData","index":18,"n_rows":67,"n_cols":10,"rows_kept":67,"cut":false,"hidden":false,"merged":[]}
[null,null,null,null,"Region Code","Region"]
[null,1,{"$f":"VLOOKUP(StateID,B3:E53,3,FALSE)","v":"XX"},{"$f":"VLOOKUP(StateID,B3:E53,2,FALSE)","v":"Select a State . . ."},{"$f":"VLOOKUP(StateID,B3:E53,4,FALSE)","v":0},{"$f":"VLOOKUP(C2,$H$17:$I$67,2,FALSE)","v":{"$error":"#N/A"}},null,"Region Code","Tons CH4/Well"]
[null,1,"Select a State . . .","XX",0,null,null,1,2.7801668220797371,"Appalachian States Only (as defined in the text - WV, PA, KY, NY, MD, VA)"]
[null,2,"Alabama","AL",3,null,null,2,2.7820946386247414,"East North Central States Only (Illinois, Indiana, Michigan, Ohio, and Wisconsin)"]
[null,3,"Alaska","AK",3,null,null,3,3.7137318090564362,"Rest of the U.S.(States not covered under Appalachian or East N. Central States' Category)"]
[null,4,"Arizona","AZ",3]
{"$rows_left_out":62}
{"sheet":"Notes","index":19,"n_rows":4,"n_cols":26,"rows_kept":4,"cut":false,"hidden":false,"merged":[]}
[null,null,null,null,null,null,null,null,null,null,null,null,null,null,null,null,null,null,null,null,null,null,null,null,null,"Summary"]
[null,null,null,null,null,null,null,null,null,null,null,null,null,null,null,null,null,null,null,null,null,null,null,null,null,"$D$6"]
["Notes and Comments"]
["Use this sheet to keep a record of data sources, edits, or any other useful notes about the use of this tool."]

{"sheet":"Number of Wells","index":20,"n_rows":39,"n_cols":38,"rows_kept":39,"cut":false,"hidden":false,"merged":[]}
[]
[null,"Number of Natural Gas wells by state"]
[null,null,1990,1991,1992,1993,1994,1995,1996,1997,1998,1999,2000,2001,2002,2003,2004,2005,2006,2007,2008,2009,2010,2011,2012,2013,2014,2015,2016,2017,2018,2019,2020,2021,2022,2023,2024,2025]
["Alabama","AL",2362,3392,3350,3514,3565,3526,4105,4156,4171,4204,4359,4597,4803,5157,5526,5523,6227,6591,6860,6913,7026,6243,6203,6174,6117,6047,5980,5910,5754,5573,5387,{"$f":"AG4","v":5387},{"$f":"AH4","v":5387}]
["Alaska","AK",111,110,112,113,104,100,102,141,148,99,152,170,165,195,224,227,231,239,261,261,269,274,281,300,338,323,303,352,824,798,827,{"$f":"AG5","v":827},827]
["Arizona","AZ",5,6,6,6,6,7,7,8,8,8,9,8,7,9,6,6,7,7,6,6,5,5,4,3,6,6,3,3,0,0,0,0,0]
{"$rows_left_out":33}